v {xschem version=2.9.9 file_version=1.2 }
G {}
K {}
V {}
S {}
E {}
L 4 -350 -180 -350 40 {}
L 4 750 -180 750 40 {}
L 4 1850 -180 1850 40 {}
L 4 4050 -180 4050 40 {}
L 4 5150 -180 5150 40 {}
L 4 6250 -180 6250 40 {}
L 4 7350 -180 7350 40 {}
N -1350 -80 -1330 -80 { lab=#net1}
N -1240 -80 -1220 -80 { lab=#net2}
N -1130 -80 -1110 -80 { lab=#net3}
N -1020 -80 -1000 -80 { lab=#net4}
N -910 -80 -890 -80 { lab=#net5}
N -800 -80 -780 -80 { lab=#net6}
N -690 -80 -670 -80 { lab=#net7}
N -580 -80 -560 -80 { lab=#net8}
N -470 -80 -450 -80 { lab=#net9}
N -1440 -140 -340 -140 { lab=vdd}
N -1440 -20 -340 -20 { lab=vss}
N -1440 -0 -340 -0 { lab=vss}
N -1440 -70 -1440 -20 { lab=vss}
N -1330 -70 -1330 -20 { lab=vss}
N -1220 -70 -1220 -20 { lab=vss}
N -1110 -70 -1110 -20 { lab=vss}
N -1000 -70 -1000 -20 { lab=vss}
N -890 -70 -890 -20 { lab=vss}
N -780 -70 -780 -20 { lab=vss}
N -670 -70 -670 -20 { lab=vss}
N -560 -70 -560 -20 { lab=vss}
N -450 -70 -450 -20 { lab=vss}
N -1400 -140 -1400 -110 { lab=vdd}
N -1290 -140 -1290 -110 { lab=vdd}
N -1180 -140 -1180 -110 { lab=vdd}
N -1070 -140 -1070 -110 { lab=vdd}
N -960 -140 -960 -110 { lab=vdd}
N -850 -140 -850 -110 { lab=vdd}
N -740 -140 -740 -110 { lab=vdd}
N -630 -140 -630 -110 { lab=vdd}
N -520 -140 -520 -110 { lab=vdd}
N -410 -140 -410 -110 { lab=vdd}
N -410 -50 -410 0 { lab=vss}
N -520 -50 -520 -0 { lab=vss}
N -630 -50 -630 0 { lab=vss}
N -740 -50 -740 -0 { lab=vss}
N -850 -50 -850 0 { lab=vss}
N -960 -50 -960 0 { lab=vss}
N -1070 -50 -1070 0 { lab=vss}
N -1180 -50 -1180 0 { lab=vss}
N -1290 -50 -1290 0 { lab=vss}
N -1400 -50 -1400 -0 { lab=vss}
N -30 -80 -10 -80 { lab=#net10}
N 80 -80 100 -80 { lab=#net11}
N 190 -80 210 -80 { lab=#net12}
N 300 -80 320 -80 { lab=#net13}
N 410 -80 430 -80 { lab=#net14}
N 520 -80 540 -80 { lab=#net15}
N 630 -80 650 -80 { lab=#net16}
N -340 -140 760 -140 { lab=vdd}
N -340 -20 760 -20 { lab=vss}
N -340 0 760 0 { lab=vss}
N -340 -70 -340 -20 { lab=vss}
N -230 -70 -230 -20 { lab=vss}
N -120 -70 -120 -20 { lab=vss}
N -10 -70 -10 -20 { lab=vss}
N 100 -70 100 -20 { lab=vss}
N 210 -70 210 -20 { lab=vss}
N 320 -70 320 -20 { lab=vss}
N 430 -70 430 -20 { lab=vss}
N 540 -70 540 -20 { lab=vss}
N 650 -70 650 -20 { lab=vss}
N -300 -140 -300 -110 { lab=vdd}
N -190 -140 -190 -110 { lab=vdd}
N -80 -140 -80 -110 { lab=vdd}
N 30 -140 30 -110 { lab=vdd}
N 140 -140 140 -110 { lab=vdd}
N 250 -140 250 -110 { lab=vdd}
N 360 -140 360 -110 { lab=vdd}
N 470 -140 470 -110 { lab=vdd}
N 580 -140 580 -110 { lab=vdd}
N 690 -140 690 -110 { lab=vdd}
N 690 -50 690 0 { lab=vss}
N 580 -50 580 0 { lab=vss}
N 470 -50 470 0 { lab=vss}
N 360 -50 360 0 { lab=vss}
N 250 -50 250 0 { lab=vss}
N 140 -50 140 0 { lab=vss}
N 30 -50 30 0 { lab=vss}
N -80 -50 -80 0 { lab=vss}
N -190 -50 -190 0 { lab=vss}
N -300 -50 -300 0 { lab=vss}
N 7340 -80 7360 -80 { lab=#net17}
N 7360 -80 7470 -80 { lab=#net17}
N 7520 10 7520 40 { lab=vss}
N 7360 40 7520 40 { lab=vss}
N 7360 0 7360 40 { lab=vss}
N 7360 -20 7380 -20 { lab=vss}
N 7380 -20 7380 20 { lab=vss}
N 7380 20 7510 20 { lab=vss}
N 7510 10 7510 20 { lab=vss}
N 7430 -40 7470 -40 { lab=en}
N 7360 -140 7520 -140 { lab=vdd}
N 7520 -140 7520 -130 { lab=vdd}
N 7610 -60 7700 -60 { lab=out}
N -1450 -80 -1440 -80 { lab=out}
N -1420 -20 -1420 -0 { lab=vss}
N -1450 -160 -1450 -80 { lab=out}
N -1470 -140 -1440 -140 { lab=vdd}
N -1470 0 -1440 -0 { lab=vss}
N -1450 -160 -340 -160 { lab=out}
N -340 -160 760 -160 { lab=out}
N 7360 -160 7640 -160 { lab=out}
N 7640 -160 7640 -60 { lab=out}
N 850 -80 870 -80 { lab=#net18}
N 960 -80 980 -80 { lab=#net19}
N 1070 -80 1090 -80 { lab=#net20}
N 1180 -80 1200 -80 { lab=#net21}
N 1290 -80 1310 -80 { lab=#net22}
N 1400 -80 1420 -80 { lab=#net23}
N 1510 -80 1530 -80 { lab=#net24}
N 1620 -80 1640 -80 { lab=#net25}
N 1730 -80 1750 -80 { lab=#net26}
N 760 -140 1860 -140 { lab=vdd}
N 760 -20 1860 -20 { lab=vss}
N 760 0 1860 0 { lab=vss}
N 760 -70 760 -20 { lab=vss}
N 870 -70 870 -20 { lab=vss}
N 980 -70 980 -20 { lab=vss}
N 1090 -70 1090 -20 { lab=vss}
N 1200 -70 1200 -20 { lab=vss}
N 1310 -70 1310 -20 { lab=vss}
N 1420 -70 1420 -20 { lab=vss}
N 1530 -70 1530 -20 { lab=vss}
N 1640 -70 1640 -20 { lab=vss}
N 1750 -70 1750 -20 { lab=vss}
N 800 -140 800 -110 { lab=vdd}
N 910 -140 910 -110 { lab=vdd}
N 1020 -140 1020 -110 { lab=vdd}
N 1130 -140 1130 -110 { lab=vdd}
N 1240 -140 1240 -110 { lab=vdd}
N 1350 -140 1350 -110 { lab=vdd}
N 1460 -140 1460 -110 { lab=vdd}
N 1570 -140 1570 -110 { lab=vdd}
N 1680 -140 1680 -110 { lab=vdd}
N 1790 -140 1790 -110 { lab=vdd}
N 1790 -50 1790 0 { lab=vss}
N 1680 -50 1680 0 { lab=vss}
N 1570 -50 1570 0 { lab=vss}
N 1460 -50 1460 0 { lab=vss}
N 1350 -50 1350 0 { lab=vss}
N 1240 -50 1240 0 { lab=vss}
N 1130 -50 1130 0 { lab=vss}
N 1020 -50 1020 0 { lab=vss}
N 910 -50 910 0 { lab=vss}
N 800 -50 800 0 { lab=vss}
N 760 -160 1860 -160 { lab=out}
N 3050 -80 3070 -80 { lab=#net27}
N 3160 -80 3180 -80 { lab=#net28}
N 3270 -80 3290 -80 { lab=#net29}
N 3380 -80 3400 -80 { lab=#net30}
N 3490 -80 3510 -80 { lab=#net31}
N 3600 -80 3620 -80 { lab=#net32}
N 3710 -80 3730 -80 { lab=#net33}
N 3820 -80 3840 -80 { lab=#net34}
N 3930 -80 3950 -80 { lab=#net35}
N 2960 -140 4060 -140 { lab=vdd}
N 2960 -20 4060 -20 { lab=vss}
N 2960 0 4060 0 { lab=vss}
N 2960 -70 2960 -20 { lab=vss}
N 3070 -70 3070 -20 { lab=vss}
N 3180 -70 3180 -20 { lab=vss}
N 3290 -70 3290 -20 { lab=vss}
N 3400 -70 3400 -20 { lab=vss}
N 3510 -70 3510 -20 { lab=vss}
N 3620 -70 3620 -20 { lab=vss}
N 3730 -70 3730 -20 { lab=vss}
N 3840 -70 3840 -20 { lab=vss}
N 3950 -70 3950 -20 { lab=vss}
N 3000 -140 3000 -110 { lab=vdd}
N 3110 -140 3110 -110 { lab=vdd}
N 3220 -140 3220 -110 { lab=vdd}
N 3330 -140 3330 -110 { lab=vdd}
N 3440 -140 3440 -110 { lab=vdd}
N 3550 -140 3550 -110 { lab=vdd}
N 3660 -140 3660 -110 { lab=vdd}
N 3770 -140 3770 -110 { lab=vdd}
N 3880 -140 3880 -110 { lab=vdd}
N 3990 -140 3990 -110 { lab=vdd}
N 3990 -50 3990 0 { lab=vss}
N 3880 -50 3880 0 { lab=vss}
N 3770 -50 3770 0 { lab=vss}
N 3660 -50 3660 0 { lab=vss}
N 3550 -50 3550 0 { lab=vss}
N 3440 -50 3440 0 { lab=vss}
N 3330 -50 3330 0 { lab=vss}
N 3220 -50 3220 0 { lab=vss}
N 3110 -50 3110 0 { lab=vss}
N 3000 -50 3000 0 { lab=vss}
N 2960 -160 4060 -160 { lab=out}
N 740 -80 760 -80 { lab=#net36}
N 4150 -80 4170 -80 { lab=#net37}
N 4260 -80 4280 -80 { lab=#net38}
N 4370 -80 4390 -80 { lab=#net39}
N 4480 -80 4500 -80 { lab=#net40}
N 4590 -80 4610 -80 { lab=#net41}
N 4700 -80 4720 -80 { lab=#net42}
N 4810 -80 4830 -80 { lab=#net43}
N 4920 -80 4940 -80 { lab=#net44}
N 5030 -80 5050 -80 { lab=#net45}
N 4060 -140 5160 -140 { lab=vdd}
N 4060 -20 5160 -20 { lab=vss}
N 4060 0 5160 0 { lab=vss}
N 4060 -70 4060 -20 { lab=vss}
N 4170 -70 4170 -20 { lab=vss}
N 4280 -70 4280 -20 { lab=vss}
N 4390 -70 4390 -20 { lab=vss}
N 4500 -70 4500 -20 { lab=vss}
N 4610 -70 4610 -20 { lab=vss}
N 4720 -70 4720 -20 { lab=vss}
N 4830 -70 4830 -20 { lab=vss}
N 4940 -70 4940 -20 { lab=vss}
N 5050 -70 5050 -20 { lab=vss}
N 4100 -140 4100 -110 { lab=vdd}
N 4210 -140 4210 -110 { lab=vdd}
N 4320 -140 4320 -110 { lab=vdd}
N 4430 -140 4430 -110 { lab=vdd}
N 4540 -140 4540 -110 { lab=vdd}
N 4650 -140 4650 -110 { lab=vdd}
N 4760 -140 4760 -110 { lab=vdd}
N 4870 -140 4870 -110 { lab=vdd}
N 4980 -140 4980 -110 { lab=vdd}
N 5090 -140 5090 -110 { lab=vdd}
N 5090 -50 5090 0 { lab=vss}
N 4980 -50 4980 0 { lab=vss}
N 4870 -50 4870 0 { lab=vss}
N 4760 -50 4760 0 { lab=vss}
N 4650 -50 4650 0 { lab=vss}
N 4540 -50 4540 0 { lab=vss}
N 4430 -50 4430 0 { lab=vss}
N 4320 -50 4320 0 { lab=vss}
N 4210 -50 4210 0 { lab=vss}
N 4100 -50 4100 0 { lab=vss}
N 4060 -160 5160 -160 { lab=out}
N 5250 -80 5270 -80 { lab=#net46}
N 5360 -80 5380 -80 { lab=#net47}
N 5470 -80 5490 -80 { lab=#net48}
N 5580 -80 5600 -80 { lab=#net49}
N 5690 -80 5710 -80 { lab=#net50}
N 5800 -80 5820 -80 { lab=#net51}
N 5910 -80 5930 -80 { lab=#net52}
N 6020 -80 6040 -80 { lab=#net53}
N 6130 -80 6150 -80 { lab=#net54}
N 5160 -140 6260 -140 { lab=vdd}
N 5160 -20 6260 -20 { lab=vss}
N 5160 0 6260 0 { lab=vss}
N 5160 -70 5160 -20 { lab=vss}
N 5270 -70 5270 -20 { lab=vss}
N 5380 -70 5380 -20 { lab=vss}
N 5490 -70 5490 -20 { lab=vss}
N 5600 -70 5600 -20 { lab=vss}
N 5710 -70 5710 -20 { lab=vss}
N 5820 -70 5820 -20 { lab=vss}
N 5930 -70 5930 -20 { lab=vss}
N 6040 -70 6040 -20 { lab=vss}
N 6150 -70 6150 -20 { lab=vss}
N 5200 -140 5200 -110 { lab=vdd}
N 5310 -140 5310 -110 { lab=vdd}
N 5420 -140 5420 -110 { lab=vdd}
N 5530 -140 5530 -110 { lab=vdd}
N 5640 -140 5640 -110 { lab=vdd}
N 5750 -140 5750 -110 { lab=vdd}
N 5860 -140 5860 -110 { lab=vdd}
N 5970 -140 5970 -110 { lab=vdd}
N 6080 -140 6080 -110 { lab=vdd}
N 6190 -140 6190 -110 { lab=vdd}
N 6190 -50 6190 0 { lab=vss}
N 6080 -50 6080 0 { lab=vss}
N 5970 -50 5970 0 { lab=vss}
N 5860 -50 5860 0 { lab=vss}
N 5750 -50 5750 0 { lab=vss}
N 5640 -50 5640 0 { lab=vss}
N 5530 -50 5530 0 { lab=vss}
N 5420 -50 5420 0 { lab=vss}
N 5310 -50 5310 0 { lab=vss}
N 5200 -50 5200 0 { lab=vss}
N 5160 -160 6260 -160 { lab=out}
N 4040 -80 4060 -80 { lab=#net55}
N 6350 -80 6370 -80 { lab=#net56}
N 6460 -80 6480 -80 { lab=#net57}
N 6570 -80 6590 -80 { lab=#net58}
N 6680 -80 6700 -80 { lab=#net59}
N 6790 -80 6810 -80 { lab=#net60}
N 6900 -80 6920 -80 { lab=#net61}
N 7010 -80 7030 -80 { lab=#net62}
N 7120 -80 7140 -80 { lab=#net63}
N 7230 -80 7250 -80 { lab=#net64}
N 6260 -140 7360 -140 { lab=vdd}
N 6260 -20 7360 -20 { lab=vss}
N 6260 0 7360 0 { lab=vss}
N 6260 -70 6260 -20 { lab=vss}
N 6370 -70 6370 -20 { lab=vss}
N 6480 -70 6480 -20 { lab=vss}
N 6590 -70 6590 -20 { lab=vss}
N 6700 -70 6700 -20 { lab=vss}
N 6810 -70 6810 -20 { lab=vss}
N 6920 -70 6920 -20 { lab=vss}
N 7030 -70 7030 -20 { lab=vss}
N 7140 -70 7140 -20 { lab=vss}
N 7250 -70 7250 -20 { lab=vss}
N 6300 -140 6300 -110 { lab=vdd}
N 6410 -140 6410 -110 { lab=vdd}
N 6520 -140 6520 -110 { lab=vdd}
N 6630 -140 6630 -110 { lab=vdd}
N 6740 -140 6740 -110 { lab=vdd}
N 6850 -140 6850 -110 { lab=vdd}
N 6960 -140 6960 -110 { lab=vdd}
N 7070 -140 7070 -110 { lab=vdd}
N 7180 -140 7180 -110 { lab=vdd}
N 7290 -140 7290 -110 { lab=vdd}
N 7290 -50 7290 0 { lab=vss}
N 7180 -50 7180 0 { lab=vss}
N 7070 -50 7070 0 { lab=vss}
N 6960 -50 6960 0 { lab=vss}
N 6850 -50 6850 0 { lab=vss}
N 6740 -50 6740 0 { lab=vss}
N 6630 -50 6630 0 { lab=vss}
N 6520 -50 6520 0 { lab=vss}
N 6410 -50 6410 0 { lab=vss}
N 6300 -50 6300 0 { lab=vss}
N 6260 -160 7360 -160 { lab=out}
N 6240 -80 6260 -80 { lab=#net65}
N 1950 -80 1970 -80 { lab=#net66}
N 2060 -80 2080 -80 { lab=#net67}
N 2170 -80 2190 -80 { lab=#net68}
N 2280 -80 2300 -80 { lab=#net69}
N 2390 -80 2410 -80 { lab=#net70}
N 2500 -80 2520 -80 { lab=#net71}
N 2610 -80 2630 -80 { lab=#net72}
N 2720 -80 2740 -80 { lab=#net73}
N 2830 -80 2850 -80 { lab=#net74}
N 1860 -140 2960 -140 { lab=vdd}
N 1860 -20 2960 -20 { lab=vss}
N 1860 0 2960 0 { lab=vss}
N 1860 -70 1860 -20 { lab=vss}
N 1970 -70 1970 -20 { lab=vss}
N 2080 -70 2080 -20 { lab=vss}
N 2190 -70 2190 -20 { lab=vss}
N 2300 -70 2300 -20 { lab=vss}
N 2410 -70 2410 -20 { lab=vss}
N 2520 -70 2520 -20 { lab=vss}
N 2630 -70 2630 -20 { lab=vss}
N 2740 -70 2740 -20 { lab=vss}
N 2850 -70 2850 -20 { lab=vss}
N 1900 -140 1900 -110 { lab=vdd}
N 2010 -140 2010 -110 { lab=vdd}
N 2120 -140 2120 -110 { lab=vdd}
N 2230 -140 2230 -110 { lab=vdd}
N 2340 -140 2340 -110 { lab=vdd}
N 2450 -140 2450 -110 { lab=vdd}
N 2560 -140 2560 -110 { lab=vdd}
N 2670 -140 2670 -110 { lab=vdd}
N 2780 -140 2780 -110 { lab=vdd}
N 2890 -140 2890 -110 { lab=vdd}
N 2890 -50 2890 0 { lab=vss}
N 2780 -50 2780 0 { lab=vss}
N 2670 -50 2670 0 { lab=vss}
N 2560 -50 2560 0 { lab=vss}
N 2450 -50 2450 0 { lab=vss}
N 2340 -50 2340 0 { lab=vss}
N 2230 -50 2230 0 { lab=vss}
N 2120 -50 2120 0 { lab=vss}
N 2010 -50 2010 0 { lab=vss}
N 1900 -50 1900 0 { lab=vss}
N 1860 -160 2960 -160 { lab=out}
N 1840 -80 1860 -80 { lab=#net75}
N 2940 -80 2960 -80 { lab=#net76}
N 5140 -80 5160 -80 { lab=#net77}
N -360 -80 -340 -80 { lab=#net78}
N -250 -80 -230 -80 { lab=#net79}
N -140 -80 -120 -80 { lab=#net80}
C {../Design/not_a.sym} -1400 -80 0 0 {name=x1}
C {../Design/not_a.sym} -1290 -80 0 0 {name=x2}
C {../Design/not_a.sym} -1180 -80 0 0 {name=x3}
C {opin.sym} 7700 -60 0 0 {name=p3 lab=out}
C {ipin.sym} -1470 -140 0 0 {name=p2 lab=vdd}
C {ipin.sym} -1470 0 0 0 {name=p4 lab=vss}
C {ipin.sym} 7430 -40 0 0 {name=p1 lab=en}
C {../Design/nand_a.sym} 7530 -60 0 0 {name=x100}
C {../Design/not_a.sym} -1070 -80 0 0 {name=x4}
C {../Design/not_a.sym} -960 -80 0 0 {name=x5}
C {../Design/not_a.sym} -850 -80 0 0 {name=x6}
C {../Design/not_a.sym} -740 -80 0 0 {name=x7}
C {../Design/not_a.sym} -630 -80 0 0 {name=x8}
C {../Design/not_a.sym} -520 -80 0 0 {name=x9}
C {../Design/not_a.sym} -410 -80 0 0 {name=x10}
C {../Design/not_a.sym} -300 -80 0 0 {name=x11}
C {../Design/not_a.sym} -190 -80 0 0 {name=x12}
C {../Design/not_a.sym} -80 -80 0 0 {name=x13}
C {../Design/not_a.sym} 30 -80 0 0 {name=x14}
C {../Design/not_a.sym} 140 -80 0 0 {name=x15}
C {../Design/not_a.sym} 250 -80 0 0 {name=x16}
C {../Design/not_a.sym} 360 -80 0 0 {name=x17}
C {../Design/not_a.sym} 470 -80 0 0 {name=x18}
C {../Design/not_a.sym} 580 -80 0 0 {name=x19}
C {../Design/not_a.sym} 690 -80 0 0 {name=x20}
C {../Design/not_a.sym} 800 -80 0 0 {name=x31}
C {../Design/not_a.sym} 910 -80 0 0 {name=x32}
C {../Design/not_a.sym} 1020 -80 0 0 {name=x33}
C {../Design/not_a.sym} 1130 -80 0 0 {name=x34}
C {../Design/not_a.sym} 1240 -80 0 0 {name=x35}
C {../Design/not_a.sym} 1350 -80 0 0 {name=x36}
C {../Design/not_a.sym} 1460 -80 0 0 {name=x37}
C {../Design/not_a.sym} 1570 -80 0 0 {name=x38}
C {../Design/not_a.sym} 1680 -80 0 0 {name=x39}
C {../Design/not_a.sym} 1790 -80 0 0 {name=x40}
C {../Design/not_a.sym} 3000 -80 0 0 {name=x41}
C {../Design/not_a.sym} 3110 -80 0 0 {name=x42}
C {../Design/not_a.sym} 3220 -80 0 0 {name=x43}
C {../Design/not_a.sym} 3330 -80 0 0 {name=x44}
C {../Design/not_a.sym} 3440 -80 0 0 {name=x45}
C {../Design/not_a.sym} 3550 -80 0 0 {name=x46}
C {../Design/not_a.sym} 3660 -80 0 0 {name=x47}
C {../Design/not_a.sym} 3770 -80 0 0 {name=x48}
C {../Design/not_a.sym} 3880 -80 0 0 {name=x49}
C {../Design/not_a.sym} 3990 -80 0 0 {name=x50}
C {../Design/not_a.sym} 4100 -80 0 0 {name=x51}
C {../Design/not_a.sym} 4210 -80 0 0 {name=x52}
C {../Design/not_a.sym} 4320 -80 0 0 {name=x53}
C {../Design/not_a.sym} 4430 -80 0 0 {name=x54}
C {../Design/not_a.sym} 4540 -80 0 0 {name=x55}
C {../Design/not_a.sym} 4650 -80 0 0 {name=x56}
C {../Design/not_a.sym} 4760 -80 0 0 {name=x57}
C {../Design/not_a.sym} 4870 -80 0 0 {name=x58}
C {../Design/not_a.sym} 4980 -80 0 0 {name=x59}
C {../Design/not_a.sym} 5090 -80 0 0 {name=x60}
C {../Design/not_a.sym} 5200 -80 0 0 {name=x61}
C {../Design/not_a.sym} 5310 -80 0 0 {name=x62}
C {../Design/not_a.sym} 5420 -80 0 0 {name=x63}
C {../Design/not_a.sym} 5530 -80 0 0 {name=x64}
C {../Design/not_a.sym} 5640 -80 0 0 {name=x65}
C {../Design/not_a.sym} 5750 -80 0 0 {name=x66}
C {../Design/not_a.sym} 5860 -80 0 0 {name=x67}
C {../Design/not_a.sym} 5970 -80 0 0 {name=x68}
C {../Design/not_a.sym} 6080 -80 0 0 {name=x69}
C {../Design/not_a.sym} 6190 -80 0 0 {name=x70}
C {../Design/not_a.sym} 6300 -80 0 0 {name=x71}
C {../Design/not_a.sym} 6410 -80 0 0 {name=x72}
C {../Design/not_a.sym} 6520 -80 0 0 {name=x73}
C {../Design/not_a.sym} 6630 -80 0 0 {name=x74}
C {../Design/not_a.sym} 6740 -80 0 0 {name=x75}
C {../Design/not_a.sym} 6850 -80 0 0 {name=x76}
C {../Design/not_a.sym} 6960 -80 0 0 {name=x77}
C {../Design/not_a.sym} 7070 -80 0 0 {name=x78}
C {../Design/not_a.sym} 7180 -80 0 0 {name=x79}
C {../Design/not_a.sym} 7290 -80 0 0 {name=x80}
C {../Design/not_a.sym} 1900 -80 0 0 {name=x21}
C {../Design/not_a.sym} 2010 -80 0 0 {name=x22}
C {../Design/not_a.sym} 2120 -80 0 0 {name=x23}
C {../Design/not_a.sym} 2230 -80 0 0 {name=x24}
C {../Design/not_a.sym} 2340 -80 0 0 {name=x25}
C {../Design/not_a.sym} 2450 -80 0 0 {name=x26}
C {../Design/not_a.sym} 2560 -80 0 0 {name=x27}
C {../Design/not_a.sym} 2670 -80 0 0 {name=x28}
C {../Design/not_a.sym} 2780 -80 0 0 {name=x29}
C {../Design/not_a.sym} 2890 -80 0 0 {name=x30}
