Flattening unmatched subcell sky130_fd_pr__pfet_01v8_9CZQJE in circuit layout.spice (0)(30 instances)
Equate elements:  no current cell.
Class layout.spice:  Merged 570 devices.

Subcircuit summary:
Circuit 1: layout.spice                    |Circuit 2: schematic.spice                 
-------------------------------------------|-------------------------------------------
sky130_fd_pr__pfet_01v8 (30)               |sky130_fd_pr__pfet_01v8 (4) **Mismatch**   
Number of devices: 30 **Mismatch**         |Number of devices: 4 **Mismatch**          
Number of nets: 34 **Mismatch**            |Number of nets: 4 **Mismatch**             
---------------------------------------------------------------------------------------
NET mismatches: Class fragments follow (with fanout counts):
Circuit 1: layout.spice                    |Circuit 2: schematic.spice                 

---------------------------------------------------------------------------------------
Net: m1_161_73#                            |Net: idif                                  
  sky130_fd_pr__pfet_01v8/2 = 1            |  sky130_fd_pr__pfet_01v8/(1|3) = 1        
                                           |                                           
Net: m1_161_2800#                          |Net: iout                                  
  sky130_fd_pr__pfet_01v8/2 = 1            |  sky130_fd_pr__pfet_01v8/(1|3) = 1        
                                           |                                           
Net: m1_158_4316#                          |Net: iref                                  
  sky130_fd_pr__pfet_01v8/2 = 1            |  sky130_fd_pr__pfet_01v8/2 = 4            
                                           |  sky130_fd_pr__pfet_01v8/(1|3) = 1        
                                           |                                           
Net: m1_158_5834#                          |Net: vdd                                   
  sky130_fd_pr__pfet_01v8/2 = 1            |  sky130_fd_pr__pfet_01v8/(1|3) = 5        
                                           |  sky130_fd_pr__pfet_01v8/4 = 4            
                                           |                                           
Net: m1_160_6146#                          |(no matching net)                          
  sky130_fd_pr__pfet_01v8/2 = 1            |                                           
                                           |                                           
Net: m1_159_8870#                          |(no matching net)                          
  sky130_fd_pr__pfet_01v8/2 = 1            |                                           
                                           |                                           
Net: m1_3453_71#                           |(no matching net)                          
  sky130_fd_pr__pfet_01v8/2 = 1            |                                           
                                           |                                           
Net: m1_3455_2799#                         |(no matching net)                          
  sky130_fd_pr__pfet_01v8/2 = 1            |                                           
                                           |                                           
Net: m1_3455_3109#                         |(no matching net)                          
  sky130_fd_pr__pfet_01v8/2 = 1            |                                           
                                           |                                           
Net: m1_3454_4627#                         |(no matching net)                          
  sky130_fd_pr__pfet_01v8/2 = 1            |                                           
                                           |                                           
Net: m1_3454_7353#                         |(no matching net)                          
  sky130_fd_pr__pfet_01v8/2 = 1            |                                           
                                           |                                           
Net: m1_3454_7662#                         |(no matching net)                          
  sky130_fd_pr__pfet_01v8/2 = 1            |                                           
                                           |                                           
Net: m1_6747_73#                           |(no matching net)                          
  sky130_fd_pr__pfet_01v8/2 = 1            |                                           
                                           |                                           
Net: m1_6750_2801#                         |(no matching net)                          
  sky130_fd_pr__pfet_01v8/2 = 1            |                                           
                                           |                                           
Net: m1_6748_4317#                         |(no matching net)                          
  sky130_fd_pr__pfet_01v8/2 = 1            |                                           
                                           |                                           
Net: m1_6748_4628#                         |(no matching net)                          
  sky130_fd_pr__pfet_01v8/2 = 1            |                                           
                                           |                                           
Net: m1_6747_7353#                         |(no matching net)                          
  sky130_fd_pr__pfet_01v8/2 = 1            |                                           
                                           |                                           
Net: m1_6747_8870#                         |(no matching net)                          
  sky130_fd_pr__pfet_01v8/2 = 1            |                                           
                                           |                                           
Net: m1_10043_72#                          |(no matching net)                          
  sky130_fd_pr__pfet_01v8/2 = 1            |                                           
                                           |                                           
Net: m1_10042_1592#                        |(no matching net)                          
  sky130_fd_pr__pfet_01v8/2 = 1            |                                           
                                           |                                           
Net: m1_10043_4317#                        |(no matching net)                          
  sky130_fd_pr__pfet_01v8/2 = 1            |                                           
                                           |                                           
Net: m1_10043_5835#                        |(no matching net)                          
  sky130_fd_pr__pfet_01v8/2 = 1            |                                           
                                           |                                           
Net: m1_10043_6146#                        |(no matching net)                          
  sky130_fd_pr__pfet_01v8/2 = 1            |                                           
                                           |                                           
Net: m1_10042_8871#                        |(no matching net)                          
  sky130_fd_pr__pfet_01v8/2 = 1            |                                           
                                           |                                           
Net: m1_13335_72#                          |(no matching net)                          
  sky130_fd_pr__pfet_01v8/2 = 1            |                                           
                                           |                                           
Net: m1_13336_1590#                        |(no matching net)                          
  sky130_fd_pr__pfet_01v8/2 = 1            |                                           
                                           |                                           
Net: m1_13335_3108#                        |(no matching net)                          
  sky130_fd_pr__pfet_01v8/2 = 1            |                                           
                                           |                                           
Net: m1_13335_5834#                        |(no matching net)                          
  sky130_fd_pr__pfet_01v8/2 = 1            |                                           
                                           |                                           
Net: m1_13336_7352#                        |(no matching net)                          
  sky130_fd_pr__pfet_01v8/2 = 1            |                                           
                                           |                                           
Net: m1_13336_8871#                        |(no matching net)                          
  sky130_fd_pr__pfet_01v8/2 = 1            |                                           
                                           |                                           
Net: m1_6814_4704#                         |(no matching net)                          
  sky130_fd_pr__pfet_01v8/(1|3) = 1        |                                           
                                           |                                           
Net: VDD                                   |(no matching net)                          
  sky130_fd_pr__pfet_01v8/(1|3) = 31       |                                           
  sky130_fd_pr__pfet_01v8/4 = 30           |                                           
                                           |                                           
Net: m1_210_2290#                          |(no matching net)                          
  sky130_fd_pr__pfet_01v8/(1|3) = 21       |                                           
                                           |                                           
Net: m1_3510_3500#                         |(no matching net)                          
  sky130_fd_pr__pfet_01v8/(1|3) = 7        |                                           
---------------------------------------------------------------------------------------
DEVICE mismatches: Class fragments follow (with node fanout counts):
Circuit 1: layout.spice                    |Circuit 2: schematic.spice                 

---------------------------------------------------------------------------------------
Instance: sky130_fd_pr__pfet_01v8_9CZQJE_0 |Instance: sky130_fd_pr__pfet_01v8M5        
  (1,3) = (61,21)                          |  (1,3) = (9,1)                            
  2 = 1                                    |  2 = 5                                    
  4 = 61                                   |  4 = 9                                    
                                           |                                           
Instance: sky130_fd_pr__pfet_01v8_9CZQJE_0 |Instance: sky130_fd_pr__pfet_01v8M7        
  (1,3) = (61,21)                          |  (1,3) = (9,1)                            
  2 = 1                                    |  2 = 5                                    
  4 = 61                                   |  4 = 9                                    
                                           |                                           
Instance: sky130_fd_pr__pfet_01v8_9CZQJE_0 |Instance: sky130_fd_pr__pfet_01v8M8        
  (1,3) = (61,21)                          |  (1,3) = (9,5)                            
  2 = 1                                    |  2 = 5                                    
  4 = 61                                   |  4 = 9                                    
                                           |                                           
Instance: sky130_fd_pr__pfet_01v8_9CZQJE_0 |Instance: sky130_fd_pr__pfet_01v8M1        
  (1,3) = (61,21)                          |  (1,3) = (9,9)                            
  2 = 1                                    |  2 = 5                                    
  4 = 61                                   |  4 = 9                                    
                                           |                                           
Instance: sky130_fd_pr__pfet_01v8_9CZQJE_0 |(no matching instance)                     
  (1,3) = (61,21)                          |                                           
  2 = 1                                    |                                           
  4 = 61                                   |                                           
                                           |                                           
                                           |                                           
Instance: sky130_fd_pr__pfet_01v8_9CZQJE_0 |(no matching instance)                     
  (1,3) = (61,21)                          |                                           
  2 = 1                                    |                                           
  4 = 61                                   |                                           
                                           |                                           
                                           |                                           
Instance: sky130_fd_pr__pfet_01v8_9CZQJE_0 |(no matching instance)                     
  (1,3) = (61,21)                          |                                           
  2 = 1                                    |                                           
  4 = 61                                   |                                           
                                           |                                           
                                           |                                           
Instance: sky130_fd_pr__pfet_01v8_9CZQJE_0 |(no matching instance)                     
  (1,3) = (61,61)                          |                                           
  2 = 1                                    |                                           
  4 = 61                                   |                                           
                                           |                                           
                                           |                                           
Instance: sky130_fd_pr__pfet_01v8_9CZQJE_0 |(no matching instance)                     
  (1,3) = (61,7)                           |                                           
  2 = 1                                    |                                           
  4 = 61                                   |                                           
                                           |                                           
                                           |                                           
Instance: sky130_fd_pr__pfet_01v8_9CZQJE_0 |(no matching instance)                     
  (1,3) = (61,7)                           |                                           
  2 = 1                                    |                                           
  4 = 61                                   |                                           
                                           |                                           
                                           |                                           
Instance: sky130_fd_pr__pfet_01v8_9CZQJE_0 |(no matching instance)                     
  (1,3) = (61,21)                          |                                           
  2 = 1                                    |                                           
  4 = 61                                   |                                           
                                           |                                           
                                           |                                           
Instance: sky130_fd_pr__pfet_01v8_9CZQJE_0 |(no matching instance)                     
  (1,3) = (61,21)                          |                                           
  2 = 1                                    |                                           
  4 = 61                                   |                                           
                                           |                                           
                                           |                                           
Instance: sky130_fd_pr__pfet_01v8_9CZQJE_0 |(no matching instance)                     
  (1,3) = (61,21)                          |                                           
  2 = 1                                    |                                           
  4 = 61                                   |                                           
                                           |                                           
                                           |                                           
Instance: sky130_fd_pr__pfet_01v8_9CZQJE_0 |(no matching instance)                     
  (1,3) = (61,7)                           |                                           
  2 = 1                                    |                                           
  4 = 61                                   |                                           
                                           |                                           
                                           |                                           
Instance: sky130_fd_pr__pfet_01v8_9CZQJE_0 |(no matching instance)                     
  (1,3) = (61,7)                           |                                           
  2 = 1                                    |                                           
  4 = 61                                   |                                           
                                           |                                           
                                           |                                           
Instance: sky130_fd_pr__pfet_01v8_9CZQJE_0 |(no matching instance)                     
  (1,3) = (61,1)                           |                                           
  2 = 1                                    |                                           
  4 = 61                                   |                                           
                                           |                                           
                                           |                                           
Instance: sky130_fd_pr__pfet_01v8_9CZQJE_0 |(no matching instance)                     
  (1,3) = (61,7)                           |                                           
  2 = 1                                    |                                           
  4 = 61                                   |                                           
                                           |                                           
                                           |                                           
Instance: sky130_fd_pr__pfet_01v8_9CZQJE_0 |(no matching instance)                     
  (1,3) = (61,21)                          |                                           
  2 = 1                                    |                                           
  4 = 61                                   |                                           
                                           |                                           
                                           |                                           
Instance: sky130_fd_pr__pfet_01v8_9CZQJE_0 |(no matching instance)                     
  (1,3) = (61,21)                          |                                           
  2 = 1                                    |                                           
  4 = 61                                   |                                           
                                           |                                           
                                           |                                           
Instance: sky130_fd_pr__pfet_01v8_9CZQJE_0 |(no matching instance)                     
  (1,3) = (61,21)                          |                                           
  2 = 1                                    |                                           
  4 = 61                                   |                                           
                                           |                                           
                                           |                                           
Instance: sky130_fd_pr__pfet_01v8_9CZQJE_0 |(no matching instance)                     
  (1,3) = (61,7)                           |                                           
  2 = 1                                    |                                           
  4 = 61                                   |                                           
                                           |                                           
                                           |                                           
Instance: sky130_fd_pr__pfet_01v8_9CZQJE_0 |(no matching instance)                     
  (1,3) = (61,7)                           |                                           
  2 = 1                                    |                                           
  4 = 61                                   |                                           
                                           |                                           
                                           |                                           
Instance: sky130_fd_pr__pfet_01v8_9CZQJE_0 |(no matching instance)                     
  (1,3) = (61,21)                          |                                           
  2 = 1                                    |                                           
  4 = 61                                   |                                           
                                           |                                           
                                           |                                           
Instance: sky130_fd_pr__pfet_01v8_9CZQJE_0 |(no matching instance)                     
  (1,3) = (61,21)                          |                                           
  2 = 1                                    |                                           
  4 = 61                                   |                                           
                                           |                                           
                                           |                                           
Instance: sky130_fd_pr__pfet_01v8_9CZQJE_0 |(no matching instance)                     
  (1,3) = (61,21)                          |                                           
  2 = 1                                    |                                           
  4 = 61                                   |                                           
                                           |                                           
                                           |                                           
Instance: sky130_fd_pr__pfet_01v8_9CZQJE_0 |(no matching instance)                     
  (1,3) = (61,21)                          |                                           
  2 = 1                                    |                                           
  4 = 61                                   |                                           
                                           |                                           
                                           |                                           
Instance: sky130_fd_pr__pfet_01v8_9CZQJE_0 |(no matching instance)                     
  (1,3) = (61,21)                          |                                           
  2 = 1                                    |                                           
  4 = 61                                   |                                           
                                           |                                           
                                           |                                           
Instance: sky130_fd_pr__pfet_01v8_9CZQJE_0 |(no matching instance)                     
  (1,3) = (61,21)                          |                                           
  2 = 1                                    |                                           
  4 = 61                                   |                                           
                                           |                                           
                                           |                                           
Instance: sky130_fd_pr__pfet_01v8_9CZQJE_0 |(no matching instance)                     
  (1,3) = (61,21)                          |                                           
  2 = 1                                    |                                           
  4 = 61                                   |                                           
                                           |                                           
                                           |                                           
Instance: sky130_fd_pr__pfet_01v8_9CZQJE_0 |(no matching instance)                     
  (1,3) = (61,21)                          |                                           
  2 = 1                                    |                                           
  4 = 61                                   |                                           
                                           |                                           
---------------------------------------------------------------------------------------
Netlists do not match.
The top level cell failed pin matching.
