Flattening unmatched subcell sky130_fd_pr__cap_mim_m3_1_6BP6N2 in circuit layout.spice (0)(1 instance)
Flattening unmatched subcell sky130_fd_pr__nfet_01v8_RE4H9G in circuit layout.spice (0)(1 instance)
Flattening unmatched subcell sky130_fd_pr__nfet_01v8_B8HNLY in circuit layout.spice (0)(1 instance)
Equate elements:  no current cell.
Equate elements:  no current cell.
Class layout.spice:  Merged 346 devices.

Subcircuit summary:
Circuit 1: layout.spice                    |Circuit 2: schematic.spice                 
-------------------------------------------|-------------------------------------------
sky130_fd_pr__cap_mim_m3_1 (1)             |sky130_fd_pr__cap_mim_m3_1 (1)             
sky130_fd_pr__nfet_01v8 (2)                |sky130_fd_pr__nfet_01v8 (2)                
Number of devices: 3                       |Number of devices: 3                       
Number of nets: 5                          |Number of nets: 5                          
---------------------------------------------------------------------------------------
Circuits match uniquely.
Netlists match uniquely.
Cells have no pins;  pin matching not needed.
Device classes layout.spice and schematic.spice are equivalent.
Circuits match uniquely.
