Flattening unmatched subcell sky130_fd_pr__pfet_01v8_9CZQJE in circuit layout.spice (0)(30 instances)
Equate elements:  no current cell.
Class layout.spice:  Merged 596 devices.

Subcircuit summary:
Circuit 1: layout.spice                    |Circuit 2: schematic.spice                 
-------------------------------------------|-------------------------------------------
sky130_fd_pr__pfet_01v8 (4)                |sky130_fd_pr__pfet_01v8 (4)                
Number of devices: 4                       |Number of devices: 4                       
Number of nets: 4                          |Number of nets: 4                          
---------------------------------------------------------------------------------------
Resolving automorphisms by property value.
Netlists match uniquely.
Netlists match uniquely.
Circuits match correctly.
Cells have no pins;  pin matching not needed.
Device classes layout.spice and schematic.spice are equivalent.
Circuits match uniquely.
