2.609451480865478743e+02
2.781437496185302649e+01
1.834159376144409137e+01
1.647706696510314828e+01
1.540907839775085364e+01
1.426036555290222196e+01
1.323794929504394524e+01
1.242983387947082541e+01
1.171666906356811566e+01
1.117691320419311474e+01
1.066261609077453620e+01
1.026084304809570291e+01
9.827925462722777894e+00
9.690978107452393076e+00
9.341178340911865163e+00
9.270812005996704741e+00
9.022034950256347940e+00
8.867900519371032075e+00
8.749310007095337127e+00
8.701504006385803791e+00
8.554895668029784517e+00
8.401278953552246520e+00
8.305959391593933816e+00
8.359652123451233763e+00
8.187023196220398091e+00
8.190569815635681650e+00
8.127402591705322976e+00
8.039129853248596191e+00
8.136707806587219594e+00
7.684806971549988042e+00
7.597157516479492223e+00
7.588635172843932963e+00
7.525408654212951909e+00
7.519725427627563796e+00
7.330076923370361541e+00
7.288624520301818954e+00
7.247830586433410716e+00
7.190702176094054821e+00
7.083144950866699041e+00
7.090390214920043732e+00
7.091377005577087722e+00
7.114879250526428223e+00
7.125023436546325861e+00
7.030264234542846324e+00
7.029712939262390492e+00
6.966826505661011026e+00
6.970089764595031490e+00
6.955666766166687331e+00
6.939432926177978800e+00
6.924913434982300053e+00
