4.638873751449584688e+02
3.269792657852173079e+01
1.860987714767455969e+01
1.665670529365539565e+01
1.552856634140014691e+01
1.468340995788574155e+01
1.375828772544860890e+01
1.303999763488769581e+01
1.240336288452148494e+01
1.183183954238891644e+01
1.132319833755493121e+01
1.097151347160339441e+01
1.050144447326660213e+01
1.024879186630248995e+01
9.998861322402953888e+00
9.896657018661498384e+00
9.511323032379150888e+00
9.369217433929442507e+00
9.224282283782958558e+00
9.118683748245238974e+00
8.994968137741089720e+00
8.883044176101684286e+00
8.754450502395629385e+00
8.670143890380860086e+00
8.605589008331298473e+00
8.271095199584960866e+00
8.236117668151855753e+00
8.284673619270325418e+00
8.082002205848693777e+00
8.071880555152892711e+00
8.072110152244567516e+00
8.011762228012084819e+00
7.924585232734679963e+00
7.851263298988341965e+00
7.852795419692992773e+00
7.816667671203613388e+00
7.682919006347656676e+00
7.614727959632873855e+00
7.533103542327880930e+00
7.559582018852234242e+00
7.542831478118896094e+00
7.395216994285583212e+00
7.392109975814819656e+00
7.329265527725219442e+00
7.408204550743103134e+00
7.318795228004455922e+00
7.341680951118469522e+00
7.278553171157836843e+00
7.226870636940002868e+00
7.256009860038757253e+00
