5.937430629730224751e+01
2.035819221496582188e+01
1.845588769912719584e+01
1.707420455932617287e+01
1.637085731506347486e+01
1.512755530357360811e+01
1.415459577560424798e+01
1.335840726852416971e+01
1.246934246063232443e+01
1.176758949279785149e+01
1.133865674018859870e+01
1.092416059494018477e+01
1.081344025611877413e+01
1.058751116752624455e+01
1.022175372123718340e+01
1.002656291961669943e+01
9.882004709243775054e+00
9.764844684600829439e+00
9.487524442672729208e+00
9.342812938690185476e+00
9.251729240417480682e+00
9.067088794708251243e+00
9.040613794326782582e+00
8.958353090286255593e+00
8.607886881828308745e+00
8.506375684738159748e+00
8.462019152641296671e+00
8.342362418174744221e+00
8.297010550498962189e+00
8.235730171203613281e+00
8.244158711433410502e+00
8.125042181015015075e+00
8.039803152084351368e+00
8.036021628379820925e+00
8.077944588661193137e+00
8.006643338203430105e+00
7.935180859565734934e+00
7.880986127853393697e+00
7.863066511154174876e+00
7.817921566963195623e+00
7.772177305221557475e+00
7.698148150444030335e+00
7.780127296447753693e+00
7.548840179443359055e+00
7.459385643005370881e+00
7.442990617752075266e+00
7.407704648971557226e+00
7.390690202713012802e+00
7.317648773193359268e+00
7.265247039794921591e+00
