<svg xmlns="http://www.w3.org/2000/svg" viewBox="0 0 1000 280" width="1000" height="280">
	<defs>
		<linearGradient id="grd1" gradientUnits="userSpaceOnUse"  x1="302.494" y1="105.035" x2="302.494" y2="203.178">
			<stop offset="0" stop-color="#4ad1f6"  />
			<stop offset="1" stop-color="#0f3689"  />
		</linearGradient>
		<linearGradient id="grd2" gradientUnits="userSpaceOnUse"  x1="371.091" y1="105.035" x2="371.091" y2="203.178">
			<stop offset="0" stop-color="#4ad1f6"  />
			<stop offset="1" stop-color="#0f3689"  />
		</linearGradient>
		<linearGradient id="grd3" gradientUnits="userSpaceOnUse"  x1="411.692" y1="105.035" x2="411.692" y2="203.178">
			<stop offset="0" stop-color="#4ad1f6"  />
			<stop offset="1" stop-color="#0f3689"  />
		</linearGradient>
		<linearGradient id="grd4" gradientUnits="userSpaceOnUse"  x1="503.117" y1="78.127" x2="503.117" y2="208.825">
			<stop offset="0" stop-color="#ff3a2a"  />
			<stop offset="1" stop-color="#931d17"  />
		</linearGradient>
		<linearGradient id="grd5" gradientUnits="userSpaceOnUse"  x1="548.238" y1="78.127" x2="548.238" y2="208.825">
			<stop offset="0" stop-color="#ff3a2a"  />
			<stop offset="1" stop-color="#931d17"  />
		</linearGradient>
		<linearGradient id="grd6" gradientUnits="userSpaceOnUse"  x1="567.727" y1="78.127" x2="567.727" y2="208.825">
			<stop offset="0" stop-color="#ff3a2a"  />
			<stop offset="1" stop-color="#931d17"  />
		</linearGradient>
		<linearGradient id="grd7" gradientUnits="userSpaceOnUse"  x1="639.227" y1="78.127" x2="639.227" y2="208.825">
			<stop offset="0" stop-color="#ff3a2a"  />
			<stop offset="1" stop-color="#931d17"  />
		</linearGradient>
		<linearGradient id="grd8" gradientUnits="userSpaceOnUse"  x1="663.998" y1="78.127" x2="663.998" y2="208.825">
			<stop offset="0" stop-color="#ff3a2a"  />
			<stop offset="1" stop-color="#931d17"  />
		</linearGradient>
		<linearGradient id="grd9" gradientUnits="userSpaceOnUse"  x1="744.765" y1="78.127" x2="744.765" y2="208.825">
			<stop offset="0" stop-color="#ff3a2a"  />
			<stop offset="1" stop-color="#931d17"  />
		</linearGradient>
		<linearGradient id="grd10" gradientUnits="userSpaceOnUse"  x1="765.006" y1="78.127" x2="765.006" y2="208.825">
			<stop offset="0" stop-color="#ff3a2a"  />
			<stop offset="1" stop-color="#931d17"  />
		</linearGradient>
		<linearGradient id="grd11" gradientUnits="userSpaceOnUse"  x1="836.19" y1="78.127" x2="836.19" y2="208.825">
			<stop offset="0" stop-color="#ff3a2a"  />
			<stop offset="1" stop-color="#931d17"  />
		</linearGradient>
		<linearGradient id="grd12" gradientUnits="userSpaceOnUse"  x1="900.474" y1="78.127" x2="900.474" y2="208.825">
			<stop offset="0" stop-color="#ff3a2a"  />
			<stop offset="1" stop-color="#931d17"  />
		</linearGradient>
		<linearGradient id="grd13" gradientUnits="userSpaceOnUse"  x1="953.458" y1="78.127" x2="953.458" y2="208.825">
			<stop offset="0" stop-color="#ff3a2a"  />
			<stop offset="1" stop-color="#931d17"  />
		</linearGradient>
		<linearGradient id="grd14" gradientUnits="userSpaceOnUse"  x1="985.948" y1="103.021" x2="985.948" y2="191.035">
			<stop offset="0" stop-color="#4ad1f6"  />
			<stop offset="1" stop-color="#0f3689"  />
		</linearGradient>
		<linearGradient id="grd15" gradientUnits="userSpaceOnUse"  x1="280.187" y1="195.97" x2="969.858" y2="195.97">
			<stop offset="0" stop-color="#4ad1f6"  />
			<stop offset="1" stop-color="#0f3689"  />
		</linearGradient>
		<linearGradient id="grd16" gradientUnits="userSpaceOnUse"  x1="986.382" y1="103.022" x2="986.382" y2="191.035">
			<stop offset="0" stop-color="#4ad1f6"  />
			<stop offset="1" stop-color="#0f3689"  />
		</linearGradient>
		<linearGradient id="grd17" gradientUnits="userSpaceOnUse"  x1="986.382" y1="103.021" x2="986.382" y2="191.035">
			<stop offset="0" stop-color="#4ad1f6"  />
			<stop offset="1" stop-color="#0f3689"  />
		</linearGradient>
		<linearGradient id="grd18" gradientUnits="userSpaceOnUse"  x1="985.948" y1="103.021" x2="985.948" y2="191.036">
			<stop offset="0" stop-color="#4ad1f6"  />
			<stop offset="1" stop-color="#0f3689"  />
		</linearGradient>
		<linearGradient id="grd19" gradientUnits="userSpaceOnUse"  x1="188.024" y1="-4.116" x2="188.024" y2="240.914">
			<stop offset="0" stop-color="#4ad1f6"  />
			<stop offset="1" stop-color="#0f3689"  />
		</linearGradient>
		<linearGradient id="grd20" gradientUnits="userSpaceOnUse"  x1="250.393" y1="77.891" x2="250.393" y2="230.331">
			<stop offset="0" stop-color="#ff3a2a"  />
			<stop offset="1" stop-color="#931d17"  />
		</linearGradient>
		<linearGradient id="grd21" gradientUnits="userSpaceOnUse"  x1="260.097" y1="-35.601" x2="260.097" y2="190.47">
			<stop offset="0" stop-color="#ff3a2a"  />
			<stop offset="1" stop-color="#931d17"  />
		</linearGradient>
	</defs>
	<style>
		tspan { white-space:pre }
		.shp0 { fill: url(#grd1) } 
		.shp1 { fill: url(#grd2) } 
		.shp2 { fill: url(#grd3) } 
		.shp3 { fill: url(#grd4) } 
		.shp4 { fill: url(#grd5) } 
		.shp5 { fill: url(#grd6) } 
		.shp6 { fill: url(#grd7) } 
		.shp7 { fill: url(#grd8) } 
		.shp8 { fill: url(#grd9) } 
		.shp9 { fill: url(#grd10) } 
		.shp10 { fill: url(#grd11) } 
		.shp11 { fill: url(#grd12) } 
		.shp12 { fill: url(#grd13) } 
		.shp13 { fill: url(#grd14) } 
		.shp14 { fill: url(#grd15) } 
		.shp15 { fill: url(#grd16) } 
		.shp16 { fill: url(#grd17) } 
		.shp17 { fill: url(#grd18) } 
		.shp18 { fill: url(#grd19) } 
		.shp19 { fill: url(#grd20) } 
		.shp20 { fill: url(#grd21) } 
	</style>
	<g id="Layer 1">
		<g id="&lt;Group&gt;">
			<g id="&lt;Group&gt;">
				<g id="&lt;Group&gt;">
					<path id="&lt;Compound Path&gt;" class="shp0" d="M268.45 120.83L298.49 120.83L298.49 192.66L280.19 192.66L280.19 136.34L268.45 136.34L268.45 120.83Z" />
					<path id="&lt;Compound Path&gt;" class="shp1" d="M355.57 164.98C352.77 168.07 348.5 172.17 342.75 177.26L367.09 177.26L367.09 192.66L316.48 192.66L316.48 178.37L319.28 176.65C325.24 172.99 330.48 168.98 335 164.61C337.16 162.53 339.38 160.02 341.68 157.08C346.13 151.42 348.35 146.62 348.35 142.68C348.35 140.6 347.73 138.92 346.47 137.63C345.21 136.34 343.58 135.69 341.57 135.69C336.47 135.69 333.71 139.46 333.28 147L315.83 147C315.98 142.77 316.34 139.53 316.91 137.31C317.49 135.08 318.53 132.82 320.03 130.52C324.91 123.13 332.35 119.43 342.32 119.43C349.29 119.43 355.09 121.43 359.71 125.41C364.35 129.39 366.66 134.4 366.66 140.43C366.66 148.47 362.96 156.66 355.57 164.98Z" />
					<path id="&lt;Compound Path&gt;" class="shp2" d="M377.64 120.83L407.69 120.83L407.69 192.66L389.38 192.66L389.38 136.34L377.64 136.34L377.64 120.83Z" />
					<path id="&lt;Compound Path&gt;" class="shp3" d="M485.76 175L498.58 175C495.2 181.03 490.65 185.71 484.9 189.05C479.16 192.39 472.84 194.06 465.95 194.06C455.9 194.06 447.25 190.38 440 183.02C432.74 175.66 429.12 166.85 429.12 156.58C429.12 146.25 432.71 137.47 439.89 130.26C447.07 123.04 455.79 119.43 466.06 119.43C480.63 119.43 491.65 126 499.12 139.14L486.52 139.14C480.7 132.39 473.95 129.02 466.27 129.02C458.88 129.02 452.6 131.71 447.43 137.09C442.25 142.48 439.67 148.98 439.67 156.58C439.67 164.12 442.28 170.66 447.48 176.19C452.68 181.71 458.88 184.48 466.06 184.48C473.74 184.48 480.31 181.32 485.76 175Z" />
					<path id="&lt;Compound Path&gt;" class="shp4" d="M544.24 183.08L544.24 192.66L508.91 192.66L508.91 120.83L519.36 120.83L519.36 183.08L544.24 183.08Z" />
					<path id="&lt;Compound Path&gt;" class="shp5" d="M563.73 120.83L563.73 192.66L553.28 192.66L553.28 120.83L563.73 120.83Z" />
					<path id="&lt;Compound Path&gt;" class="shp6" d="M635.23 120.83L635.23 192.66L624.35 192.66L588.6 137.2L588.6 192.66L578.15 192.66L578.15 120.83L589.57 120.83L624.67 175.54L624.67 120.83L635.23 120.83Z" />
					<path id="&lt;Compound Path&gt;" class="shp7" d="M660 120.83L660 192.66L649.55 192.66L649.55 120.83L660 120.83Z" />
					<path id="&lt;Compound Path&gt;" class="shp8" d="M727.41 175L740.23 175C736.85 181.03 732.29 185.71 726.55 189.05C720.8 192.39 714.49 194.06 707.6 194.06C697.54 194.06 688.89 190.38 681.64 183.02C674.39 175.66 670.76 166.85 670.76 156.58C670.76 146.25 674.36 137.47 681.53 130.26C688.71 123.04 697.44 119.43 707.7 119.43C722.28 119.43 733.3 126 740.77 139.14L728.16 139.14C722.35 132.39 715.6 129.02 707.92 129.02C700.52 129.02 694.24 131.71 689.07 137.09C683.9 142.48 681.32 148.98 681.32 156.58C681.32 164.12 683.92 170.66 689.13 176.19C694.33 181.71 700.52 184.48 707.7 184.48C715.38 184.48 721.95 181.32 727.41 175Z" />
					<path id="&lt;Compound Path&gt;" class="shp9" d="M761.01 120.83L761.01 192.66L750.56 192.66L750.56 120.83L761.01 120.83Z" />
					<path id="&lt;Compound Path&gt;" fill-rule="evenodd" class="shp10" d="M804.94 120.83L832.19 192.66L821.1 192.66L813.13 171.45L787.28 171.45L779.31 192.66L768.22 192.66L795.47 120.83L804.94 120.83ZM791.05 161.86L809.47 161.86L800.31 134.51L791.05 161.86Z" />
					<path id="&lt;Compound Path&gt;" class="shp11" d="M896.47 120.83L896.47 192.66L885.6 192.66L849.84 137.2L849.84 192.66L839.4 192.66L839.4 120.83L850.81 120.83L885.92 175.54L885.92 120.83L896.47 120.83Z" />
					<path id="&lt;Compound Path&gt;" class="shp12" d="M948.28 139.46L937.61 139.46C937.4 136.3 936.39 133.77 934.6 131.87C932.8 129.97 930.57 129.02 927.92 129.02C925.33 129.02 923.07 130 921.14 131.98C919.2 133.95 918.23 136.27 918.23 138.92C918.23 141.72 919.05 143.86 920.71 145.33C922.36 146.8 925.46 148.18 930.02 149.48C934.58 150.77 937.92 152.03 940.03 153.25C942.15 154.47 944.04 156.26 945.69 158.63C948.2 162.22 949.46 166.38 949.46 171.12C949.46 177.66 947.34 183.11 943.1 187.49C938.87 191.87 933.59 194.06 927.27 194.06C920.81 194.06 915.5 191.94 911.34 187.71C907.17 183.47 905.02 178.05 904.88 171.45L915.22 171.45C916.08 180.13 920.13 184.48 927.38 184.48C930.68 184.48 933.45 183.33 935.68 181.03C937.9 178.73 939.01 175.9 939.01 172.52C939.01 167.43 936.03 163.87 930.08 161.86L927.49 161L924.47 160.03C920.38 158.74 917.73 157.77 916.51 157.12C915.28 156.48 913.99 155.37 912.63 153.79C909.4 150.2 907.78 145.78 907.78 140.54C907.78 134.44 909.74 129.39 913.65 125.41C917.56 121.43 922.5 119.43 928.46 119.43C934.06 119.43 938.69 121.28 942.35 124.98C946.01 128.68 947.99 133.51 948.28 139.46Z" />
				</g>
				<g id="&lt;Group&gt;">
					<path id="&lt;Compound Path&gt;" class="shp13" d="M976.82 202.05L976.82 196.83L981.95 196.83L981.95 202.05L976.82 202.05Z" />
					<path id="&lt;Compound Path&gt;" class="shp14" d="M280.19 202.05L280.19 199.97L969.86 199.97L969.86 202.05L280.19 202.05Z" />
					<path id="&lt;Compound Path&gt;" class="shp15" d="M977.32 182.39C977.32 180 976.08 178.2 973.61 176.99L973.61 171.03C976.24 171.65 978.36 173.01 979.97 175.1C981.58 177.19 982.38 179.6 982.38 182.32C982.38 185.6 981.25 188.38 979 190.66C976.74 192.94 973.99 194.08 970.72 194.08C967.49 194.08 964.75 192.95 962.52 190.7C960.28 188.44 959.16 185.67 959.16 182.39C959.16 178.05 960.96 174.75 964.56 172.47C965.79 171.69 966.97 171.21 968.11 171.03L968.11 176.99C966.92 177.44 965.97 178.15 965.27 179.12C964.57 180.09 964.23 181.19 964.23 182.42C964.23 184.12 964.84 185.54 966.09 186.68C967.33 187.82 968.88 188.38 970.72 188.38C972.59 188.38 974.16 187.81 975.43 186.66C976.69 185.51 977.32 184.09 977.32 182.39Z" />
					<path id="&lt;Compound Path&gt;" fill-rule="evenodd" class="shp16" d="M982.38 157.7C982.38 161 981.27 163.78 979.05 166.04C976.83 168.29 974.09 169.42 970.82 169.42C967.52 169.42 964.75 168.3 962.52 166.05C960.28 163.81 959.16 161.02 959.16 157.7C959.16 154.37 960.29 151.56 962.53 149.27C964.77 146.98 967.53 145.83 970.79 145.83C974.05 145.83 976.8 146.98 979.03 149.27C981.26 151.56 982.38 154.37 982.38 157.7ZM964.23 157.63C964.23 159.37 964.84 160.82 966.09 161.98C967.33 163.14 968.88 163.72 970.72 163.72C972.61 163.72 974.19 163.14 975.44 161.97C976.7 160.79 977.32 159.33 977.32 157.56C977.32 155.86 976.7 154.43 975.44 153.27C974.19 152.11 972.65 151.53 970.82 151.53C968.96 151.53 967.39 152.11 966.12 153.29C964.86 154.46 964.23 155.91 964.23 157.63Z" />
					<path id="&lt;Compound Path&gt;" class="shp17" d="M981.95 137.76L981.95 142.99L959.6 142.99L959.6 135.65L974.31 131.22L959.6 126.8L959.6 119.43L981.95 119.43L981.95 124.69L965.16 124.49L981.95 129.32L981.95 133.1L965.16 137.92L981.95 137.76Z" />
				</g>
			</g>
			<g id="&lt;Group&gt;">
				<g id="&lt;Group&gt;">
					<path id="&lt;Path&gt;" class="shp18" d="M104.81 195.76C110.74 170.82 126.38 148.34 152.02 134.73C162.03 129.41 172.9 125.73 184.02 123.58L184.02 64.47L114.47 64.47L114.47 126.99L51.94 126.99L51.94 196.55L104.65 196.55C104.71 196.29 104.75 196.02 104.81 195.76Z" />
					<path id="&lt;Path&gt;" class="shp19" d="M192.13 126.99C180.36 139.28 175.61 158.85 177.88 185.69C175.63 219.75 160.53 236.4 132.59 235.64C127.47 207.4 137.19 181.69 143.03 169.5C143.4 168.83 143.67 168.19 144.05 167.52C144.01 167.57 143.94 167.66 143.87 167.77C145.08 165.33 146.12 163.42 146.97 162.04C144.86 165.32 142.88 168.53 141.03 171.69C132.77 183.68 110.73 220.08 116.99 259.07L184.02 259.07L184.02 196.55L246.54 196.55L246.54 126.99L192.13 126.99Z" />
				</g>
				<path id="&lt;Path&gt;" class="shp20" d="M256.1 117.39C255.78 116.13 255.26 114.35 254.55 112.03C253.46 108.57 251.67 103.54 248.88 97.39C246.07 91.28 242.16 83.99 236.57 76.54C230.95 68.92 223.86 61.28 214.98 53.99C206.17 46.72 195.38 40.4 183.26 35.67C171.08 31.1 157.5 28.26 143.36 28.03L140.7 27.97L140.04 27.96C140.17 27.95 139.68 27.98 139.53 27.99L138.16 28.07L132.65 28.4C130.83 28.55 128.9 28.53 127.15 28.82L121.87 29.69L116.57 30.57L111.28 31.99L105.94 33.38L100.75 35.28C86.87 40.35 73.8 48.27 62.74 58.41C51.61 68.47 42.47 80.72 36.1 94.06C29.73 107.39 25.93 121.69 24.91 135.77C24.8 137.54 24.7 139.29 24.59 141.04L24.45 143.53L24.54 146.22C24.67 149.78 24.66 153.39 25.12 156.65C25.43 159.99 25.79 163.3 26.51 166.58C26.81 168.22 27.12 169.85 27.42 171.47C27.85 173.06 28.28 174.64 28.71 176.21C32.14 188.77 37.56 200.03 43.87 209.54C50.22 219.04 57.32 226.88 64.21 233.19C71.26 239.33 77.98 244.06 83.85 247.38C89.72 250.69 94.49 253.11 97.88 254.41C100.12 255.34 101.84 256.05 103.04 256.55C101.81 256.15 100.04 255.57 97.73 254.81C95.99 254.25 93.84 253.59 91.42 252.5C89 251.42 86.09 250.44 83.12 248.74C76.98 245.72 69.88 241.32 62.3 235.45C54.87 229.43 47.06 221.76 40.2 212.07C33.3 202.44 27.23 190.89 23.16 177.84C22.65 176.21 22.15 174.56 21.63 172.91C21.25 171.21 20.87 169.51 20.49 167.8C19.62 164.41 19.09 160.85 18.64 157.22C18 153.55 17.94 150.07 17.75 146.49L17.62 143.81C17.61 142.62 17.68 141.89 17.71 140.9C17.78 139.05 17.86 137.19 17.94 135.32C18.81 120.39 22.39 105.01 29.18 90.76C35.9 76.5 45.56 63.35 57.4 52.54C69.28 41.78 83.3 33.41 98.14 28.09L103.69 26.1L109.39 24.66L115.06 23.26L120.89 22.39L126.69 21.57C128.62 21.3 130.42 21.36 132.28 21.24L137.8 21.01L139.18 20.96L140.04 20.93L140.74 20.95L143.56 21.07C158.55 21.47 172.81 25.09 185.41 30.32C197.96 35.73 208.96 42.72 217.84 50.59C226.78 58.3 233.82 66.91 238.96 74.83C244.28 82.86 247.79 90.43 250.3 96.79C252.81 103.16 254.1 108.38 254.96 111.92C255.5 114.29 255.88 116.12 256.1 117.39Z" />
			</g>
		</g>
	</g>
</svg>