#1 Naisha: 1min37sec
#2 Team1: 2min18sec
#3 Team1: 2min18sec
#4 Team1: 2min18sec
#5 Team1: 2min18sec
#6 Team1: 2min18sec
#7 Team1: 2min18sec
#8 Team1: 2min18sec
#9 Team1: 2min18sec
#10 Team1: 2min18sec


