{
  "version": 1,
  "up_time": "2021122301",
  "enable": false,
  "vd_enable": false,
  "boot_enable": false,
  "appbooster_enable": false,
  "trancare_enable": false,
  "trancare_exception": false,
  "ram": 4,
  "max_preload_num": 4,
  "ui_max_preload_num": 3,
  "mem_rate": 0.01,
  "min_mem": 3000000000,
  "min_enough_mem": 0,
  "cpu_rate": 0.01,
  "avail_memory_threshold": 800,
  "appbooster_list": [
    "com.whatsapp",
    "com.facebook.katana",
    "com.google.android.youtube"
  ],
  "valid_app_list": [
    "com.transsion.faceidsub",
    "com.funbase.xradio",
    "com.opera.app.news",
    "com.ss.android.ugc.trill",
    "com.ubercab",
    "com.twitter.android",
    "com.instagram.android",
    "com.facebook.katana",
    "com.google.android.youtube",
    "com.mxtech.videoplayer.ad",
    "com.snapchat.android",
    "com.tencent.mm",
    "com.tencent.wework",
    "com.whatsapp",
    "com.android.chrome",
    "com.kwai.bulldog",
    "com.facebook.lite",
    "com.facebook.orca",
    "com.zhiliaoapp.musically",
    "in.startv.hotstar",
    "com.google.android.googlequicksearchbox",
    "com.nemo.vidmate",
    "in.mohalla.sharechat",
    "com.gbwhatsapp",
    "com.flipkart.android",
    "com.google.android.apps.messaging",
    "video.like",
    "com.google.android.apps.photos",
    "com.whatsapp.w4b",
    "com.playit.videoplayer",
    "com.android.vending",
    "com.funnypuri.client",
    "com.jio.jioplay.tv",
    "com.imo.android.imoim",
    "com.shopee.id",
    "mobi.mangatoon.novel",
    "org.videolan.vlc",
    "com.tokopedia.tkpd",
    "com.gojek.partner",
    "com.google.android.apps.meetings",
    "com.grabtaxi.driver2",
    "in.mohalla.video",
    "site.realanime.animlov.animlov",
    "in.amazon.mShop.android.shopping",
    "com.lazada.android",
    "com.google.android.gm",
    "com.next.innovation.takatak",
    "com.tv.v18.viola",
    "com.gojek.app",
    "com.google.android.apps.photosgo",
    "com.daraz.android",
    "com.google.android.apps.searchlite",
    "com.netflix.mediaclient",
    "com.cardfeed.video_public",
    "com.nexstreaming.app.kinemasterfree",
    "sg.bigo.live",
    "com.phonepe.app",
    "sg.cocofun",
    "com.sonyliv",
    "com.bukalapak.android",
    "com.superking.ludo.star",
    "com.yy.hiyo",
    "com.jio.media.jiobeats",
    "cn.wps.moffice_eng",
    "com.jio.myjio",
    "com.rioo.runnersubway",
    "co.vtube.fvtech",
    "tv.accedo.airtel.wynk",
    "com.google.android.apps.nbu.files",
    "com.bsbportal.music",
    "com.activision.callofduty.shooter",
    "video.player.videoplayer",
    "com.nextwave.wcc2",
    "wp.wattpad",
    "com.picsart.studio",
    "com.eterno.shortvideos",
    "com.jumpy.jumpingzoo",
    "com.cricbuzz.android",
    "com.wildspike.wormszone",
    "com.king.candycrushsodasaga",
    "com.mxtech.videoplayer.beta",
    "com.google.android.apps.youtube.mango",
    "com.firsttouchgames.dls3",
    "com.microsoft.teams",
    "com.dstvmobile.android",
    "net.one97.paytm",
    "com.supercell.clashofclans",
    "com.vuclip.viu",
    "in.cricketexchange.app.cricketexchange",
    "io.silvrr.installment",
    "com.viusasa",
    "com.dewmobile.kuaiya.play",
    "com.gallery20",
    "com.sh.smart.caller",
    "com.transsion.camera",
    "com.transsion.phoenix",
    "com.transsion.calculator",
    "com.transsion.phonemaster",
    "com.afmobi.boomplayer",
    "com.transsion.filemanagerx",
    "net.bat.store",
    "com.hatsune.eagleee",
    "com.transsion.magicshow",
    "com.transsion.notebook",
    "com.transsnet.store",
    "com.transsion.fmradio",
    "com.transsion.soundrecorder",
    "com.yomobigroup.chat",
    "com.transsion.wifiplaytogether",
    "com.trassion.infinix.xclub",
    "com.infinix.xshare",
    "com.transsion.carlcare",
    "com.transsion.faceid",
    "com.transsion.compass",
    "com.transsion.tecnospot",
    "com.transsion.calendar"
  ],
  "vip_app_list": [
    "com.opera.app.news",
    "com.google.android.googlequicksearchbox",
    "com.google.android.apps.messaging",
    "com.google.android.apps.photos",
    "com.imo.android.imoim",
    "mobi.mangatoon.novel",
    "com.google.android.apps.meetings",
    "in.amazon.mShop.android.shopping",
    "com.google.android.gm",
    "com.tv.v18.viola",
    "com.gojek.app",
    "com.google.android.apps.photosgo",
    "com.sonyliv",
    "com.yy.hiyo",
    "com.jio.media.jiobeats",
    "cn.wps.moffice_eng",
    "com.jio.myjio",
    "co.vtube.fvtech",
    "tv.accedo.airtel.wynk",
    "com.google.android.apps.nbu.files",
    "com.bsbportal.music",
    "video.player.videoplayer",
    "wp.wattpad",
    "com.picsart.studio",
    "com.cricbuzz.android",
    "com.microsoft.teams",
    "com.dewmobile.kuaiya.play",
    "com.transsion.calculator"
  ]
}