{
  "version": 42,
  "product": "default",
  "ram": 12,
  "up_time": 20240110,
  "platform_list": [
    "android",
    "com.mediatek.mtklogger",
    "com.debug.loggerui",
    "com.android.quickstep",
    "com.transsion.phonemanager",
    "com.transsion.testcaserepository",
    "com.transsion.alarmmanager",
    "com.transsion.agingfunction",
    "com.transsion.emmctest",
    "com.transsion.trancare",
    "com.transsion.keyguardgesture",
    "com.transsion.videocallenhancer",
    "com.google.android.permissioncontroller",
    "com.transsion.faceid",
    "com.transsion.plat.appupdate",
    "com.transsion.aibox",
    "com.transsion.magazineservice",
    "com.transsion.applock",
    "com.google.android.gsf",
    "com.android.showae",
    "com.android.mtp",
    "com.transsion.tsdsmartcomm",
    "com.transsion.smartpanel",
    "jp.co.cyberagent.stf",
    "com.afwsamples.testdpc",
    "com.transsion.demomode",
    "com.hoffnung",
    "com.transsion.trancarelite",
    "com.transsion.ipmessage",
    "com.transsion.instantchat",
    "com.alpha.applock",
    "com.android.fanstrace",
    "com.google.android.apps.devicelock",
    "com.safaricom.android.financing",
    "com.google.android.deskclock",
    "com.google.android.apps.devicelock",
    "com.trustonic.telecoms.client.standard.dlc.playground",
    "com.trustonic.telecoms.standard.dlc",
    "com.ss.android.lark",
    "com.ss.android.lark.transsion",
    "com.transsion.imwav",
    "com.transsion.smartmessage",
    "com.android.bedstead.remotedpc.dpc",
    "com.domobile.applockwatcher",
    "com.flatfish.cal.privacy",
    "com.transsion.wallet.tecno",
    "com.transsion.wallet.infinix",
    "com.transsion.wallet.itel",
    "vault.gallery.lock",
    "com.domobile.applock.in",
    "com.calculator.hideu",
    "android.os.lib.consumer1",
    "com.transsion.ostesttower",
    "com.transsion.osperfmonitor",
    "com.android.app4",
    "com.android.tests.atomicinstall",
    "com.android.tests.silentupdate",
    "com.android.tests.securefrpinstall",
    "android.os.lib.app",
    "vault.gallery.lock",
    "com.domobile.applock.in",
    "com.calculator.hideu",
    "com.android.test.notificationtrampoline.current",
    "com.payjoy.status.df",
    "android.dynamicmime.testapp",
    "com.android.bedstead.testapp.DeviceAdminTestApp",
    "com.google.ar.core",
    "com.trs.trde",
    "com.transsion.mft",
    "com.geniex.vsimhelper",
    "androidx.test.services",
    "android.nativemedia.aaudio",
    "android.app.fgstesthelper33",
    "android.server.wm.backgroundactivity.appa33"
  ],
  "muslin_pkg_list": [
    "com.alhiwar",
    "com.pakdata.QuranMajeed",
    "com.vmuslimpro",
    "com.masarat.salati",
    "com.guidedways.ipray",
    "com.reworewo.prayertimes",
    "com.greentech.quran",
    "com.raimbekov.android.sajde",
    "com.shiamuslimproject.main",
    "qibla.compass.finddirection.hijricalendar",
    "org.dailyislam.android.preview",
    "com.rakibofc.inspiretobeislamic",
    "my.smartech.mp3quran",
    "com.namaztime"
  ],
  "gms_pkg_list": [
    "android",
    "com.google.android.gms",
    "com.transsion.iotservice"
  ],
  "game_list": [
    "com.king.candycrushsaga",
    "free.fruits.frolic.game.shalltry",
    "com.gameloft.android.GloftJDMP",
    "com.imangi.templerun2",
    "com.tencent.tmgp.pubgmhd"
  ],
  "transparent_activity": [
    "com.igexin.sdk.GActivity"
  ],
  "social_list": [
    "com.facebook.services",
    "com.whatsapp",
    "com.whatsapp.w4b",
    "com.viber.voip",
    "com.facebook.orca",
    "com.instagram.android",
    "com.skype.raider",
    "com.imo.android.imoim",
    "com.tencent.mobileqqi",
    "com.tencent.mm",
    "com.tencent.mobileqq",
    "com.tencent.wework",
    "jp.naver.line.android"
  ],
  "important_service_action": [
    "android.service.voice.VoiceInteractionService",
    "android.view.InputMethod",
    "android.service.wallpaper.WallpaperService",
    "android.backup.TRANSPORT_HOST",
    "android.accounts.AccountAuthenticator",
    "android.media.browse.MediaBrowserService",
    "com.transsion.service.quicktools.action.QT_TILE"
  ],
  "important_broadcast_action": [
    "android.appwidget.action.APPWIDGET_ENABLED",
    "android.appwidget.action.APPWIDGET_DELETED",
    "android.appwidget.action.APPWIDGET_DISABLED",
    "android.appwidget.action.APPWIDGET_UPDATE",
    "android.appwidget.action.APPWIDGET_UPDATE_OPTIONS",
    "android.intent.action.MEDIA_BUTTON",
    "audio_notify_click"
  ],
  "onekeyclean_caller_list": [
    "android",
    "com.transsion.phonemaster",
    "com.transsion.phonemanager",
    "com.transsion.hilauncher",
    "com.transsion.XOSLauncher",
    "com.transsion.batterylab",
    "com.android.systemui",
    "com.android.quickstep",
    "com.transsnet.store",
    "com.transsion.smartpanel",
    "com.transsion.itel.launcher",
    "com.transsion.XOSLauncher.upgrade",
    "com.transsion.hilauncher.upgrade"
  ],
  "jobschedule_block_list" : [],
  "fcm_block_list" : [],
  "tpms_block_list" : [],
  "fixed_max_adj": {
    "com.tencent.mobileqq:MSF": 300,
    "com.tencent.mm:push": 300,
    "com.tencent.wework:push": 300,
    "com.transsion.plat.appupdate": 300,
    "android.process.acore": 800
  },
  "feature": {
    "app_start_limit": true,
    "oom_adj_clean": false,
    "low_ram_clean": false,
    "low_swap_clean": false,
    "onekey_clean": true,
    "heavy_cpu_clean": false,
    "heavy_iow_clean": false,
    "sleep_clean": false,
    "fix_adj": true,
    "limit_sys_start": false,
    "limit_gms_start": false,
    "limit_3rd_start": true,
    "allow_clean_sys": false,
    "allow_clean_gms": false,
    "allow_clean_3rd": true,
    "ux_detector_protect": true,
    "platform_cloud_update": true,
    "tpms_cloud_update" : true,
    "not_limit_fcm_send": true,
    "not_limit_schedule_run": true,
    "not_limit_tpms_send": true,
    "allow_manual_clean_limit":true
  },
  "tracker": {
    "hw_rm": false,
    "lmkd": false,
    "cpuloading": false,
    "meminfo": false
  },
  "total_mem": {
    "adj_native": 1024,
    "adj_system": 1024,
    "adj_persist": 1024,
    "adj_foreground": 400,
    "adj_visible": 700,
    "adj_perceptible": 600,
    "adj_backup": 300,
    "adj_heavyweight": 300,
    "adj_service": 400,
    "adj_home": 400,
    "adj_previous": 400,
    "adj_service_b": 600,
    "adj_cached": 800,
    "swapfree_min_percent": 5,
    "swapfree_max_percent": 10,
    "free_cached": 1000
  },
  "proc_mem": {
    "3rd": 150,
    "gms": 150,
    "sys": 150,
    "sys_bg": 150,
    "game": 400
  },
  "proc_active": {
    "3rd": 600,
    "gms": 600,
    "sys": 600,
    "sys_bg": 600
  },
  "proc_paused": {
    "3rd": 300,
    "gms": 300,
    "sys": 600,
    "sys_bg": 600
  },
  "cpu_threshold": 100,
  "io_threshold": 100,
  "interval": {
    "sleep_clean_light": 600,
    "sleep_clean_deep": 3600,
    "sleep_clean_gap": 10,
    "link_rm_proxy": 3,
    "cat_meminfo": 60,
    "ux_detector_call": 20,
    "cloud_update_interval": 43200000
  },
  "number": {
    "recent_task": 25,
    "notification": 4,
    "cached_proc": 48,
    "ux_detector_app": 1,
    "max_cached_processes":96,
    "cur_max_cached_processes":96
  },
  "protect_top_app": 5,
  "provider_filter": {
    "caller": [],
    "action": ["cn.jpush.android.service.DownloadProvider",
      "com.tencent.android.tpush.XGPushProvider",
      "com.tencent.mid.api.MidProvider"],
    "target": {
      "block_list":["com.ganji.android",
        "com.oneapp.max.cleaner.booster",
        "com.rocket.cleaner.app",
        "com.hyperspeed.rocketclean.pro",
        "com.antivirus.speed.cleaner",
        "com.cleanmaster.mguard",
        "com.oneapp.max.security.pro",
        "com.cleanmaster.mguard_cn",
        "com.huodao.hdphone",
        "com.baidu.video",
        "com.hupu.shihuo",
        "com.gift.android",
        "com.hunantv.imgo.activity",
        "com.tencent.game.rhythmmaster",
        "com.hytch.ftthemepark",
        "com.job.android",
        "com.jzyd.coupon",
        "com.meelive.ingkee",
        "com.mfw.roadbook",
        "com.qidian.QDReader",
        "com.qq.reader",
        "com.quvideo.xiaoying",
        "com.sohu.sohuvideo",
        "tv.pps.mobile",
        "com.tencent.android.qqdownloader",
        "com.tencent.karaoke",
        "com.tianqi2345",
        "com.tuniu.app.ui",
        "com.xingin.xhs",
        "net.csdn.csdnplus",
        "sogou.mobile.explorer",
        "com.p1.mobile.putong",
        "cn.zymk.comic",
        "com.bertadata.qxb",
        "com.cubic.autohome",
        "com.tencent.tmgp.wec",
        "com.tencent.tmgp.speedmobile",
        "com.tencent.game.rhythmmaster",
        "com.tencent.qt.qtl",
        "com.tencent.gamehelper.smoba",
        "com.qqgame.mic",
        "com.tencent.tmgp.pubgmhd",
        "bf.sgs.hdexp",
        "com.tencent.tmgp.cf",
        "com.qqgame.hlddz",
        "com.tencent.pao",
        "com.tencent.tmgp.wdsj666",
        "com.tencent.tmgp.snsgz",
        "com.tencent.qqgame.xq",
        "com.tencent.weishi",
        "com.tencent.tmgp.minitech.miniworld",
        "com.tencent.tmgp.bh3",
        "com.tencent.tmgp.sgame",
        "com.tencent.pocket",
        "cn.kuwo.player"],
      "allow_list":[]
    }
  },
  "allow_job_schedule":[
    "com.transsion.push.service.PushJobIntentService"
  ],
  "allow_action_broadcast": [{
    "send": "com.hoffnung",
    "action": "tpush.intent.action.TPUSH_MSG_RECEIVER",
    "target": ["com.transsion.phonemaster",
      "com.transsion.carlcare",
      "com.transsnet.store",
      "com.transsion.tecnospot",
      "net.bat.store",
      "com.infinix.xshare",
      "com.transsion.passport",
      "com.scorpio.securitycom",
      "com.talpa.translate",
      "com.yomobigroup.chat",
      "com.qidian.Int.reader.transread",
      "com.transsnet.news.more",
      "com.hatsune.eaglee",
      "com.afmobi.boomplayer",
      "com.transsion.phoenix",
      "com.transsion.magicshow"
    ]
  }]
}
