{
  "major_version":2,
  "version":1001,
  "update_time":20220801,
  "auto_refresh_rate_whitelist": [
    "android",
    "com.transsion.phoenix",
    "com.android.contacts",
    "com.transsion.hilauncher",
    "com.transsion.XOSLauncher",
    "com.android.settings",
    "com.transsion.hilauncher.upgrade",
    "com.transsion.XOSLauncher.upgrade",
    "com.sh.smart.caller",
    "com.transsion.smartmessage",
    "com.talpa.hibrowser",
    "com.transsion.microintelligence",
    "com.microsoft.office.outlook",
    "com.google.android.gm",
    "com.twitter.android",
    "com.instagram.lite",
    "com.facebook.lite",
    "com.google.android.apps.messaging",
    "com.zhiliaoapp.musically.go",
    "com.transsion.demomode",
    "tech.palm.id",
    "com.rlk.weathers",
    "com.transsion.filemanagerx",
    "com.antutu.ABenchMark",
    "com.antutu.benchmark.full",
    "com.gallery20",
    "com.android.settings.intelligence",
    "com.google.android.permissioncontroller",
    "com.transsion.iotservice",
    "com.transsion.ossettingsext",
    "com.transsion.aod",
    "com.instagram.android",
    "com.transsion.screencapture",
    "com.transsion.calculator",
    "com.ludashi.benchmark",
    "com.ludashi.benchmark2",
    "com.glbenchmark.glbenchmark27",
    "com.linkedin.android",
    "com.opera.app.news",
    "org.detikcom.rss",
    "com.google.android.apps.classroom",
    "com.vuclip.viu",
    "com.facebook.orca",
    "com.transsion.resolver",
    "com.traveloka.android"
  ],
  "refresh_rate_blacklist_in_90hz_mode": [
    "com.transsion.screenrecord",
    "com.opera.mini.native",
    "com.tencent.tmgp.speedmobile",
    "com.kiloo.subwaysurf",
    "com.king.candycrushsaga",
    "com.imangi.templerun",
    "com.imangi.templerun2",
    "com.tonielrosoft.classicludofree",
    "com.ludo.king",
    "com.outfit7.mytalkingangelafree",
    "com.ss.android.ugc.trill",
    "com.sports.live.football.tv",
    "video.like",
    "iflix.play",
    "com.starmakerinteractive.starmaker",
    "com.gbwhatsapp",
    "com.lbe.parallel.intl.arm64",
    "ru.yandex.searchplugin",
    "com.nemo.vidmate",
    "com.google.android.apps.nbu.files",
    "cn.xender",
    "com.grabtaxi.driver2",
    "ee.mtakso.driver",
    "com.waze",
    "video.player.videoplayer",
    "video.like.lite",
    "com.tencent.mobileqq",
    "com.youku.phone",
    "com.tencent.qqlive",
    "com.sohu.sohuvideo",
    "com.hunantv.imgo.activity",
    "com.ss.android.ugc.aweme",
    "com.smile.gifmaker",
    "com.duowan.kiwi",
    "air.tv.douyu.android",
    "tv.danmaku.bili",
    "com.opera.browser",
    "com.dynamicgames.worldbusdrivingsimulator",
    "org.telegram.messenger",
    "com.boundless.jawaker",
    "com.gojek.app",
    "com.blizzard.wtcg.hearthstone",
    "com.cis.jiangnan.taptap",
    "com.google.android.gm",
    "com.microsoft.office.outlook",
    "ru.mail.mailapp",
    "com.aol.mobile.aolapp",
    "de.eue.mobile.android.mail",
    "com.att.mobile.android.vvm",
    "bg.abv.andro.emailapp",
    "com.firsttouchgames.dls3",
    "com.vectorunit.redcmgeplaycn.yyh",
    "com.kugou.android",
    "mobi.mangatoon.novel.portuguese",
    "com.roblox.client",
    "com.yomobigroup.chat",
    "com.cybertron.spritewar",
    "com.cybertron.movingbricks",
    "com.google.android.apps.photos",
    "com.goodix.fingerprint.setting",
    "com.tokopedia.tkpd"
  ],
  "limit_90hz_in_higher_setting_mode": [
  ],
  "slide_in_higher_setting_mode_120hz": [
    "in.mohalla.sharechat",
    "com.shopee.id",
    "com.mobile.legends",
    "com.google.android.googlequicksearchbox",
    "com.instagram.android",
    "com.twitter.android",
    "com.android.vending",
    "com.playit.videoplayer",
    "com.netflix.mediaclient",
    "com.mxtech.videoplayer.ad",
    "in.startv.hotstar.dplus"
  ],
  "limit_60hz_in_all_setting_mode": [
    "com.silead.factorytest"
  ],
  "limit_120hz_in_auto_mode": [
  ],
  "high_refresh_rate_gameList_in_120hz_mode": [
    "com.tencent.tmgp.pubgmhd",
    "com.rekoo.pubgm",
    "com.pubg.krmobile",
    "com.vng.pubgmobile",
    "com.dts.freefireth",
    "com.dts.freefiremax",
    "com.mobile.legends",
    "com.garena.game.codm",
    "com.activision.callofduty.shooter",
    "com.garena.game.kgid",
    "com.garena.game.kgth",
    "com.garena.game.kgvn",
    "com.garena.game.kgtw",
    "com.ngame.allstar.eu",
    "com.tencent.tmgp.cod"
  ],
  "refresh_rate_blacklist_in_120hz_mode": [
    "com.transsion.screenrecord",
    "com.opera.mini.native",
    "com.tencent.tmgp.speedmobile",
    "com.kiloo.subwaysurf",
    "com.king.candycrushsaga",
    "com.imangi.templerun",
    "com.imangi.templerun2",
    "com.tonielrosoft.classicludofree",
    "com.ludo.king",
    "com.outfit7.mytalkingangelafree",
    "com.ss.android.ugc.trill",
    "com.sports.live.football.tv",
    "video.like",
    "iflix.play",
    "com.starmakerinteractive.starmaker",
    "com.gbwhatsapp",
    "com.lbe.parallel.intl.arm64",
    "ru.yandex.searchplugin",
    "com.nemo.vidmate",
    "com.google.android.apps.nbu.files",
    "cn.xender",
    "com.grabtaxi.driver2",
    "ee.mtakso.driver",
    "com.waze",
    "video.player.videoplayer",
    "video.like.lite",
    "com.tencent.mobileqq",
    "com.youku.phone",
    "com.tencent.qqlive",
    "com.sohu.sohuvideo",
    "com.hunantv.imgo.activity",
    "com.ss.android.ugc.aweme",
    "com.smile.gifmaker",
    "com.duowan.kiwi",
    "air.tv.douyu.android",
    "tv.danmaku.bili",
    "com.opera.browser",
    "com.dynamicgames.worldbusdrivingsimulator",
    "com.boundless.jawaker",
    "com.gojek.app",
    "com.blizzard.wtcg.hearthstone",
    "com.cis.jiangnan.taptap",
    "com.google.android.gm",
    "com.microsoft.office.outlook",
    "ru.mail.mailapp",
    "com.aol.mobile.aolapp",
    "de.eue.mobile.android.mail",
    "com.att.mobile.android.vvm",
    "bg.abv.andro.emailapp",
    "com.firsttouchgames.dls3",
    "com.vectorunit.redcmgeplaycn.yyh",
    "com.kugou.android",
    "mobi.mangatoon.novel.portuguese",
    "com.roblox.client",
    "com.yomobigroup.chat",
    "com.cybertron.spritewar",
    "com.cybertron.movingbricks",
    "com.google.android.apps.photos",
    "com.goodix.fingerprint.setting",
    "com.tokopedia.tkpd"
  ],
  "fast_slow_slide_blacklist": [
    "com.android.settings",
    "com.transsion.aod",
    "com.tokopedia.tkpd",
    "com.google.android.apps.classroom",
    "com.starmakerinteractive.starmaker",
    "ma.safe.bnnigeria",
    "com.google.android.apps.youtube.music",
    "com.grabtaxi.passenger",
    "com.shopee.id",
	"com.rovio.angrybirdsseasons",
	"com.sina.weibo",
    "com.android.chrome"
  ],
  "scroll_list_in_sbe": [
    "com.google.android.googlequicksearchbox",
    "com.jingdong.app.mall",
    "com.sankuai.meituan",
    "com.eg.android.AlipayGphone",
    "com.ss.android.lark.transsion",
    "com.android.vending"
  ],
  "pubg_package_list": [
    "com.tencent.ig",
    "com.pubg.krmobile",
    "com.vng.pubgmobile",
    "com.rekoo.pubgm",
    "com.tencent.igce",
    "com.tencent.tmgp.pubgmhd"
  ],
  "voice_and_video_call_whitelist": [
    "com.sh.smart.caller/com.android.incallui.InCallActivity",
    "com.tencent.mm/com.tencent.mm.plugin.voip.ui.VideoActivity",
    "com.tencent.mm/.plugin.voip.ui.VideoActivity",
    "com.whatsapp/.voipcalling.VoipActivityV2",
    "com.whatsapp/com.whatsapp.voipcalling.VoipActivityV2"
  ],
  "detect_video_app_scope": [
    "com.tencent.qqlive",
    "video.player.videoplayer",
    "video.like.lite",
    "com.sohu.sohuvideo",
    "video.like",
    "com.ss.android.ugc.aweme",
    "com.ss.android.ugc.aweme.lite",
    "com.ss.android.article.video",
    "com.ss.android.article.news",
    "com.tencent.weishi",
    "com.smile.gifmaker",
    "org.videolan.vlc",
    "com.nemo.vidmate",
    "com.snckvideo.lite",
    "com.playit.videoplayer",
    "com.vuclip.viu",
    "com.smule.singandroid",
    "com.nexstreaming.app.kinemasterfree",
    "com.tencent.qqlivei18n",
    "com.mviavideo.mviavideomaker",
    "com.iqiyi.i18n",
    "com.picsart.studio.light",
    "sg.bigo.live",
    "com.photogrid.collage.videomaker",
    "com.youku.phone",
    "com.snapchat.android",
    "com.zhiliaoapp.musically.go",
    "com.instagram.android",
    "com.vuclip.viu",
    "premium.gotube.adblock.utube",
    "com.transsion.phoenix",
    "com.twitter.android",
    "com.google.android.googlequicksearchbox"
  ],
  "detect_video_activity_scope": [
    "com.google.android.googlequicksearchbox/com.google.android.libraries.search.video.lightbox.VideoLightboxActivity"
  ],
  "active_switch_package_list": [
    "com.google.android.apps.nbu.files",
    "com.google.android.apps.photos",
    "com.gallery20",
    "com.facebook.orca",
    "com.tokopedia.tkpd",
    "com.starmakerinteractive.starmaker",
    "com.google.android.apps.docs.editors.sheets"
  ],
  "transition_animation_whitelist": [
    "com.transsion.magicmovie.activity.TRSplashActivity",
    "com.transsion.audio.activities.AudioPlayerActivityInner"
  ],
  "high_cpu_temperature_whitelist": [
    "com.miHoYo.ys.bilibili",
    "com.miHoYo.GenshinImpact",
    "com.miHoYo.Yuanshen"
  ],
  "high_refresh_activity_whitelist": [
    "com.transsion.kolun.assistant/com.transsion.kolun.assistant.systemsettings.SystemSettingsActivity",
    "com.transsion.thunderback/com.transsion.thunderback.activity.TBSettingActivity",
    "com.transsion.videocallenhancer/com.transsion.whatsapputils.activity.FeatureSettingActivity",
    "com.transsion.childmode/com.transsion.childmode.ChildSettingsActivity",
    "com.transsion.dualapp/com.transsion.dualapp.MainActivity",
    "com.transsion.zahooc/com.transsion.peekproof.PeekProofActivity",
    "com.google.android.googlequicksearchbox/com.google.android.apps.lens.MainActivity",
    "com.google.android.googlequicksearchbox/com.google.android.apps.search.lens.LensActivity",
    "com.google.android.googlequicksearchbox/com.google.android.googlequicksearchbox.InternalGoogleAppActivityEntrypoint",
    "com.google.android.googlequicksearchbox/com.google.android.googlequicksearchbox.SearchActivity",
    "com.android.vending/com.android.vending.AssetBrowserActivity"
  ],
  "platform_pkg_set_entrys": {
    "G95": [
      "com.tencent.mobileqq",
      "com.youku.phone",
      "com.gameloft.android.ANMP.GloftA8HM",
      "com.gameloft.android.ANMP.GloftA8CN"
    ],
    "G80": [
      "com.skype.raider",
      "com.tencent.wework"
    ],
    "G85": [
      "com.tencent.mobileqq",
      "com.tencent.tmgp.sgame",
      "com.youku.phone",
      "com.gameloft.android.ANMP.GloftA8HM",
      "com.gameloft.android.ANMP.GloftA8CN"
    ]
  },
  "project_pkg_set_entry_index": {
    "TECNO-AC8": "ac8_pkg_list",
    "Infinix-X697" :"X697_pkg_list",
    "Infinix-X698" :"X697_pkg_list",
    "TECNO-CH7n":"X697_pkg_list",
    "TECNO-CH7" : "X697_pkg_list",
    "TECNO-CH9" : "X697_pkg_list",
    "TECNO-CH9n" : "X697_pkg_list"
  },
  "project_pkg_set_entrys": {
    "ac8_pkg_list": {
      "used_mode": "blacklist",
      "values": [
        "com.google.android.youtube",
        "com.ss.android.ugc.trill"
      ]
    },
    "X697_pkg_list": {
      "used_mode": "blacklist",
      "values": [
        "com.play.rosea",
        "com.garena.game.kgth",
        "com.moonfrog.ludo.club",
        "com.ludo.master.hippo",
        "com.t2ksports.nba2k20and",
        "com.emagssob.tongits",
        "com.tonielrosoft.classicludofree",
        "com.hippogames.ludosaga",
        "com.jssygp.bulletangel",
        "com.activision.callofduty.shooter",
        "com.ludo.king",
        "com.dts.freefireth",
        "com.mojang.minecraftpe",
        "org.ppsspp.ppsspp",
        "com.firsttouchgames.dlsa",
        "com.wordgame.puzzle.block.crush",
        "com.fugo.wow",
        "com.nextstep.fruitburstline",
        "com.dts.freefiremax",
        "com.mobirix.swipebrick2",
        "com.wordpz.word.blocken",
        "com.innersloth.spacemafia",
        "com.battlecreek.nolimit2",
        "com.roblox.client",
        "com.tonielro.naijawhotfree",
        "com.ea.game.pvzfree_row",
        "com.dummy.poker",
        "jp.konami.pesam",
        "com.firsttouchgames.dls7",
        "com.maxgames.stickwarlegacy",
        "com.tongitsgo.play",
        "com.yalla.yallagames",
        "com.craftsman.go",
        "com.puzzleblock.mutao.aha",
        "com.chillingo.robberybob2.android.gplay",
        "com.PlayMax.playergames",
        "io.yarsa.games.ludo",
        "com.olzhas.carparking.multyplayer",
        "com.king.farmheroessaga",
        "com.miniclip.eightballpool",
        "com.comfun.mobile.ludo.gpas",
        "link.merge.puzzle.onnect.number",
        "com.tencent.mobileqq",
        "com.youku.phone",
        "com.gameloft.android.ANMP.GloftA8HM",
        "com.gameloft.android.ANMP.GloftA8CN",
        "com.miHoYo.GenshinImpact"
      ]
    }
    }
}
