{
  "version":4,
  "product":"default",
  "up_time": 20240111,
  "block_enable":true,
  "block_start":[
    "com.oneapp.max.cleaner.booster",
    "com.cleanmaster.mguard",
    "com.antivirus.speed.cleaner",
    "com.rocket.cleaner.app",
    "com.rocket.tools.clean.antivirus.master",
    "com.hyperspeed.rocketclean.pro",
    "com.oneapp.max.security.pro",
    "com.ludashi.dualspace",
    "com.tencent.android.qqdownloader",
    "com.ss.android.ugc.aweme",
    "com.kuaishou.nebula",
    "cn.soulapp.android",
    "com.xingin.xhs",
    "com.sina.weibo",
    "com.taobao.taobao",
    "com.ss.android.ugc.aweme.lite",
    "com.xunmeng.pinduoduo",
    "com.immomo.momo",
    "cn.xiaochuankeji.zuiyouLite",
    "com.sankuai.meituan",
    "com.dragon.read",
    "com.taobao.idlefish",
    "com.ss.android.auto",
    "com.sup.android.superb",
    "com.baidu.searchbox",
    "com.gf.client",
    "com.achievo.vipshop",
    "com.jingdong.app.mall",
    "com.taou.maimai",
    "tv.danmaku.bili",
    "com.netease.newsreader.activity",
    "com.tencent.qqmusic",
    "cmb.pb",
    "com.lemon.lv",
    "com.dianping.v1",
    "com.smile.gifmaker",
    "com.ss.android.article.news",
    "com.alibaba.android.rimet",
    "com.zhihu.android",
    "com.baidu.netdisk",
    "com.netease.cloudmusic",
    "com.tencent.qqlive",
    "com.quark.browser",
    "com.UCMobile",
    "com.youku.phone",
    "com.ss.android.article.video",
    "com.ss.android.article.lite",
    "com.tencent.qqsports",
    "com.sport.hbzhibo1",
    "com.baidu.youavideo",
    "jackpal.androidterm",
    "com.tencent.tmgp.pubgmhd",
    "com.lianjia.beike",
    "com.homelink.android",
    "com.autonavi.minimap",
    "com.tencent.weread",
    "com.dewmobile.kuaiya.play",
    "com.sohu.inputmethod.sogou",
    "com.huawei.smarthome",
    "org.geekbang.geekTime",
    "com.cubic.autohome",
    "com.qiyi.video",
    "com.tencent.tmgp.cf",
    "com.tencent.tmgp.sgame",
    "com.perfectcorp.youcammakeupcn",
    "com.cyberlink.youperfect",
    "com.zcool.community",
    "com.xiaomi.smarthome",
    "com.sankuai.meituan.takeoutnew",
    "com.midea.ai.appliances",
    "com.tencent.wemeet.app",
    "com.tencent.news",
    "com.tencent.wework",
    "com.Qunar",
    "com.ximalaya.ting.android",
    "com.kiloo.subwaysurf",
    "cn.damai",
    "com.cctv.yangshipin.app.androidp",
    "com.lilithgames.rok.offical.cn",
    "bf.sgs.hdexp",
    "cn.gov.tax.its",
    "com.icbc",
    "com.chinamworld.main",
    "com.greenpoint.android.mc10086.activity",
    "com.bmcc.ms.ui",
    "com.hpbr.bosszhipin",
    "com.tencent.androidqqmail",
    "com.tencent.tmgp.speedmobile",
    "com.taptap",
    "com.yomobigroup.chat",
    "com.vskit.lite",
    "com.cmcc.cmvideo",
    "com.transsion.phoenix",
    "com.taou.maimai.pla",
    "com.baidu.BaiduMap",
    "com.tmall.wireless",
    "om.shizhuang.duapp",
    "com.vipshop.app",
    "com.microsoft.office.onenote",
    "com.yuque.mobile.android.app"
  ]
}
