﻿{
	"magazine": [{
			"path": "/product/theme/lockscreen/magazine/img/wallpaper01.webp",
			"wid": "wallpaper01"
		},
		{
			"path": "/product/theme/lockscreen/magazine/img/wallpaper02.webp",
			"wid": "wallpaper02"
		},
		{
			"path": "/product/theme/lockscreen/magazine/img/wallpaper03.webp",
			"wid": "wallpaper03"
		},
		{
			"path": "/product/theme/lockscreen/magazine/img/wallpaper04.webp",
			"wid": "wallpaper04"
		},
		{
			"path": "/product/theme/lockscreen/magazine/img/wallpaper05.webp",
			"wid": "wallpaper05"
		}
	]
}