{
	"id": "665a73d4-2431-4e38-a2e5-55955765a473",
	"name": "Atlantis_Local_HealtthyFoodSN",
	"values": [
		{
			"key": "base.url",
			"value": "http://localhost:8080",
			"enabled": true
		},
		{
			"key": "admin.password",
			"value": "Alabal@123",
			"enabled": true
		},
		{
			"key": "admin.username",
			"value": "atlantis.final.project@gmail.com",
			"enabled": true
		},
		{
			"key": "regular.password",
			"value": "Slava1234567@",
			"enabled": true
		},
		{
			"key": "regular.username",
			"value": "sladb@abv.bg",
			"enabled": true
		},
		{
			"key": "variable_key",
			"value": "variable_value",
			"enabled": true
		},
		{
			"key": "password",
			"value": "",
			"enabled": true
		},
		{
			"key": "username",
			"value": "",
			"enabled": true
		}
	],
	"_postman_variable_scope": "environment",
	"_postman_exported_at": "2020-12-01T13:25:24.734Z",
	"_postman_exported_using": "Postman/7.36.0"
}