<svg width="12" height="8" viewBox="0 0 12 8" fill="none" xmlns="http://www.w3.org/2000/svg">
<path fill-rule="evenodd" clip-rule="evenodd" d="M11.8389 4.38409C12.0537 4.17196 12.0537 3.82804 11.8389 3.61591L8.33873 0.159096C8.12394 -0.0530318 7.7757 -0.0530318 7.56091 0.159096C7.34612 0.371223 7.34612 0.715149 7.56091 0.927276L10.1222 3.45681H0V4.54319H10.1222L7.56091 7.07272C7.34612 7.28485 7.34612 7.62878 7.56091 7.8409C7.7757 8.05303 8.12394 8.05303 8.33873 7.8409L11.8389 4.38409Z" fill="#3538C3"/>
</svg>
