<svg width="16" height="14" viewBox="0 0 16 14" fill="none" xmlns="http://www.w3.org/2000/svg">
<path d="M15.467 1.33013C15.467 0.863464 15.0937 0.466797 14.6037 0.466797H1.39702C0.930358 0.466797 0.533691 0.863464 0.533691 1.33013V12.4835C0.533691 12.9501 0.930358 13.3468 1.39702 13.3468H14.6037C15.0704 13.3468 15.467 12.9501 15.467 12.4835C15.467 7.28013 15.467 6.67346 15.467 1.33013ZM1.39702 0.933464H14.6037C14.8137 0.933464 15.0004 1.12013 15.0004 1.33013V3.0568H1.00036V1.33013C1.00036 1.12013 1.18702 0.933464 1.39702 0.933464ZM14.6037 12.8801H1.39702C1.18702 12.8801 1.00036 12.6935 1.00036 12.4835V3.52346H15.0004V12.4835C15.0004 12.6935 14.837 12.8801 14.6037 12.8801Z" fill="#363636"/>
<path d="M13.2503 2.73008C13.647 2.73008 13.9503 2.40341 13.9503 2.03008C13.9503 1.65674 13.6236 1.33008 13.2503 1.33008C12.877 1.33008 12.5503 1.65674 12.5503 2.03008C12.5503 2.40341 12.8536 2.73008 13.2503 2.73008ZM13.2503 1.79674C13.3903 1.79674 13.4836 1.91341 13.4836 2.03008C13.4836 2.14675 13.367 2.26341 13.2503 2.26341C13.1336 2.26341 13.017 2.14675 13.017 2.03008C13.017 1.91341 13.1103 1.79674 13.2503 1.79674Z" fill="#363636"/>
<path d="M11.3602 2.73008C11.7568 2.73008 12.0602 2.40341 12.0602 2.03008C12.0602 1.65674 11.7335 1.33008 11.3602 1.33008C10.9868 1.33008 10.6602 1.65674 10.6602 2.03008C10.6602 2.40341 10.9868 2.73008 11.3602 2.73008ZM11.3602 1.79674C11.5002 1.79674 11.5935 1.91341 11.5935 2.03008C11.5935 2.14675 11.4768 2.26341 11.3602 2.26341C11.2435 2.26341 11.1268 2.14675 11.1268 2.03008C11.1268 1.91341 11.2435 1.79674 11.3602 1.79674Z" fill="#363636"/>
<path d="M9.49394 2.73008C9.89061 2.73008 10.1939 2.40341 10.1939 2.03008C10.1939 1.65674 9.86728 1.33008 9.49394 1.33008C9.12061 1.33008 8.79395 1.65674 8.79395 2.03008C8.79395 2.40341 9.09728 2.73008 9.49394 2.73008ZM9.49394 1.79674C9.63394 1.79674 9.72728 1.91341 9.72728 2.03008C9.72728 2.14675 9.61061 2.26341 9.49394 2.26341C9.37728 2.26341 9.26061 2.14675 9.26061 2.03008C9.26061 1.91341 9.35394 1.79674 9.49394 1.79674Z" fill="#363636"/>
<path d="M2.89056 2.26354H7.76723C7.90723 2.26354 8.00056 2.17021 8.00056 2.03021C8.00056 1.89021 7.90723 1.79688 7.76723 1.79688H2.89056C2.75056 1.79688 2.65723 1.89021 2.65723 2.03021C2.65723 2.17021 2.77389 2.26354 2.89056 2.26354Z" fill="#363636"/>
<path d="M9.72711 7.91016C9.07378 7.91016 8.53711 8.44682 8.53711 9.10016C8.53711 9.75349 9.07378 10.2902 9.72711 10.2902C10.3804 10.2902 10.9171 9.75349 10.9171 9.10016C10.9171 8.44682 10.3804 7.91016 9.72711 7.91016ZM9.72711 9.82349C9.33044 9.82349 9.00378 9.49682 9.00378 9.10016C9.00378 8.70349 9.33044 8.37682 9.72711 8.37682C10.1238 8.37682 10.4504 8.70349 10.4504 9.10016C10.4504 9.49682 10.1238 9.82349 9.72711 9.82349Z" fill="#363636"/>
<path d="M2.02728 5.13366H4.66395C4.80395 5.13366 4.89728 5.04033 4.89728 4.90033C4.89728 4.76033 4.80395 4.66699 4.66395 4.66699H2.02728C1.88728 4.66699 1.79395 4.76033 1.79395 4.90033C1.79395 5.04033 1.91061 5.13366 2.02728 5.13366Z" fill="#363636"/>
<path d="M6.11061 5.90332H2.02728C1.88728 5.90332 1.79395 5.99665 1.79395 6.13665C1.79395 6.27665 1.88728 6.36999 2.02728 6.36999H6.08728C6.22728 6.36999 6.32061 6.27665 6.32061 6.13665C6.32061 5.99665 6.22728 5.90332 6.11061 5.90332Z" fill="#363636"/>
<path d="M6.11061 7.16309H2.02728C1.88728 7.16309 1.79395 7.25642 1.79395 7.39642C1.79395 7.53642 1.88728 7.62975 2.02728 7.62975H6.08728C6.22728 7.62975 6.32061 7.53642 6.32061 7.39642C6.32061 7.25642 6.22728 7.16309 6.11061 7.16309Z" fill="#363636"/>
<path d="M6.11061 8.42383H2.02728C1.88728 8.42383 1.79395 8.51716 1.79395 8.65716C1.79395 8.79716 1.88728 8.8905 2.02728 8.8905H6.08728C6.22728 8.8905 6.32061 8.79716 6.32061 8.65716C6.32061 8.51716 6.22728 8.42383 6.11061 8.42383Z" fill="#363636"/>
<path d="M4.75728 9.70703H2.02728C1.88728 9.70703 1.79395 9.80036 1.79395 9.94036C1.79395 10.0804 1.88728 10.1737 2.02728 10.1737H4.75728C4.89728 10.1737 4.99061 10.0804 4.99061 9.94036C4.99061 9.80036 4.89728 9.70703 4.75728 9.70703Z" fill="#363636"/>
<path d="M13.5304 4.6198C13.4838 4.57314 13.4371 4.5498 13.3671 4.5498C13.2971 4.5498 13.2504 4.57314 13.2038 4.6198L12.6204 5.20314C12.5271 5.29647 12.5271 5.43647 12.6204 5.5298C12.7138 5.62314 12.8538 5.62314 12.9471 5.5298L13.1338 5.34314V8.86647H12.6671V8.65647C12.6671 8.5398 12.5738 8.44647 12.4571 8.42314L11.8271 8.3298C11.8038 8.28314 11.7804 8.21314 11.7571 8.16647L12.1304 7.65314C12.2004 7.5598 12.2004 7.41981 12.1071 7.3498L11.4771 6.7198C11.3838 6.62647 11.2671 6.62647 11.1738 6.69647L10.6604 7.0698C10.6138 7.04647 10.5438 7.02314 10.4971 6.9998L10.4038 6.3698C10.3804 6.25314 10.2871 6.1598 10.1704 6.1598H9.28378C9.16711 6.1598 9.07378 6.25314 9.05044 6.3698L8.95711 6.9998C8.91044 7.02314 8.84044 7.04647 8.79378 7.0698L8.28044 6.69647C8.18711 6.62647 8.04711 6.62647 7.97711 6.7198L7.34711 7.3498C7.25378 7.44314 7.25378 7.5598 7.32378 7.65314L7.69711 8.16647C7.67378 8.21314 7.65044 8.28314 7.62711 8.3298L6.99711 8.42314C6.88044 8.44647 6.78711 8.5398 6.78711 8.65647V9.54314C6.78711 9.6598 6.88044 9.75314 6.99711 9.77647L7.62711 9.8698C7.65044 9.91647 7.67378 9.98647 7.69711 10.0331L7.32378 10.5465C7.25378 10.6398 7.25378 10.7798 7.34711 10.8498L7.97711 11.4798C8.07044 11.5731 8.18711 11.5731 8.28044 11.5031L8.79378 11.1298C8.84044 11.1531 8.91044 11.1765 8.95711 11.1998L9.05044 11.8298C9.07378 11.9465 9.16711 12.0398 9.28378 12.0398H10.1704C10.2871 12.0398 10.3804 11.9465 10.4038 11.8298L10.4971 11.1998C10.5438 11.1765 10.6138 11.1531 10.6604 11.1298L11.1738 11.5031C11.2671 11.5731 11.4071 11.5731 11.4771 11.4798L12.1071 10.8498C12.2004 10.7565 12.2004 10.6398 12.1304 10.5465L11.7571 10.0331C11.7804 9.98647 11.8038 9.91647 11.8271 9.8698L12.4571 9.77647C12.5738 9.75314 12.6671 9.6598 12.6671 9.54314V9.33314H13.3671C13.5071 9.33314 13.6004 9.2398 13.6004 9.0998V5.34314L13.8104 5.55314C13.9038 5.64647 14.0438 5.64647 14.1371 5.55314C14.2304 5.4598 14.2304 5.3198 14.1371 5.22647L13.5304 4.6198ZM12.1771 9.35647L11.6171 9.4498C11.5238 9.47314 11.4538 9.5198 11.4304 9.61314C11.3838 9.7298 11.3371 9.8698 11.2904 9.96314C11.2438 10.0331 11.2438 10.1498 11.3138 10.2198L11.6404 10.6865L11.2904 11.0365L10.8238 10.7098C10.7538 10.6631 10.6604 10.6398 10.5671 10.6865C10.4504 10.7565 10.3338 10.8031 10.2171 10.8265C10.1238 10.8498 10.0538 10.9198 10.0538 11.0131L9.96044 11.5731H9.47044L9.40044 10.9898C9.37711 10.8965 9.33044 10.8265 9.23711 10.8031C9.12044 10.7565 8.98044 10.7098 8.88711 10.6631C8.81711 10.6165 8.70044 10.6165 8.63044 10.6865L8.16378 11.0131L7.81378 10.6631L8.14044 10.1965C8.18711 10.1265 8.21044 10.0331 8.16378 9.9398C8.09378 9.82314 8.04711 9.70647 8.02378 9.5898C8.00044 9.49647 7.93044 9.42647 7.83711 9.42647L7.27711 9.33314V8.84314L7.83711 8.7498C7.93044 8.72647 8.00044 8.6798 8.02378 8.58647C8.07044 8.4698 8.11711 8.3298 8.16378 8.23647C8.21044 8.16647 8.21044 8.0498 8.14044 7.9798L7.81378 7.51314L8.16378 7.16314L8.63044 7.4898C8.70044 7.53647 8.79378 7.5598 8.88711 7.51314C9.00378 7.44314 9.12044 7.39647 9.23711 7.37314C9.33044 7.3498 9.40044 7.2798 9.40044 7.18647L9.49378 6.62647H9.98378L10.0771 7.18647C10.1004 7.2798 10.1471 7.3498 10.2404 7.37314C10.3571 7.4198 10.4971 7.46647 10.5904 7.51314C10.6604 7.5598 10.7771 7.5598 10.8471 7.4898L11.3138 7.16314L11.6638 7.51314L11.3371 7.9798C11.2904 8.0498 11.2671 8.14314 11.3138 8.23647C11.3838 8.35314 11.4304 8.4698 11.4538 8.58647C11.4771 8.6798 11.5471 8.7498 11.6404 8.7498L12.2004 8.84314V9.35647H12.1771Z" fill="#363636"/>
</svg>
