<svg width="15" height="15" viewBox="0 0 15 15" fill="none" xmlns="http://www.w3.org/2000/svg">
<path d="M9.55193 2.24101V2.44101H9.75193H10.422L10.525 3.54231L10.5378 3.67937L10.6704 3.71634C11.0014 3.80861 11.3144 3.94135 11.6053 4.11008L11.7266 4.18043L11.8341 4.09041L12.6756 3.38566L13.8699 4.59806L13.1733 5.45243L13.0871 5.55819L13.1541 5.67706C13.3229 5.97638 13.4518 6.29384 13.5408 6.62517L13.5768 6.75913L13.7149 6.77238L14.7999 6.87653V8.59215L13.7144 8.69866L13.5763 8.71222L13.5407 8.84639C13.4543 9.17164 13.3233 9.48939 13.1535 9.79506L13.0877 9.91353L13.1733 10.0186L13.8699 10.8729L12.6756 12.083L11.8338 11.3804L11.726 11.2904L11.6047 11.3613C11.3169 11.5295 11.0017 11.6623 10.6704 11.7547L10.5378 11.7916L10.525 11.9287L10.422 13.03H9.75193H9.55193V13.23V13.8474H9.48565L9.48564 9.96042L9.61721 9.94901C10.7331 9.85225 11.8008 8.93301 11.8008 7.73789C11.8008 6.54571 10.7341 5.59758 9.61724 5.50051L9.48564 5.48908L9.48564 1.15215H9.55193V2.24101Z" stroke="#363636" stroke-width="0.4"/>
<path fill-rule="evenodd" clip-rule="evenodd" d="M3.99647 13.5826C3.99647 13.2617 4.25817 13.0007 4.57974 13.0007C4.90363 13.0007 5.16718 13.2617 5.16718 13.5826C5.16718 13.9034 4.90363 14.1645 4.57974 14.1645C4.25817 14.1645 3.99647 13.9034 3.99647 13.5826ZM4.35156 13.5826C4.35156 13.7081 4.45398 13.8101 4.57974 13.8101C4.71013 13.8101 4.81209 13.7101 4.81209 13.5826C4.81209 13.455 4.71013 13.355 4.57974 13.355C4.45398 13.355 4.35156 13.4571 4.35156 13.5826Z" fill="#363636"/>
<path d="M3.90656 1.48849H5.3443C5.44232 1.48849 5.52185 1.40914 5.52185 1.31133C5.52185 1.21352 5.44232 1.13416 5.3443 1.13416H3.90656C3.80854 1.13416 3.72902 1.21352 3.72902 1.31133C3.72902 1.40914 3.80854 1.48849 3.90656 1.48849Z" fill="#363636"/>
<path fill-rule="evenodd" clip-rule="evenodd" d="M1.66672 5.6618L1.66674 5.6615L1.66694 5.66067L1.66707 5.66022L1.66716 5.65962C1.66791 5.60653 1.67665 5.59175 1.89425 5.22366C2.03952 4.97793 2.27787 4.57472 2.66908 3.89753C2.70099 3.84297 2.75948 3.80952 2.82259 3.80952C2.8857 3.80952 2.94419 3.84309 2.9761 3.89753C3.36641 4.57332 3.60455 4.97616 3.74988 5.222C3.96732 5.58981 3.97703 5.60622 3.97779 5.65962L3.978 5.66068L3.97822 5.6618L3.97828 9.60592C3.97828 10.2418 3.45973 10.7591 2.82259 10.7591C2.18521 10.7591 1.66667 10.2418 1.66667 9.60592L1.66672 5.6618ZM2.02176 9.37743H3.62318V5.8392H2.02176V9.37743ZM2.0317 9.73176C2.09227 10.1127 2.42402 10.4048 2.82258 10.4048C3.22115 10.4048 3.55266 10.1127 3.61323 9.73176H2.0317ZM3.49186 5.48487L2.82258 4.3386L2.15308 5.48487H3.49186Z" fill="#363636"/>
<path fill-rule="evenodd" clip-rule="evenodd" d="M5 3.96527V10.5585C5 10.6445 5.07309 10.7143 5.16317 10.7143H7.45588C7.54596 10.7143 7.61905 10.6445 7.61905 10.5585V3.96527C7.61905 3.87929 7.54596 3.80952 7.45588 3.80952H5.16317C5.07309 3.80952 5 3.87929 5 3.96527ZM5.32635 4.12102H7.2927V4.80241H6.53548C6.4454 4.80241 6.37231 4.87217 6.37231 4.95815C6.37231 5.04414 6.4454 5.1139 6.53548 5.1139H7.2927V5.57029H6.86183C6.77174 5.57029 6.69865 5.64005 6.69865 5.72604C6.69865 5.81202 6.77174 5.88178 6.86183 5.88178H7.2927V6.33827H6.53548C6.4454 6.33827 6.37231 6.40804 6.37231 6.49402C6.37231 6.58001 6.4454 6.64977 6.53548 6.64977H7.2927V7.10616H6.86183C6.77174 7.10616 6.69865 7.17592 6.69865 7.2619C6.69865 7.34789 6.77174 7.41765 6.86183 7.41765H7.2927V7.87414H6.53548C6.4454 7.87414 6.37231 7.9439 6.37231 8.02989C6.37231 8.11587 6.4454 8.18563 6.53548 8.18563H7.2927V8.64213H6.86183C6.77174 8.64213 6.69865 8.71189 6.69865 8.79787C6.69865 8.88386 6.77174 8.95362 6.86183 8.95362H7.2927V9.41001H6.53548C6.4454 9.41001 6.37231 9.47977 6.37231 9.56575C6.37231 9.65174 6.4454 9.7215 6.53548 9.7215H7.2927V10.4028H5.32635V4.12102Z" fill="#363636"/>
<path fill-rule="evenodd" clip-rule="evenodd" d="M7.756 15H1.49645C0.782791 15 0.203443 14.4218 0.203443 13.7112V5.50998C0.199939 5.51051 0.196582 5.51145 0.193232 5.51238C0.188152 5.51379 0.183087 5.5152 0.177549 5.5152C0.0795277 5.5152 0 5.43584 0 5.33803V4.80804C0 4.71023 0.0795277 4.63087 0.177549 4.63087C0.18309 4.63087 0.188158 4.63228 0.193241 4.63369C0.196589 4.63462 0.199943 4.63556 0.203443 4.63609V4.08793C0.199939 4.08846 0.196581 4.08939 0.19323 4.09032C0.188151 4.09174 0.183086 4.09314 0.177549 4.09314C0.0795277 4.09314 0 4.01379 0 3.91598V3.38598C0 3.28817 0.0795277 3.20882 0.177549 3.20882C0.18309 3.20882 0.188158 3.21023 0.193241 3.21164C0.196589 3.21257 0.199943 3.2135 0.203443 3.21403V1.28895C0.203443 0.578209 0.783485 0 1.49645 0H7.756C8.46827 0 9.04762 0.578209 9.04762 1.28895V13.7112C9.04762 14.4218 8.46827 15 7.756 15ZM0.558542 1.28895V13.7112C0.558542 14.2264 0.978603 14.6457 1.49507 14.6457H7.756C8.27246 14.6457 8.69252 14.2264 8.69252 13.7112V1.28895C8.69252 0.773598 8.27246 0.354331 7.756 0.354331H1.49645C0.979296 0.354331 0.558542 0.773598 0.558542 1.28895Z" fill="#363636"/>
</svg>
