<svg width="15" height="15" viewBox="0 0 15 15" fill="none" xmlns="http://www.w3.org/2000/svg">
<path d="M13.75 5H12.25V4.2435C12.4047 4.12803 12.5304 3.97816 12.6172 3.80573C12.704 3.63329 12.7494 3.44304 12.75 3.25V2.25C12.75 2.1837 12.7236 2.12012 12.6768 2.07325L11.1768 0.57325C11.1299 0.526363 11.0663 0.500014 11 0.5H6C5.9337 0.500014 5.87012 0.526363 5.82325 0.57325L4.32325 2.07325C4.27636 2.12012 4.25001 2.1837 4.25 2.25V3.25C4.25056 3.44304 4.29603 3.63329 4.38281 3.80573C4.46959 3.97816 4.5953 4.12803 4.75 4.2435V5H1.25C0.918601 5.0004 0.600889 5.13222 0.366555 5.36655C0.13222 5.60089 0.000396964 5.9186 0 6.25V13.25C0.000396964 13.5814 0.13222 13.8991 0.366555 14.1334C0.600889 14.3678 0.918601 14.4996 1.25 14.5H13.75C14.0814 14.4996 14.3991 14.3678 14.6334 14.1334C14.8678 13.8991 14.9996 13.5814 15 13.25V6.25C14.9996 5.9186 14.8678 5.60089 14.6334 5.36655C14.3991 5.13222 14.0814 5.0004 13.75 5ZM11.5 4C11.3011 4 11.1103 3.92098 10.9697 3.78033C10.829 3.63968 10.75 3.44891 10.75 3.25H10.25C10.25 3.44891 10.171 3.63968 10.0303 3.78033C9.88968 3.92098 9.69891 4 9.5 4C9.30109 4 9.11032 3.92098 8.96967 3.78033C8.82902 3.63968 8.75 3.44891 8.75 3.25H8.25C8.25 3.44891 8.17098 3.63968 8.03033 3.78033C7.88968 3.92098 7.69891 4 7.5 4C7.30109 4 7.11032 3.92098 6.96967 3.78033C6.82902 3.63968 6.75 3.44891 6.75 3.25H6.25C6.25 3.44891 6.17098 3.63968 6.03033 3.78033C5.88968 3.92098 5.69891 4 5.5 4C5.30109 4 5.11032 3.92098 4.96967 3.78033C4.82902 3.63968 4.75 3.44891 4.75 3.25V2.5H12.25V3.25C12.25 3.44891 12.171 3.63968 12.0303 3.78033C11.8897 3.92098 11.6989 4 11.5 4ZM6.1035 1H10.8965L11.8965 2H5.1035L6.1035 1ZM5.5 4.5C5.69478 4.49945 5.88671 4.45323 6.06038 4.36505C6.23406 4.27687 6.38463 4.14918 6.5 3.99225C6.61497 4.1496 6.76546 4.27761 6.93922 4.36585C7.11298 4.45409 7.30512 4.50008 7.5 4.50008C7.69488 4.50008 7.88702 4.45409 8.06078 4.36585C8.23454 4.27761 8.38503 4.1496 8.5 3.99225C8.61497 4.1496 8.76546 4.27761 8.93922 4.36585C9.11298 4.45409 9.30512 4.50008 9.5 4.50008C9.69488 4.50008 9.88702 4.45409 10.0608 4.36585C10.2345 4.27761 10.385 4.1496 10.5 3.99225C10.6403 4.1839 10.8327 4.33125 11.0543 4.41678C11.2758 4.50231 11.5173 4.52243 11.75 4.47475V8.75C11.75 8.8163 11.7237 8.87989 11.6768 8.92677C11.6299 8.97366 11.5663 9 11.5 9H11.25V5.75C11.25 5.68369 11.2237 5.62011 11.1768 5.57322C11.1299 5.52634 11.0663 5.5 11 5.5H8.5C8.4337 5.5 8.37011 5.52634 8.32322 5.57322C8.27634 5.62011 8.25 5.68369 8.25 5.75V8.195C8.11333 8.07016 7.9351 8.00065 7.75 8H7.31275L7.43175 7.32775C7.43892 7.28554 7.44251 7.24281 7.4425 7.2C7.44239 7.02402 7.3802 6.85373 7.26688 6.7191C7.15356 6.58447 6.99638 6.49413 6.823 6.464C6.72654 6.44601 6.62746 6.44745 6.53156 6.46823C6.43566 6.489 6.34487 6.5287 6.2645 6.585C6.18293 6.64138 6.11342 6.71347 6.06006 6.79705C6.0067 6.88063 5.97056 6.97402 5.95375 7.07175L5.78975 8H5.25V4.475C5.33228 4.49171 5.41604 4.50008 5.5 4.5ZM2.56175 7.24725C2.55897 7.23165 2.55755 7.21584 2.5575 7.2C2.55812 7.14099 2.57959 7.0841 2.61811 7.0394C2.65663 6.9947 2.70973 6.96507 2.768 6.95575C2.7995 6.94995 2.83183 6.95047 2.86312 6.9573C2.89441 6.96412 2.92403 6.97711 2.95025 6.9955C2.97742 7.01442 3.00056 7.03855 3.01833 7.06649C3.03609 7.09443 3.04814 7.12562 3.05375 7.15825L3.3795 9H2.872L2.56175 7.24725ZM3.8 8.5H5.7025L5.61425 9H3.88925L3.8 8.5ZM6.94 7.244L6.628 9H6.1205L6.4455 7.158C6.45115 7.12541 6.4632 7.09427 6.48097 7.06638C6.49873 7.03848 6.52186 7.01439 6.549 6.9955C6.57565 6.97702 6.60571 6.96403 6.63743 6.95729C6.66915 6.95055 6.70189 6.9502 6.73375 6.95625C6.79161 6.96581 6.84422 6.99551 6.88228 7.04012C6.92035 7.08473 6.94141 7.14136 6.94175 7.2C6.94201 7.21472 6.941 7.22944 6.93875 7.244H6.94ZM2.36425 9H1.75C1.6837 9 1.62011 8.97366 1.57322 8.92677C1.52634 8.87989 1.5 8.8163 1.5 8.75C1.49989 8.71667 1.50663 8.68368 1.51978 8.65306C1.53294 8.62244 1.55225 8.59485 1.5765 8.572C1.59907 8.54891 1.62607 8.53063 1.65589 8.51826C1.68571 8.50589 1.71772 8.49967 1.75 8.5H2.275L2.36425 9ZM7.23 9.5L7.05275 11.7915C7.04214 11.9829 6.95864 12.163 6.81938 12.2948C6.68013 12.4265 6.49571 12.5 6.304 12.5H3.196C3.00334 12.4998 2.81811 12.4256 2.67854 12.2928C2.53898 12.16 2.45574 11.9787 2.446 11.7862L2.27 9.5H7.23ZM7.5 9H7.1355L7.22425 8.5H7.75C7.8163 8.5 7.87989 8.52634 7.92678 8.57322C7.97366 8.62011 8 8.68369 8 8.75C8.00011 8.78332 7.99337 8.81632 7.98022 8.84693C7.96706 8.87755 7.94775 8.90514 7.9235 8.928C7.90093 8.95109 7.87393 8.96937 7.84411 8.98174C7.81429 8.99411 7.78228 9.00032 7.75 9H7.5ZM10.75 9H8.75V6H10.75V9ZM13.75 14H1.25C1.05109 14 0.860322 13.921 0.71967 13.7803C0.579018 13.6397 0.5 13.4489 0.5 13.25V6.25C0.5 6.05109 0.579018 5.86032 0.71967 5.71967C0.860322 5.57902 1.05109 5.5 1.25 5.5H4.75V8H3.71025L3.54625 7.072C3.52947 6.97423 3.49334 6.88079 3.43998 6.79716C3.38662 6.71354 3.3171 6.64141 3.2355 6.585C3.1556 6.52872 3.06524 6.489 2.96976 6.46817C2.87427 6.44735 2.77558 6.44585 2.6795 6.46375C2.50565 6.49341 2.34787 6.58357 2.23405 6.71829C2.12023 6.85301 2.0577 7.02363 2.0575 7.2C2.05754 7.2439 2.06131 7.28773 2.06875 7.331L2.18725 8H1.75C1.55139 8.00098 1.3612 8.08032 1.22076 8.22076C1.08032 8.3612 1.00099 8.55139 1 8.75C1 8.94891 1.07902 9.13968 1.21967 9.28033C1.36032 9.42098 1.55109 9.5 1.75 9.5H1.7685L1.948 11.8192C1.9657 12.1383 2.1049 12.4384 2.337 12.658C2.5691 12.8776 2.87648 13 3.196 13H6.304C6.62254 13 6.92906 12.8784 7.16096 12.66C7.39286 12.4416 7.53264 12.143 7.55175 11.825L7.7315 9.5H11.5C11.6989 9.5 11.8897 9.42098 12.0303 9.28033C12.171 9.13968 12.25 8.94891 12.25 8.75V5.5H13.75C13.9489 5.5 14.1397 5.57902 14.2803 5.71967C14.421 5.86032 14.5 6.05109 14.5 6.25V7.75H14C13.8674 7.75 13.7402 7.80268 13.6464 7.89644C13.5527 7.99021 13.5 8.11739 13.5 8.25V11.25C13.5 11.3826 13.5527 11.5098 13.6464 11.6036C13.7402 11.6973 13.8674 11.75 14 11.75H14.5V13.25C14.5 13.4489 14.421 13.6397 14.2803 13.7803C14.1397 13.921 13.9489 14 13.75 14ZM14.5 8.25V11.25H14V8.25H14.5Z" fill="#363636"/>
<path d="M5 10H4.5V12H5V10Z" fill="#363636"/>
<path d="M6.25 10H5.75V12H6.25V10Z" fill="#363636"/>
<path d="M3.75 10H3.25V12H3.75V10Z" fill="#363636"/>
<path d="M12.25 10.5H9.25V11H12.25V10.5Z" fill="#363636"/>
<path d="M12.25 11.5H9.25V12H12.25V11.5Z" fill="#363636"/>
<path d="M12.25 12.5H9.25V13H12.25V12.5Z" fill="#363636"/>
</svg>
