<svg width="16" height="16" viewBox="0 0 16 16" fill="none" xmlns="http://www.w3.org/2000/svg">
<path d="M15.1296 11.3548C14.3164 10.3845 13.3947 9.28486 12.3262 9.28486C11.93 9.28486 11.5497 9.43825 11.1956 9.74101C10.9462 9.95455 10.7381 10.1831 10.5368 10.4042C10.3541 10.6049 10.1815 10.7944 9.998 10.949C9.99585 10.9508 9.97881 10.9581 9.93975 10.9581C9.58125 10.9581 8.66966 10.4328 7.44116 9.25919C6.35356 8.22018 5.45499 7.08705 5.15193 6.37242C5.0077 6.03229 5.05907 5.93022 5.05986 5.92944C5.17812 5.80637 5.33028 5.66888 5.49135 5.52328C5.84599 5.20278 6.24797 4.83945 6.50994 4.43498C6.85121 3.90807 6.88913 3.40526 6.62266 2.94053C6.61019 2.91878 6.59517 2.89864 6.57793 2.8805C6.19339 2.47603 5.8083 2.07148 5.42317 1.66685C5.04218 1.26658 4.66116 0.866262 4.28053 0.465984C4.27177 0.456777 4.26246 0.448078 4.25265 0.440007C3.89809 0.148027 3.53169 0 3.16369 0C2.29843 0 1.60651 0.809723 1.05054 1.46033C0.0255325 2.65975 -0.110246 2.93806 0.0639634 4.54661C0.325903 6.98173 1.97253 9.8535 4.46865 12.2286C6.95055 14.5901 9.76992 16 12.0104 16C12.4837 16 12.9335 15.9374 13.347 15.8142C14.1123 15.5868 15.6431 14.2423 15.9446 13.1389C16.0943 12.5912 15.9125 12.2459 15.733 12.052C15.5424 11.8474 15.3419 11.6081 15.1296 11.3548ZM15.3413 12.9733C15.1061 13.8339 13.7778 15.0323 13.1689 15.2132C12.8131 15.3193 12.4234 15.3731 12.0104 15.3731C9.92622 15.3731 7.26789 14.0276 4.89937 11.774C2.50755 9.49816 0.93243 6.77121 0.685855 4.47922C0.532953 3.06755 0.599571 2.95181 1.52563 1.86813C2.10592 1.18904 2.62972 0.626902 3.16365 0.626902C3.38176 0.626902 3.60355 0.720428 3.84125 0.912731C4.21743 1.30835 4.59395 1.70396 4.97048 2.09957C5.34611 2.49421 5.72162 2.88877 6.09675 3.28324C6.37233 3.81948 5.82061 4.38146 5.07237 5.05773C4.90289 5.21093 4.74279 5.35563 4.60936 5.49449C4.37475 5.73843 4.3636 6.1163 4.57621 6.61766C4.98131 7.5729 6.09882 8.84297 7.00955 9.71299C7.59871 10.2758 9.0637 11.585 9.93971 11.585C10.123 11.585 10.2783 11.5322 10.401 11.4285C10.6156 11.2476 10.8104 11.0337 10.9988 10.8268C11.1872 10.6199 11.382 10.406 11.6017 10.2178C11.8426 10.0119 12.0796 9.9118 12.3261 9.9118C13.1032 9.9118 13.9253 10.8926 14.6506 11.758C14.8683 12.0178 15.074 12.2632 15.275 12.479C15.3135 12.5205 15.4305 12.6469 15.3413 12.9733Z" fill="#5C5D60"/>
</svg>
