pg,dc,percentage_quantity
LIGHT TRUCK TIRES,212,2.85152085916455
LIGHT TRUCK TIRES,300,2.676107463352204
LIGHT TRUCK TIRES,206,2.265780118453138
LIGHT TRUCK TIRES,501,2.193467228846856
LIGHT TRUCK TIRES,260,2.119420160219137
LIGHT TRUCK TIRES,510,1.7853412618836793
LIGHT TRUCK TIRES,250,1.7812235765359719
LIGHT TRUCK TIRES,308,1.7565887320807438
LIGHT TRUCK TIRES,680,1.7521701389576272
LIGHT TRUCK TIRES,303,1.7487176181660873
LIGHT TRUCK TIRES,605,1.7375127628449214
LIGHT TRUCK TIRES,225,1.6225343181358542
LIGHT TRUCK TIRES,111,1.6086450487130095
LIGHT TRUCK TIRES,306,1.583978529755107
LIGHT TRUCK TIRES,919,1.5167731537051172
LIGHT TRUCK TIRES,117,1.4105606276112659
LIGHT TRUCK TIRES,307,1.3847538265570751
LIGHT TRUCK TIRES,140,1.2313383728522906
LIGHT TRUCK TIRES,70,1.2286460401249433
LIGHT TRUCK TIRES,810,1.2073211811992188
LIGHT TRUCK TIRES,660,1.2029184253274392
LIGHT TRUCK TIRES,650,1.194081239081205
LIGHT TRUCK TIRES,502,1.1814589497653474
LIGHT TRUCK TIRES,530,1.1454133657215682
LIGHT TRUCK TIRES,230,1.1322605284859097
LIGHT TRUCK TIRES,55,1.126258210229059
LIGHT TRUCK TIRES,17,1.1242706351862233
LIGHT TRUCK TIRES,95,1.1087897220039762
LIGHT TRUCK TIRES,304,1.098044146971593
LIGHT TRUCK TIRES,107,1.0913608269072368
LIGHT TRUCK TIRES,270,1.0749771903987615
LIGHT TRUCK TIRES,302,1.0553548359918008
LIGHT TRUCK TIRES,59,1.0350356425259972
LIGHT TRUCK TIRES,563,1.0320978324029213
LIGHT TRUCK TIRES,54,1.0288195213760924
LIGHT TRUCK TIRES,13,0.9928927167173431
LIGHT TRUCK TIRES,280,0.9880069246797747
LIGHT TRUCK TIRES,507,0.9770396281286687
LIGHT TRUCK TIRES,219,0.9754479843692664
LIGHT TRUCK TIRES,603,0.9531966462403079
LIGHT TRUCK TIRES,610,0.9365992068387785
LIGHT TRUCK TIRES,8,0.914846742126946
LIGHT TRUCK TIRES,850,0.9056136245972785
LIGHT TRUCK TIRES,570,0.8931180332921195
LIGHT TRUCK TIRES,550,0.8872107385432928
LIGHT TRUCK TIRES,101,0.8772728633291137
LIGHT TRUCK TIRES,80,0.8640804329651119
LIGHT TRUCK TIRES,60,0.8402136951997449
LIGHT TRUCK TIRES,900,0.832041673509679
LIGHT TRUCK TIRES,601,0.8130765650332179
LIGHT TRUCK TIRES,585,0.8084520876427155
LIGHT TRUCK TIRES,655,0.7905797495085305
LIGHT TRUCK TIRES,115,0.7791214981659671
LIGHT TRUCK TIRES,51,0.7758986175188191
LIGHT TRUCK TIRES,845,0.7689223083047221
LIGHT TRUCK TIRES,16,0.7622389882403657
LIGHT TRUCK TIRES,113,0.7474153209886182
LIGHT TRUCK TIRES,840,0.7455465253308124
LIGHT TRUCK TIRES,635,0.7430917513735252
LIGHT TRUCK TIRES,90,0.7303348454213001
LIGHT TRUCK TIRES,309,0.7266685217367066
LIGHT TRUCK TIRES,24,0.7200881438060431
LIGHT TRUCK TIRES,675,0.7034194367734957
LIGHT TRUCK TIRES,40,0.690749635703626
LIGHT TRUCK TIRES,180,0.6801307586819415
LIGHT TRUCK TIRES,62,0.6779214621203831
LIGHT TRUCK TIRES,141,0.65064179669182
LIGHT TRUCK TIRES,535,0.6492006068201223
LIGHT TRUCK TIRES,75,0.6471338455205997
