Mar 22, 2018 4:29:46 AM hudson.remoting.jnlp.Main createEngine
INFO: Setting up slave: MVPDEV
Mar 22, 2018 4:29:46 AM hudson.remoting.jnlp.Main$CuiListener <init>
INFO: Jenkins agent is running in headless mode.
Mar 22, 2018 4:29:46 AM org.jenkinsci.remoting.engine.WorkDirManager initializeWorkDir
INFO: Using /home/appuser/jenkins-files/remoting as a remoting work directory
Mar 22, 2018 4:29:46 AM hudson.remoting.jnlp.Main$CuiListener status
INFO: Locating server among [http://jenkins.ad.noodle.ai/]
Mar 22, 2018 4:29:46 AM org.jenkinsci.remoting.engine.JnlpAgentEndpointResolver resolve
INFO: Remoting server accepts the following protocols: [JNLP4-connect, Ping]
Mar 22, 2018 4:29:46 AM hudson.remoting.jnlp.Main$CuiListener status
INFO: Agent discovery successful
  Agent address: jenkins.ad.noodle.ai
  Agent port:    50000
  Identity:      5c:bb:b6:29:43:b7:ec:1a:cd:26:c5:1a:6c:39:b4:1e
Mar 22, 2018 4:29:46 AM hudson.remoting.jnlp.Main$CuiListener status
INFO: Handshaking
Mar 22, 2018 4:29:46 AM hudson.remoting.jnlp.Main$CuiListener status
INFO: Connecting to jenkins.ad.noodle.ai:50000
Mar 22, 2018 4:29:46 AM hudson.remoting.jnlp.Main$CuiListener status
INFO: Trying protocol: JNLP4-connect
Mar 22, 2018 4:29:46 AM hudson.remoting.jnlp.Main$CuiListener status
INFO: Remote identity confirmed: 5c:bb:b6:29:43:b7:ec:1a:cd:26:c5:1a:6c:39:b4:1e
Mar 22, 2018 4:29:46 AM hudson.remoting.jnlp.Main$CuiListener status
INFO: Connected
Apr 03, 2018 4:18:19 AM hudson.remoting.jnlp.Main$CuiListener status
INFO: Terminated
Apr 03, 2018 4:18:29 AM org.jenkinsci.remoting.engine.JnlpAgentEndpointResolver waitForReady
INFO: Failed to connect to the master. Will try again: java.net.ConnectException Connection refused (Connection refused)
Apr 03, 2018 4:18:40 AM org.jenkinsci.remoting.engine.JnlpAgentEndpointResolver waitForReady
INFO: Master isn't ready to talk to us on http://jenkins.ad.noodle.ai/tcpSlaveAgentListener/. Will try again: response code=503
Apr 03, 2018 4:18:55 AM org.jenkinsci.remoting.engine.JnlpAgentEndpointResolver waitForReady
INFO: Failed to connect to the master. Will try again: java.net.SocketTimeoutException Read timed out
Apr 03, 2018 4:19:10 AM org.jenkinsci.remoting.engine.JnlpAgentEndpointResolver waitForReady
INFO: Failed to connect to the master. Will try again: java.net.SocketTimeoutException Read timed out
Apr 03, 2018 4:19:20 AM org.jenkinsci.remoting.engine.JnlpAgentEndpointResolver waitForReady
INFO: Master isn't ready to talk to us on http://jenkins.ad.noodle.ai/tcpSlaveAgentListener/. Will try again: response code=503
Apr 03, 2018 4:19:30 AM org.jenkinsci.remoting.engine.JnlpAgentEndpointResolver waitForReady
INFO: Master isn't ready to talk to us on http://jenkins.ad.noodle.ai/tcpSlaveAgentListener/. Will try again: response code=503
Apr 03, 2018 4:19:40 AM jenkins.slaves.restarter.JnlpSlaveRestarterInstaller$2$1 onReconnect
INFO: Restarting agent via jenkins.slaves.restarter.UnixSlaveRestarter@3bbabb33
Apr 03, 2018 4:19:40 AM jenkins.slaves.restarter.JnlpSlaveRestarterInstaller$2$1 onReconnect
SEVERE: Failed to restart agent with jenkins.slaves.restarter.UnixSlaveRestarter@3bbabb33
java.io.IOException: Failed to exec '/usr/lib/jvm/java-8-openjdk-amd64/jre/bin/java (deleted)' No such file or directory
	at jenkins.slaves.restarter.UnixSlaveRestarter.restart(UnixSlaveRestarter.java:64)
	at jenkins.slaves.restarter.JnlpSlaveRestarterInstaller$2$1.onReconnect(JnlpSlaveRestarterInstaller.java:78)
	at hudson.remoting.EngineListenerSplitter.onReconnect(EngineListenerSplitter.java:49)
	at hudson.remoting.Engine.innerRun(Engine.java:647)
	at hudson.remoting.Engine.run(Engine.java:455)

Apr 03, 2018 4:19:40 AM hudson.remoting.jnlp.Main$CuiListener status
INFO: Locating server among [http://jenkins.ad.noodle.ai/]
Apr 03, 2018 4:19:40 AM org.jenkinsci.remoting.engine.JnlpAgentEndpointResolver resolve
INFO: Remoting server accepts the following protocols: [JNLP4-connect, Ping]
Apr 03, 2018 4:19:40 AM hudson.remoting.jnlp.Main$CuiListener status
INFO: Agent discovery successful
  Agent address: jenkins.ad.noodle.ai
  Agent port:    50000
  Identity:      5c:bb:b6:29:43:b7:ec:1a:cd:26:c5:1a:6c:39:b4:1e
Apr 03, 2018 4:19:40 AM hudson.remoting.jnlp.Main$CuiListener status
INFO: Handshaking
Apr 03, 2018 4:19:40 AM hudson.remoting.jnlp.Main$CuiListener status
INFO: Connecting to jenkins.ad.noodle.ai:50000
Apr 03, 2018 4:19:40 AM hudson.remoting.jnlp.Main$CuiListener status
INFO: Trying protocol: JNLP4-connect
Apr 03, 2018 4:19:41 AM hudson.remoting.jnlp.Main$CuiListener status
INFO: Remote identity confirmed: 5c:bb:b6:29:43:b7:ec:1a:cd:26:c5:1a:6c:39:b4:1e
Apr 03, 2018 4:19:41 AM hudson.remoting.jnlp.Main$CuiListener status
INFO: Connected
Apr 17, 2018 4:34:29 AM hudson.remoting.jnlp.Main$CuiListener status
INFO: Terminated
Apr 17, 2018 4:34:44 AM org.jenkinsci.remoting.engine.JnlpAgentEndpointResolver waitForReady
INFO: Failed to connect to the master. Will try again: java.net.SocketTimeoutException Read timed out
Apr 17, 2018 4:34:54 AM org.jenkinsci.remoting.engine.JnlpAgentEndpointResolver waitForReady
INFO: Master isn't ready to talk to us on http://jenkins.ad.noodle.ai/tcpSlaveAgentListener/. Will try again: response code=503
Apr 17, 2018 4:35:04 AM org.jenkinsci.remoting.engine.JnlpAgentEndpointResolver waitForReady
INFO: Master isn't ready to talk to us on http://jenkins.ad.noodle.ai/tcpSlaveAgentListener/. Will try again: response code=503
Apr 17, 2018 4:35:14 AM jenkins.slaves.restarter.JnlpSlaveRestarterInstaller$2$1 onReconnect
INFO: Restarting agent via jenkins.slaves.restarter.UnixSlaveRestarter@2b0d3763
Apr 17, 2018 4:35:14 AM jenkins.slaves.restarter.JnlpSlaveRestarterInstaller$2$1 onReconnect
SEVERE: Failed to restart agent with jenkins.slaves.restarter.UnixSlaveRestarter@2b0d3763
java.io.IOException: Failed to exec '/usr/lib/jvm/java-8-openjdk-amd64/jre/bin/java (deleted)' No such file or directory
	at jenkins.slaves.restarter.UnixSlaveRestarter.restart(UnixSlaveRestarter.java:64)
	at jenkins.slaves.restarter.JnlpSlaveRestarterInstaller$2$1.onReconnect(JnlpSlaveRestarterInstaller.java:78)
	at hudson.remoting.EngineListenerSplitter.onReconnect(EngineListenerSplitter.java:49)
	at hudson.remoting.Engine.innerRun(Engine.java:647)
	at hudson.remoting.Engine.run(Engine.java:455)

Apr 17, 2018 4:35:14 AM hudson.remoting.jnlp.Main$CuiListener status
INFO: Locating server among [http://jenkins.ad.noodle.ai/]
Apr 17, 2018 4:35:14 AM org.jenkinsci.remoting.engine.JnlpAgentEndpointResolver resolve
INFO: Remoting server accepts the following protocols: [JNLP4-connect, Ping]
Apr 17, 2018 4:35:14 AM hudson.remoting.jnlp.Main$CuiListener status
INFO: Agent discovery successful
  Agent address: jenkins.ad.noodle.ai
  Agent port:    50000
  Identity:      5c:bb:b6:29:43:b7:ec:1a:cd:26:c5:1a:6c:39:b4:1e
Apr 17, 2018 4:35:14 AM hudson.remoting.jnlp.Main$CuiListener status
INFO: Handshaking
Apr 17, 2018 4:35:14 AM hudson.remoting.jnlp.Main$CuiListener status
INFO: Connecting to jenkins.ad.noodle.ai:50000
Apr 17, 2018 4:35:14 AM hudson.remoting.jnlp.Main$CuiListener status
INFO: Trying protocol: JNLP4-connect
Apr 17, 2018 4:35:15 AM hudson.remoting.jnlp.Main$CuiListener status
INFO: Remote identity confirmed: 5c:bb:b6:29:43:b7:ec:1a:cd:26:c5:1a:6c:39:b4:1e
Apr 17, 2018 4:35:15 AM hudson.remoting.jnlp.Main$CuiListener status
INFO: Connected
