Jan 24, 2018 4:13:54 AM hudson.remoting.jnlp.Main createEngine
INFO: Setting up slave: MVPDEV
Jan 24, 2018 4:13:54 AM hudson.remoting.jnlp.Main$CuiListener <init>
INFO: Jenkins agent is running in headless mode.
Jan 24, 2018 4:13:54 AM org.jenkinsci.remoting.engine.WorkDirManager initializeWorkDir
INFO: Using /home/appuser/jenkins-files/remoting as a remoting work directory
Jan 24, 2018 4:13:54 AM hudson.remoting.jnlp.Main$CuiListener status
INFO: Locating server among [http://jenkins.ad.noodle.ai/]
Jan 24, 2018 4:13:54 AM org.jenkinsci.remoting.engine.JnlpAgentEndpointResolver resolve
INFO: Remoting server accepts the following protocols: [JNLP4-connect, Ping]
Jan 24, 2018 4:13:54 AM hudson.remoting.jnlp.Main$CuiListener status
INFO: Agent discovery successful
  Agent address: jenkins.ad.noodle.ai
  Agent port:    50000
  Identity:      5c:bb:b6:29:43:b7:ec:1a:cd:26:c5:1a:6c:39:b4:1e
Jan 24, 2018 4:13:54 AM hudson.remoting.jnlp.Main$CuiListener status
INFO: Handshaking
Jan 24, 2018 4:13:54 AM hudson.remoting.jnlp.Main$CuiListener status
INFO: Connecting to jenkins.ad.noodle.ai:50000
Jan 24, 2018 4:13:54 AM hudson.remoting.jnlp.Main$CuiListener status
INFO: Trying protocol: JNLP4-connect
Jan 24, 2018 4:13:54 AM hudson.remoting.jnlp.Main$CuiListener status
INFO: Remote identity confirmed: 5c:bb:b6:29:43:b7:ec:1a:cd:26:c5:1a:6c:39:b4:1e
Jan 24, 2018 4:13:55 AM hudson.remoting.jnlp.Main$CuiListener status
INFO: Connected
Feb 18, 2018 11:43:30 PM hudson.remoting.jnlp.Main$CuiListener status
INFO: Terminated
Feb 18, 2018 11:43:42 PM org.jenkinsci.remoting.engine.JnlpAgentEndpointResolver waitForReady
INFO: Master isn't ready to talk to us on http://jenkins.ad.noodle.ai/tcpSlaveAgentListener/. Will try again: response code=503
Feb 18, 2018 11:43:55 PM org.jenkinsci.remoting.engine.JnlpAgentEndpointResolver waitForReady
INFO: Master isn't ready to talk to us on http://jenkins.ad.noodle.ai/tcpSlaveAgentListener/. Will try again: response code=503
Feb 18, 2018 11:44:05 PM jenkins.slaves.restarter.JnlpSlaveRestarterInstaller$2$1 onReconnect
INFO: Restarting agent via jenkins.slaves.restarter.UnixSlaveRestarter@7610c40e
