# Dependencies for the production environment

-r base.txt

# ------------------------------------------------------------------------------
# PRODUCTION RELATED PACKAGES
# ------------------------------------------------------------------------------