{
	"clientId":"",
	"clientName": "",
	"clientShortName":"",
	"contactName": "",
	"contactEmail": "",
	"contactAddress1": "",
	"contactAddress2": "",
	"city":"",
	"stateCode": "",
	"preferredDateFormat": "",
	"timeZone": "",
	"onBoardedBy": "",
	"isActive": true
}