Feb 18, 2018 11:44:06 PM hudson.remoting.jnlp.Main createEngine
INFO: Setting up slave: MVPDEV
Feb 18, 2018 11:44:06 PM hudson.remoting.jnlp.Main$CuiListener <init>
INFO: Jenkins agent is running in headless mode.
Feb 18, 2018 11:44:06 PM org.jenkinsci.remoting.engine.WorkDirManager initializeWorkDir
INFO: Using /home/appuser/jenkins-files/remoting as a remoting work directory
Feb 18, 2018 11:44:06 PM hudson.remoting.jnlp.Main$CuiListener status
INFO: Locating server among [http://jenkins.ad.noodle.ai/]
Feb 18, 2018 11:44:06 PM org.jenkinsci.remoting.engine.JnlpAgentEndpointResolver resolve
INFO: Remoting server accepts the following protocols: [JNLP4-connect, Ping]
Feb 18, 2018 11:44:06 PM hudson.remoting.jnlp.Main$CuiListener status
INFO: Agent discovery successful
  Agent address: jenkins.ad.noodle.ai
  Agent port:    50000
  Identity:      5c:bb:b6:29:43:b7:ec:1a:cd:26:c5:1a:6c:39:b4:1e
Feb 18, 2018 11:44:06 PM hudson.remoting.jnlp.Main$CuiListener status
INFO: Handshaking
Feb 18, 2018 11:44:06 PM hudson.remoting.jnlp.Main$CuiListener status
INFO: Connecting to jenkins.ad.noodle.ai:50000
Feb 18, 2018 11:44:06 PM hudson.remoting.jnlp.Main$CuiListener status
INFO: Trying protocol: JNLP4-connect
Feb 18, 2018 11:44:07 PM hudson.remoting.jnlp.Main$CuiListener status
INFO: Remote identity confirmed: 5c:bb:b6:29:43:b7:ec:1a:cd:26:c5:1a:6c:39:b4:1e
Feb 18, 2018 11:44:07 PM hudson.remoting.jnlp.Main$CuiListener status
INFO: Connected
Mar 21, 2018 1:07:55 AM hudson.remoting.jnlp.Main$CuiListener status
INFO: Terminated
Mar 21, 2018 1:08:07 AM org.jenkinsci.remoting.engine.JnlpAgentEndpointResolver waitForReady
INFO: Master isn't ready to talk to us on http://jenkins.ad.noodle.ai/tcpSlaveAgentListener/. Will try again: response code=503
Mar 21, 2018 1:08:18 AM org.jenkinsci.remoting.engine.JnlpAgentEndpointResolver waitForReady
INFO: Master isn't ready to talk to us on http://jenkins.ad.noodle.ai/tcpSlaveAgentListener/. Will try again: response code=503
Mar 21, 2018 1:08:28 AM jenkins.slaves.restarter.JnlpSlaveRestarterInstaller$2$1 onReconnect
INFO: Restarting agent via jenkins.slaves.restarter.UnixSlaveRestarter@533986e9
