Mar 21, 2018 1:08:28 AM hudson.remoting.jnlp.Main createEngine
INFO: Setting up slave: MVPDEV
Mar 21, 2018 1:08:28 AM hudson.remoting.jnlp.Main$CuiListener <init>
INFO: Jenkins agent is running in headless mode.
Mar 21, 2018 1:08:28 AM org.jenkinsci.remoting.engine.WorkDirManager initializeWorkDir
INFO: Using /home/appuser/jenkins-files/remoting as a remoting work directory
Mar 21, 2018 1:08:29 AM hudson.remoting.jnlp.Main$CuiListener status
INFO: Locating server among [http://jenkins.ad.noodle.ai/]
Mar 21, 2018 1:08:29 AM org.jenkinsci.remoting.engine.JnlpAgentEndpointResolver resolve
INFO: Remoting server accepts the following protocols: [JNLP4-connect, Ping]
Mar 21, 2018 1:08:29 AM hudson.remoting.jnlp.Main$CuiListener status
INFO: Agent discovery successful
  Agent address: jenkins.ad.noodle.ai
  Agent port:    50000
  Identity:      5c:bb:b6:29:43:b7:ec:1a:cd:26:c5:1a:6c:39:b4:1e
Mar 21, 2018 1:08:29 AM hudson.remoting.jnlp.Main$CuiListener status
INFO: Handshaking
Mar 21, 2018 1:08:29 AM hudson.remoting.jnlp.Main$CuiListener status
INFO: Connecting to jenkins.ad.noodle.ai:50000
Mar 21, 2018 1:08:29 AM hudson.remoting.jnlp.Main$CuiListener status
INFO: Trying protocol: JNLP4-connect
Mar 21, 2018 1:08:29 AM hudson.remoting.jnlp.Main$CuiListener status
INFO: Remote identity confirmed: 5c:bb:b6:29:43:b7:ec:1a:cd:26:c5:1a:6c:39:b4:1e
Mar 21, 2018 1:08:29 AM hudson.remoting.jnlp.Main$CuiListener status
INFO: Connected
Mar 22, 2018 4:29:10 AM hudson.remoting.jnlp.Main$CuiListener status
INFO: Terminated
Mar 22, 2018 4:29:25 AM org.jenkinsci.remoting.engine.JnlpAgentEndpointResolver waitForReady
INFO: Failed to connect to the master. Will try again: java.net.SocketTimeoutException Read timed out
Mar 22, 2018 4:29:35 AM org.jenkinsci.remoting.engine.JnlpAgentEndpointResolver waitForReady
INFO: Master isn't ready to talk to us on http://jenkins.ad.noodle.ai/tcpSlaveAgentListener/. Will try again: response code=503
Mar 22, 2018 4:29:45 AM jenkins.slaves.restarter.JnlpSlaveRestarterInstaller$2$1 onReconnect
INFO: Restarting agent via jenkins.slaves.restarter.UnixSlaveRestarter@5262f600
