<svg xmlns="http://www.w3.org/2000/svg" xmlns:xlink="http://www.w3.org/1999/xlink" preserveAspectRatio="xMidYMid" width="114" height="70" viewBox="0 0 114 70">
  <defs>
    <style>
      .cls-1 {
        fill: #fe6468;
        fill-rule: evenodd;
      }
    </style>
  </defs>
  <path d="M30.399,-0.007 C25.960,-0.007 22.272,3.273 21.651,7.494 L18.999,7.494 C13.429,7.494 8.866,11.997 8.866,17.494 L8.866,26.244 L3.799,26.244 C1.738,26.244 -0.001,27.960 -0.001,29.994 L-0.001,39.994 C-0.001,42.028 1.738,43.744 3.799,43.744 L8.866,43.744 L8.866,52.494 C8.866,57.991 13.429,62.495 18.999,62.495 L21.651,62.495 C22.272,66.715 25.960,69.994 30.399,69.994 L35.465,69.994 C40.334,69.994 44.332,66.049 44.332,61.245 L44.332,43.744 L69.665,43.744 L69.665,61.245 C69.665,66.049 73.663,69.994 78.531,69.994 L83.598,69.994 C88.037,69.994 91.724,66.715 92.346,62.495 L94.998,62.495 C100.568,62.495 105.131,57.991 105.131,52.494 L105.131,43.744 L110.198,43.744 C112.259,43.744 113.998,42.028 113.998,39.994 L113.998,29.994 C113.998,27.960 112.259,26.244 110.198,26.244 L105.131,26.244 L105.131,17.494 C105.131,11.997 100.568,7.494 94.998,7.494 L92.346,7.494 C91.724,3.273 88.037,-0.007 83.598,-0.007 L78.531,-0.007 C73.663,-0.007 69.665,3.940 69.665,8.743 L69.665,26.244 L44.332,26.244 L44.332,8.743 C44.332,3.940 40.334,-0.007 35.465,-0.007 L30.399,-0.007 ZM30.399,4.993 L35.465,4.993 C37.614,4.993 39.265,6.623 39.265,8.743 L39.265,61.245 C39.265,63.366 37.614,64.995 35.465,64.995 L30.399,64.995 C28.250,64.995 26.599,63.366 26.599,61.245 L26.599,8.743 C26.599,6.623 28.250,4.993 30.399,4.993 ZM78.531,4.993 L83.598,4.993 C85.747,4.993 87.398,6.623 87.398,8.743 L87.398,61.245 C87.398,63.366 85.747,64.995 83.598,64.995 L78.531,64.995 C76.382,64.995 74.731,63.366 74.731,61.245 L74.731,8.743 C74.731,6.623 76.382,4.993 78.531,4.993 ZM18.999,12.493 L21.532,12.493 L21.532,57.494 L18.999,57.494 C16.148,57.494 13.932,55.308 13.932,52.494 L13.932,17.494 C13.932,14.680 16.148,12.493 18.999,12.493 ZM92.465,12.493 L94.998,12.493 C97.848,12.493 100.064,14.680 100.064,17.494 L100.064,52.494 C100.064,55.308 97.848,57.494 94.998,57.494 L92.465,57.494 L92.465,12.493 ZM5.066,31.244 L8.866,31.244 L8.866,38.745 L5.066,38.745 L5.066,31.244 ZM44.332,31.244 L69.665,31.244 L69.665,38.745 L44.332,38.745 L44.332,31.244 ZM105.131,31.244 L108.931,31.244 L108.931,38.745 L105.131,38.745 L105.131,31.244 Z" class="cls-1"/>
</svg>
