# 1 "pwm.c"
# 1 "<built-in>" 1
# 1 "<built-in>" 3
# 288 "<built-in>" 3
# 1 "<command line>" 1
# 1 "<built-in>" 2
# 1 "C:/Program Files/Microchip/MPLABX/v5.50/packs/Microchip/PIC18Fxxxx_DFP/1.2.26/xc8\\pic\\include\\language_support.h" 1 3
# 2 "<built-in>" 2
# 1 "pwm.c" 2

