__S0 7F00 0 ABS 0
__S1 7 0 ABS 0
__S2 0 0 ABS 0
__S4 0 0 ABS 0
__S5 0 0 ABS 0
_ISR 8 0 CODE 0
__Hintentry 0 0 ABS 0
__Lintentry 0 0 ABS 0
_PEIE 7F96 0 ABS 0
_GIEH 7F97 0 ABS 0
_main 7EC8 0 CODE 0
___sp 0 0 STACK 2
btemp 6 0 COMRAM 1
start E 0 CODE 0
_TRISA F92 0 ABS 0
_TRISC F94 0 ABS 0
_PORTA F80 0 ABS 0
__Hirdata 0 0 CODE 0
__Lirdata 0 0 CODE 0
_PORTC F82 0 ABS 0
__HRAM 0 0 ABS 0
__LRAM 1 0 ABS 0
ttemp5 7 0 COMRAM 1
__end_of_delay 7EC8 0 CODE 0
ttemp6 A 0 COMRAM 1
ttemp7 E 0 COMRAM 1
wtemp8 7 0 COMRAM 1
__Hconfig 30000E 0 CONFIG 4
__Lconfig 0 0 CONFIG 4
__Hbigram 0 0 ABS 0
__Lbigram 0 0 ABS 0
__Hrparam 0 0 COMRAM 1
__Lrparam 0 0 COMRAM 1
__Hram 0 0 ABS 0
__Lram 0 0 ABS 0
__Hcomram 0 0 ABS 0
__Lcomram 0 0 ABS 0
__Hsfr 0 0 ABS 0
__Lsfr 0 0 ABS 0
__Hbss 0 0 RAM 1
__Lbss 0 0 RAM 1
___param_bank 0 0 ABS 0
__Hnvrram 0 0 COMRAM 1
_delay 7E98 0 CODE 0
__Lnvrram 0 0 COMRAM 1
int$flags 6 0 COMRAM 1
__end_of_ISR 7E98 0 CODE 0
_ADCON1 FC1 0 ABS 0
__Heeprom_data 0 0 EEDATA 0
__Leeprom_data 0 0 EEDATA 0
_INT0IE 7F94 0 ABS 0
__Hintsave_regs 0 0 BIGRAM 1
__Lintsave_regs 0 0 BIGRAM 1
_INT0IF 7F91 0 ABS 0
__Hbigbss 0 0 BIGRAM 1
__Lbigbss 0 0 BIGRAM 1
__Hintret 0 0 ABS 0
__Lintret 0 0 ABS 0
__Hramtop 600 0 RAM 0
__Lramtop 600 0 RAM 0
__Hstruct 0 0 COMRAM 1
__Lstruct 0 0 COMRAM 1
__Hbigdata 0 0 BIGRAM 1
__Lbigdata 0 0 BIGRAM 1
__Hmediumconst 0 0 MEDIUMCONST 0
__Lmediumconst 0 0 MEDIUMCONST 0
__Hfarbss 0 0 FARRAM 0
__Lfarbss 0 0 FARRAM 0
__Hintcode E 0 CODE 0
__Lintcode 8 0 CODE 0
__Hfardata 0 0 FARRAM 0
__Lfardata 0 0 FARRAM 0
__pintcode 8 0 CODE 0
__Habs1 0 0 ABS 0
__Labs1 0 0 ABS 0
isa$xinst 0 0 ABS 0
__HnvFARRAM 0 0 FARRAM 0
__LnvFARRAM 0 0 FARRAM 0
__size_of_delay 0 0 ABS 0
delay@i 4 0 COMRAM 1
__Hdata 0 0 ABS 0
__Ldata 0 0 ABS 0
isa$std 1 0 ABS 0
stackhi 5FF 0 ABS 0
__Htemp 7 0 COMRAM 1
__Ltemp 6 0 COMRAM 1
stacklo 60 0 ABS 0
__Hrbit 0 0 COMRAM 1
__Lrbit 0 0 COMRAM 1
__Hinit 12 0 CODE 0
__Linit E 0 CODE 0
__Hintcodelo E 0 CODE 0
__Lintcodelo E 0 CODE 0
__Hrbss 0 0 COMRAM 1
__end_of_main 7F00 0 CODE 0
__Lrbss 0 0 COMRAM 1
__Htext 0 0 ABS 0
__Ltext 0 0 ABS 0
end_of_initialization 7E76 0 CODE 0
__size_of_ISR 0 0 ABS 0
__Hibigdata 0 0 CODE 0
__Libigdata 0 0 CODE 0
__Hifardata 0 0 CODE 0
__Lifardata 0 0 CODE 0
__Hbank0 0 0 ABS 0
__Lbank0 0 0 ABS 0
__Hbank1 0 0 ABS 0
__Lbank1 0 0 ABS 0
__Hbank2 0 0 ABS 0
__Lbank2 0 0 ABS 0
__Hbank3 0 0 ABS 0
__Lbank3 0 0 ABS 0
__Hbank4 0 0 ABS 0
__Lbank4 0 0 ABS 0
__Hbank5 0 0 ABS 0
__Lbank5 0 0 ABS 0
__Hpowerup E 0 CODE 0
__Lpowerup E 0 CODE 0
__Htext0 0 0 ABS 0
__Ltext0 0 0 ABS 0
__Htext1 0 0 ABS 0
__Ltext1 0 0 ABS 0
__ptext0 7EC8 0 CODE 0
__ptext1 7E98 0 CODE 0
__Hclrtext 0 0 ABS 0
__Lclrtext 0 0 ABS 0
__end_of__initialization 7E76 0 CODE 0
___rparam_used 1 0 ABS 0
__Hidata 0 0 CODE 0
__Lidata 0 0 CODE 0
__Hrdata 0 0 COMRAM 1
__Lrdata 0 0 COMRAM 1
__Hidloc 200008 0 IDLOC 5
__Lidloc 0 0 IDLOC 5
__Hstack 0 0 STACK 2
__Lstack 0 0 STACK 2
int_func 7E80 0 CODE 0
__Hparam 0 0 COMRAM 1
__Lparam 0 0 COMRAM 1
__Hspace_0 7F00 0 ABS 0
__HcstackCOMRAM 0 0 ABS 0
__Lspace_0 0 0 ABS 0
__LcstackCOMRAM 0 0 ABS 0
__pcstackCOMRAM 1 0 COMRAM 1
delay@ms 1 0 COMRAM 1
__Hspace_1 7 0 ABS 0
__Lspace_1 0 0 ABS 0
__Hsmallconst 0 0 SMALLCONST 0
__Lsmallconst 0 0 SMALLCONST 0
__Hspace_2 0 0 ABS 0
__Lspace_2 0 0 ABS 0
__Hnvbit 0 0 COMRAM 1
__Lnvbit 0 0 COMRAM 1
__Hcinit 0 0 ABS 0
__Lcinit 0 0 ABS 0
__pcinit 7E76 0 CODE 0
__ramtop 600 0 RAM 0
__mediumconst 0 0 MEDIUMCONST 0
__size_of_main 0 0 ABS 0
__Hconst 0 0 CONST 0
__Lconst 0 0 CONST 0
__Hspace_4 60000E 0 ABS 0
__Lspace_4 0 0 ABS 0
___inthi_sp 0 0 STACK 2
___intlo_sp 0 0 STACK 2
__smallconst 0 0 SMALLCONST 0
__Hreset_vec 4 0 CODE 0
__Lreset_vec 0 0 CODE 0
__accesstop 60 0 ABS 0
__Hintcode_body 0 0 ABS 0
__Lintcode_body 0 0 ABS 0
__pintcode_body 7E80 0 CODE 0
intlevel0 0 0 CODE 0
intlevel1 0 0 CODE 0
intlevel2 0 0 CODE 0
intlevel3 0 0 CODE 0
start_initialization 7E76 0 CODE 0
__initialization 7E76 0 CODE 0
__activetblptr 0 0 ABS 0
%segments
reset_vec 0 3 CODE 0 0
intcode 8 11 CODE 8 0
cstackCOMRAM 1 6 COMRAM 1 1
text0 7EC8 7EFF CODE 7EC8 0
text1 7E98 7EC7 CODE 7E98 0
intcode_body 7E80 7E97 CODE 7E80 0
cinit 7E76 7E7F CODE 7E76 0
%locals
dist/default/production\Interrupt.X.production.o
C:/Users/Dell7270/.mchp_packs/Microchip/PIC18Fxxxx_DFP/1.3.36/xc8\pic\include\proc\pic18f4580.h
C:\Users\Dell7270\AppData\Local\Temp\xcAs53k.s
968 7E76 0 CODE 0
970 7E76 0 CODE 0
973 7E76 0 CODE 0
979 7E76 0 CODE 0
981 7E76 0 CODE 0
982 7E78 0 CODE 0
983 7E7A 0 CODE 0
984 7E7C 0 CODE 0
interrupt.c
3 7EC8 0 CODE 0
4 7EC8 0 CODE 0
5 7ECC 0 CODE 0
6 7ED0 0 CODE 0
7 7ED4 0 CODE 0
8 7ED6 0 CODE 0
9 7ED8 0 CODE 0
10 7EDA 0 CODE 0
11 7EDA 0 CODE 0
12 7EDE 0 CODE 0
13 7EEA 0 CODE 0
14 7EEC 0 CODE 0
interrupt.c
24 7E98 0 CODE 0
25 7E98 0 CODE 0
27 7EA4 0 CODE 0
28 7EC6 0 CODE 0
C:\Users\Dell7270\AppData\Local\Temp\xcAs53k.s
1379 8 0 CODE 0
interrupt.c
17 8 0 CODE 0
interrupt.c
17 7E80 0 CODE 0
18 7E82 0 CODE 0
19 7E90 0 CODE 0
21 7E92 0 CODE 0
22 7E94 0 CODE 0
