:020000040000FA
:1000000018F09FE518F09FE518F09FE518F09FE5C0
:1000100018F09FE50000A0E1F0FF1FE518F09FE554
:1000200058000000400000004400000048000000AC
:100030004C000000000000005000000054000000D0
:10004000FEFFFFEAFEFFFFEAFEFFFFEAFEFFFFEA18
:10005000FEFFFFEAFEFFFFEAAC009FE50010A0E311
:10006000001080E5A4009FE5AA10A0E35520A0E3BE
:100070002430A0E3043080E50130A0E3003080E5C7
:100080000C1080E50C2080E5083090E5013B13E280
:10009000FCFFFF0A0330A0E3003080E50C1080E590
:1000A0000C2080E568009FE50410A0E3041080E5C3
:1000B0000210A0E3001080E558009FE5DBF021E38B
:1000C00000D0A0E1000040E2D7F021E300D0A0E1A1
:1000D000000040E2D1F021E300D0A0E1000040E2C6
:1000E000D2F021E300D0A0E1800040E2D3F021E390
:1000F00000D0A0E1080040E210F021E300D0A0E130
:1001000001AB4DE210009FE510FF2FE100C11FE0A1
:1001100080C01FE000C01FE0E80400402001000094
:10012000000000EB250000EB2C008FE2000C90E8B3
:1001300000A08AE000B08BE001704AE20B005AE1B7
:100140000000001A1D0000EB0F00BAE818E04FE2B3
:10015000010013E303F0471013FF2FE1AC0200008E
:10016000BC0200000030B0E30040B0E30050B0E358
:100170000060B0E3102052E27800A128FCFFFF8A63
:10018000822EB0E13000A128003081451EFF2FE112
:1001900001C08FE21CFF2FE11FB500F031F9059877
:1001A00086460FBC009C02B07047000001C08FE281
:1001B0001CFF2FE130B47546AE4630BC70470000DE
:1001C000690000EB0210A0E1F0FFFFEB1CC09FE50F
:1001D0000FC08CE001001CE30DE08F120FE0A001C6
:1001E0001CFF2FE101C08FE21CFF2FE100F0EEF8B1
:1001F000F00000007847C046EBFFFFEB780000EB13
:100200000C009FE50C109FE504209FE508309FE55A
:100210001EFF2FE1600000406004004060000040CD
:100220000010A0E3050000EA0000A0E3000000EADF
:10023000010080E27D0F50E3FCFFFFBA011081E274
:10024000050051E3F7FFFFDA1EFF2FE104E02DE583
:100250000030A0E10000E0E3FC109FE50C0081E528
:100260000308A0E1040081E5090BA0E3040081E597
:10027000EAFFFFEB020AA0E3DC109FE50C0081E53A
:1002800004E09DE41EFF2FE104E02DE50030A0E135
:100290000000E0E3C0109FE50C0081E50308A0E149
:1002A000040081E5020AA0E3040081E5DBFFFFEB27
:1002B000020AA0E3A0109FE50C0081E5D7FFFFEB49
:1002C00004E09DE41EFF2FE110402DE90F00E0E364
:1002D00084109FE5080081E50400A0E3001681E199
:1002E000000081E53800A0E3E6FFFFEB8000A0E31B
:1002F000E4FFFFEB0100A0E3E2FFFFEB0600A0E359
:10030000E0FFFFEB0F00A0E3DEFFFFEB8300A0E3C5
:1003100048109FE50C00C1E50000A0E30400C1E522
:100320006100A0E30000C1E50300A0E30C00C1E50B
:10033000080000EA0000A0E120009FE51400D0E5DD
:10034000010010E3FBFFFF0A10009FE50040D0E52D
:100350000400A0E1BCFFFFEBF5FFFFEA008002E034
:1003600000C000E070477047704700000E50A0E1E9
:10037000180000EB05E0A0E10050B0E10D10A0E195
:100380000A30A0E10700C0E300D0A0E160D08DE218
:1003900020402DE999FFFFEB2040BDE80060A0E37D
:1003A0000070A0E30080A0E300B0A0E30710C1E369
:1003B00005C0A0E1C009ACE8C009ACE8C009ACE8E0
:1003C000C009ACE801D0A0E11EFF2FE10400C04647
:1003D000C0462000FFF70EFF00009FE51EFF2FE143
:1003E000000000400C109FE51800A0E3563412EF07
:1003F0001EFF2FE108000000260002001EFF2FE173
:100400007847C0461EFF2FE118040000000000409E
:08041000E80400006401000093
:0400000500000120D6
:00000001FF
