:020000040000FA
:1000000018F09FE518F09FE518F09FE518F09FE5C0
:1000100018F09FE50000A0E1F0FF1FE518F09FE554
:1000200058000000400000004400000048000000AC
:100030004C000000000000005000000054000000D0
:10004000FEFFFFEAFEFFFFEAFEFFFFEAFEFFFFEA18
:10005000FEFFFFEAFEFFFFEAAC009FE50010A0E311
:10006000001080E5A4009FE5AA10A0E35520A0E3BE
:100070002430A0E3043080E50130A0E3003080E5C7
:100080000C1080E50C2080E5083090E5013B13E280
:10009000FCFFFF0A0330A0E3003080E50C1080E590
:1000A0000C2080E568009FE50410A0E3041080E5C3
:1000B0000210A0E3001080E558009FE5DBF021E38B
:1000C00000D0A0E1000040E2D7F021E300D0A0E1A1
:1000D000000040E2D1F021E300D0A0E1000040E2C6
:1000E000D2F021E300D0A0E1800040E2D3F021E390
:1000F00000D0A0E1080040E210F021E300D0A0E130
:1001000001AB4DE210009FE510FF2FE100C11FE0A1
:1001100080C01FE000C01FE0E80400402001000094
:10012000000000EB250000EB2C008FE2000C90E8B3
:1001300000A08AE000B08BE001704AE20B005AE1B7
:100140000000001A1D0000EB0F00BAE818E04FE2B3
:10015000010013E303F0471013FF2FE19C0200009E
:10016000AC0200000030B0E30040B0E30050B0E368
:100170000060B0E3102052E27800A128FCFFFF8A63
:10018000822EB0E13000A128003081451EFF2FE112
:1001900001C08FE21CFF2FE11FB500F029F905987F
:1001A00086460FBC009C02B07047000001C08FE281
:1001B0001CFF2FE130B47546AE4630BC70470000DE
:1001C000650000EB0210A0E1F0FFFFEB1CC09FE513
:1001D0000FC08CE001001CE30DE08F120FE0A001C6
:1001E0001CFF2FE101C08FE21CFF2FE100F0E6F8B9
:1001F000F40000007847C046EBFFFFEB740000EB13
:100200000C009FE50C109FE504209FE508309FE55A
:100210001EFF2FE1600000406004004060000040CD
:100220000010A0E3050000EA0000A0E3000000EADF
:10023000010080E2C80050E3FCFFFFBA011081E238
:100240007D0F51E3F7FFFFBA1EFF2FE104E02DE51C
:100250000030A0E10000E0E3E4109FE50C0081E540
:100260000308A0E1040081E5090BA0E3040081E597
:10027000EAFFFFEB020AA0E3C4109FE50C0081E552
:10028000E6FFFFEB04E09DE41EFF2FE104E02DE517
:100290000030A0E10000E0E3A4109FE50C0081E540
:1002A0000308A0E1040081E5020AA0E3040081E55F
:1002B000DAFFFFEB020AA0E384109FE50C0081E562
:1002C000D6FFFFEB04E09DE41EFF2FE11C402DE96B
:1002D00070108FE2030091E803008DE80000A0E3B6
:1002E00068109FE5000081E5040081E50000E0E37F
:1002F000A018C1E1080081E53800A0E3E2FFFFEBB0
:100300008000A0E3E0FFFFEB0100A0E3DEFFFFEBD6
:100310000600A0E3DCFFFFEB0F00A0E3DAFFFFEB3A
:100320000040A0E3020000EA0400DDE7C6FFFFEBA7
:10033000014084E2060054E3FAFFFF1A0000A0E146
:10034000FEFFFFEA008002E068656C6C6F770000DA
:1003500000C002E070477047704700000E50A0E1F7
:10036000180000EB05E0A0E10050B0E10D10A0E1A5
:100370000A30A0E10700C0E300D0A0E160D08DE228
:1003800020402DE99DFFFFEB2040BDE80060A0E389
:100390000070A0E30080A0E300B0A0E30710C1E379
:1003A00005C0A0E1C009ACE8C009ACE8C009ACE8F0
:1003B000C009ACE801D0A0E11EFF2FE10400C04657
:1003C000C0462000FFF716FF00009FE51EFF2FE14B
:1003D000000000400C109FE51800A0E3563412EF17
:1003E0001EFF2FE108000000260002001EFF2FE183
:1003F0007847C0461EFF2FE10804000000000040BF
:08040000E804000064010000A3
:0400000500000120D6
:00000001FF
