#include<pic18.h>
void transmit(char);
void display(char *p);
void main(){
    char arr[]="oidhdusoinb";
    TXSTA=0x24;
    RCSTA=0x90;
    SPBRG=129;
    display(arr);
    while(1);
    
}
void transmit(char a){
    TXREG=a;
    while(TXIF==0);
     TXIF=0;
}
void display(char *p){
    while (*p!='\0')
    {
    transmit(*p);
    p++;
    }
}