# 1 "LCD switch.c"
# 1 "<built-in>" 1
# 1 "<built-in>" 3
# 288 "<built-in>" 3
# 1 "<command line>" 1
# 1 "<built-in>" 2
# 1 "C:/Users/Dell7270/.mchp_packs/Microchip/PIC18Fxxxx_DFP/1.3.36/xc8\\pic\\include\\language_support.h" 1 3
# 2 "<built-in>" 2
# 1 "LCD switch.c" 2

