:020000040000FA
:1000000018F09FE518F09FE518F09FE518F09FE5C0
:1000100018F09FE50000A0E1F0FF1FE518F09FE554
:1000200058000000400000004400000048000000AC
:100030004C000000000000005000000054000000D0
:10004000FEFFFFEAFEFFFFEAFEFFFFEAFEFFFFEA18
:10005000FEFFFFEAFEFFFFEAAC009FE50010A0E311
:10006000001080E5A4009FE5AA10A0E35520A0E3BE
:100070002430A0E3043080E50130A0E3003080E5C7
:100080000C1080E50C2080E5083090E5013B13E280
:10009000FCFFFF0A0330A0E3003080E50C1080E590
:1000A0000C2080E568009FE50410A0E3041080E5C3
:1000B0000210A0E3001080E558009FE5DBF021E38B
:1000C00000D0A0E1000040E2D7F021E300D0A0E1A1
:1000D000000040E2D1F021E300D0A0E1000040E2C6
:1000E000D2F021E300D0A0E1800040E2D3F021E390
:1000F00000D0A0E1080040E210F021E300D0A0E130
:1001000001AB4DE210009FE510FF2FE100C11FE0A1
:1001100080C01FE000C01FE0E80400402001000094
:10012000000000EB250000EB2C008FE2000C90E8B3
:1001300000A08AE000B08BE001704AE20B005AE1B7
:100140000000001A1D0000EB0F00BAE818E04FE2B3
:10015000010013E303F0471013FF2FE12003000019
:10016000300300000030B0E30040B0E30050B0E3E3
:100170000060B0E3102052E27800A128FCFFFF8A63
:10018000822EB0E13000A128003081451EFF2FE112
:1001900001C08FE21CFF2FE11FB500F06BF905983D
:1001A00086460FBC009C02B07047000001C08FE281
:1001B0001CFF2FE130B47546AE4630BC70470000DE
:1001C000860000EB0210A0E1F0FFFFEB1CC09FE5F2
:1001D0000FC08CE001001CE30DE08F120FE0A001C6
:1001E0001CFF2FE101C08FE21CFF2FE100F028F976
:1001F000600000007847C046EBFFFFEB950000EB86
:100200000C009FE50C109FE504209FE508309FE55A
:100210001EFF2FE1600000406004004060000040CD
:100220000010A0E3000000EA011081E2000051E1AB
:10023000FCFFFFBA1EFF2FE110402DE90000A0E3F4
:1002400078119FE5000081E5040081E50000E0E30E
:10025000A018C1E1080081E50000A0E3180081E5D5
:10026000550000EA58019FE5100090E5010810E3F1
:100270001000000A0000E0E344119FE50C0081E556
:1002800040019FE5040081E5000180E1040081E573
:1002900034019FE5E1FFFFEB0000E0E320119FE563
:1002A0000C0081E524019FE5040081E518019FE52C
:1002B000DAFFFFEB3F0000EA04019FE5100090E544
:1002C000020810E30A00000A0000E0E3F0109FE5D6
:1002D0000C0081E5F0009FE5D0FFFFEB0000E0E3BC
:1002E000DC109FE5040081E5DC009FE5CBFFFFEB20
:1002F000300000EAC8009FE5100090E5010710E318
:100300001000000A0231A0E30040A0E30A0000EA66
:100310005304A0E1A8109FE5040081E5B0009FE52B
:10032000BEFFFFEB5304A0E194109FE50C0081E5B4
:100330009C009FE5B9FFFFEB014084E21F0054E3FE
:10034000F2FFFFDA1B0000EA74009FE5100090E561
:10035000020710E31700000A0100A0E360109FE508
:10036000040081E50030A0E3100000EA50009FE5A2
:10037000040090E50110A0E3110380E140109FE527
:10038000040081E548009FE5A4FFFFEB30009FE5F6
:100390000C0090E50110A0E3110380E120109FE51F
:1003A0000C0081E528009FE59CFFFFEB013083E214
:1003B0001F0053E3ECFFFFDA0000A0E1A8FFFFEA13
:1003C00000C002E0008002E02222222240420F0010
:1003D000555555551027000070477047704700006D
:1003E0000E50A0E1180000EB05E0A0E10050B0E1E4
:1003F0000D10A0E10A30A0E10700C0E300D0A0E1A9
:1004000060D08DE220402DE97CFFFFEB2040BDE86D
:100410000060A0E30070A0E30080A0E300B0A0E3D0
:100420000710C1E305C0A0E1C009ACE8C009ACE811
:10043000C009ACE8C009ACE801D0A0E11EFF2FE183
:100440000400C046C0462000FFF7D4FE00009FE530
:100450001EFF2FE1000000400C109FE51800A0E3F4
:10046000563412EF1EFF2FE10800000026000200A4
:100470001EFF2FE17847C0461EFF2FE18C040000CD
:0C04800000000040E804000064010000DF
:0400000500000120D6
:00000001FF
