#include<pic18.h>
void timer();

void main(){
    TRISA=0x00;
    PORTA=0x00;
    T1CON=0x79;
    TMR1L=0x96;
    TMR1H=0xE7;
  while(1){
        RA0=1;
        timer();
        RA0=0;
        timer();
    }
}
void timer(){
   // for(int i=0;i<=9;i++){
    while (TMR1IF==0);
        TMR1IF=0;
        TMR1L=0x96;
        TMR1H=0xE7;
  //  }
}