"HB_BUSAVG$Month.A","HB_BUSAVG$Month.B","HB_BUSAVG$Month.C","HB_BUSAVG$Month.D","HB_BUSAVG$Month.E","HB_BUSAVG$Month.F","HB_BUSAVG$Month.G","HB_BUSAVG$Month.H","HB_BUSAVG$Month.I","HB_BUSAVG$Month.J","HB_BUSAVG$Month.K","HB_BUSAVG$Month.L","HB_BUSAVG$Month.M","HB_BUSAVG$Month.N","MonthAvg.A","MonthAvg.B","MonthAvg.C","MonthAvg.D","MonthAvg.E","MonthAvg.F","MonthAvg.G","MonthAvg.H","MonthAvg.I","MonthAvg.J","MonthAvg.K","MonthAvg.L","MonthAvg.M","MonthAvg.N"
1,1,1,1,1,1,1,1,1,1,1,1,1,1,19.2093010752688,19.5657258064516,19.2586962365591,19.1333064516129,19.2100537634409,19.1265591397849,19.3246639784946,19.3538440860215,19.563938172043,19.3174596774194,19.187997311828,19.4479435483871,19.4817204301075,19.5192607526882
2,2,2,2,2,2,2,2,2,2,2,2,2,2,15.2882471264368,15.4645402298851,15.2692528735632,15.292658045977,15.333591954023,14.9886637931034,15.4482902298851,15.5200143678161,15.4879885057471,15.4885488505747,15.4622126436782,15.4004310344828,15.9358620689655,15.0444827586207
3,3,3,3,3,3,3,3,3,3,3,3,3,3,16.7556258411844,17.1249528936743,16.6543472409152,16.8593674293405,16.7631090174966,15.871668909825,16.8550740242261,16.8981830417227,17.2067294751009,16.7962987886945,17.4615074024226,17.1172409152086,19.5211440107672,16.0026514131898
4,4,4,4,4,4,4,4,4,4,4,4,4,4,18.2893472222222,18.9409583333333,18.1668611111111,18.3506666666667,18.5129027777778,16.86275,18.2560694444444,19.0693611111111,19.1289305555556,18.3927083333333,19.0876388888889,18.8553611111111,20.738,17.1536666666667
5,5,5,5,5,5,5,5,5,5,5,5,5,5,18.1595833333333,19.1740860215054,18.247002688172,17.9056317204301,18.5704569892473,17.3376747311828,18.1249059139785,18.4798655913979,19.9039919354839,18.1827822580645,18.1828897849462,18.3209946236559,20.691747311828,17.7375268817204
6,6,6,6,6,6,6,6,6,6,6,6,6,6,23.9098194444444,26.2557361111111,24.2978472222222,23.1580555555556,24.645375,23.1419305555556,24.2375138888889,24.9580694444444,29.9150833333333,24.1644166666667,23.5626805555556,23.3159444444444,27.4716527777778,23.4887638888889
7,7,7,7,7,7,7,7,7,7,7,7,7,7,27.1874731182796,29.5389247311828,27.4592069892473,26.8007930107527,26.9602553763441,26.543561827957,27.9761021505376,27.9679569892473,29.9118682795699,27.5922177419355,27.4157795698925,27.4710752688172,28.8895833333333,27.1787903225806
8,8,8,8,8,8,8,8,8,8,8,8,8,8,30.5671370967742,32.9725403225806,30.9485349462366,29.8283870967742,31.2079704301075,29.7867338709677,30.6995161290323,31.3065725806452,33.5635483870968,31.1755779569892,30.1485752688172,30.1497580645161,31.8233064516129,30.010564516129
9,9,9,9,9,9,9,9,9,9,9,9,9,9,26.86175,28.7424166666667,27.1881388888889,26.2491805555556,27.4055694444444,26.35425,26.7108611111111,28.13025,29.0326805555556,27.0399444444444,26.6058611111111,26.4702638888889,28.7620138888889,26.7676666666667
10,10,10,10,10,10,10,10,10,10,10,10,10,10,25.2048387096774,28.2495564516129,25.7690591397849,24.0052553763441,26.6896639784946,24.113938172043,25.6229032258064,26.2502956989247,28.5458198924731,26.0684408602151,24.5326612903226,24.4525134408602,30.0310349462366,25.1822580645161
11,11,11,11,11,11,11,11,11,11,11,11,11,11,19.2449027777778,20.3659305555556,19.4893055555556,18.6648888888889,20.1488333333333,18.7784166666667,19.6400416666667,21.7146666666667,20.4376805555556,19.5416805555556,18.8305138888889,18.8753194444444,20.6333888888889,19.3431388888889
12,12,12,12,12,12,12,12,12,12,12,12,12,12,25.3183064516129,25.7276612903226,25.3625940860215,25.1490456989247,25.7089919354839,24.8626612903226,25.8701747311828,26.5964247311828,25.7368413978495,25.487876344086,25.28625,25.3195564516129,26.3268413978495,25.1658198924731
13,13,13,13,13,13,13,13,13,13,13,13,13,13,23.2527822580645,24.7818548387097,23.3255510752688,22.9918548387097,23.624811827957,21.9017204301075,23.4044758064516,23.7725672043011,24.8273655913979,23.4362768817204,23.6030241935484,23.3901075268817,25.1554838709677,23.2313709677419
14,14,14,14,14,14,14,14,14,14,14,14,14,14,20.1178273809524,23.2657142857143,20.3521279761905,19.4481994047619,21.0793601190476,17.616681547619,20.6053273809524,20.9194791666667,23.5172172619048,20.660818452381,19.5500148809524,20.3691517857143,21.7936904761905,18.4770535714286
15,15,15,15,15,15,15,15,15,15,15,15,15,15,22.5698923283984,28.2132974427995,23.2332301480485,21.2277792732167,23.6807537012113,19.8135935397039,22.9970121130552,23.8615477792732,28.7420053835801,23.437133243607,21.8394078061911,21.9071601615074,26.5282099596232,20.251197846568
16,16,16,16,16,16,16,16,16,16,16,16,16,16,23.7050833333333,32.2957361111111,24.8304861111111,21.4105555555556,25.6094027777778,19.9960972222222,24.1180833333333,25.3379027777778,32.9670694444444,24.4774166666667,21.9758055555556,22.2134305555556,28.5498888888889,20.3885694444444
17,17,17,17,17,17,17,17,17,17,17,17,17,17,25.0873521505376,31.5331720430108,25.9050268817204,23.4199193548387,26.4950134408602,22.1666129032258,25.2938440860215,26.5370295698925,32.3626478494624,25.6379569892473,24.5575134408602,24.0013306451613,29.9797311827957,22.8677956989247
18,18,18,18,18,18,18,18,18,18,18,18,18,18,27.6691527777778,33.1683472222222,28.5138472222222,25.8905694444444,29.6546944444444,25.3316944444444,27.9166388888889,30.416,33.6689166666667,28.6390833333333,26.8937361111111,26.1250416666667,36.7834444444444,27.5123194444444
19,19,19,19,19,19,19,19,19,19,19,19,19,19,31.4542741935484,34.3758333333333,31.8644086021505,30.654314516129,32.1294623655914,30.2936424731183,31.401438172043,32.1152956989247,34.7258333333333,31.9057123655914,31.1868413978495,30.760497311828,34.1932930107527,31.1301747311828
20,20,20,20,20,20,20,20,20,20,20,20,20,20,27.5070161290323,29.4017204301075,27.8386155913979,26.8327284946237,28.3150268817204,26.8170430107527,27.4656182795699,28.1375672043011,30.0314784946237,27.6780107526882,27.0603629032258,26.8248252688172,33.4578494623656,27.2139112903226
21,21,21,21,21,21,21,21,21,21,21,21,21,21,24.1841666666667,26.5429444444444,24.5196944444444,23.3461111111111,25.5150972222222,22.6788194444444,24.6288055555556,25.1366527777778,27.4100277777778,24.8134305555556,23.9684027777778,23.5356805555556,28.3303472222222,27.0117777777778
22,22,22,22,22,22,22,22,22,22,22,22,22,22,23.5632795698925,30.1412365591398,24.7014516129032,21.4059005376344,25.5636559139785,21.6938306451613,24.0199059139785,25.2759543010753,31.3393817204301,24.4842607526882,21.9384274193548,21.3799327956989,28.4640188172043,22.1733198924731
23,23,23,23,23,23,23,23,23,23,23,23,23,23,22.6774583333333,26.0910555555556,23.1671388888889,21.5962083333333,23.9771805555556,21.0017916666667,23.0194444444444,23.5725694444444,26.339625,23.047125,22.2631666666667,21.8291805555556,27.8657222222222,22.1529166666667
24,24,24,24,24,24,24,24,24,24,24,24,24,24,21.1879569892473,21.5490053763441,21.2098521505376,20.952997311828,21.9979166666667,20.3380376344086,21.0629301075269,22.048373655914,21.9797849462366,21.1176612903226,21.4081317204301,21.3126075268817,25.4042204301075,21.8722580645161
25,25,25,25,25,25,25,25,25,25,25,25,25,25,37.8696774193548,37.9447849462366,37.7730376344086,37.5859005376344,39.4981451612903,36.0516397849462,38.8379838709677,41.312876344086,38.0449865591398,38.9925672043011,37.7285215053763,39.3701478494624,46.1325672043011,37.2933064516129
26,26,26,26,26,26,26,26,26,26,26,26,26,26,21.8543154761905,22.1641071428571,21.8300595238095,21.7670238095238,22.3063988095238,21.0876041666667,21.9138839285714,22.5173958333333,22.3758482142857,21.7622470238095,21.8404613095238,22.4031696428571,25.1970386904762,22.1241071428571
27,27,27,27,27,27,27,27,27,27,27,27,27,27,22.5619784656797,23.7825437415882,22.4034320323015,22.6080080753701,22.8884522207268,20.3336204576043,22.2028263795424,25.2892732166891,23.9334589502019,22.0513055181696,22.6405518169583,23.8057065948856,26.7599730820996,22.3016285329744
28,28,28,28,28,28,28,28,28,28,28,28,28,28,23.1429583333333,24.6526944444444,22.4503055555556,23.5229166666667,24.4718888888889,17.156625,22.1884861111111,26.535375,24.7283472222222,22.6440277777778,24.3668888888889,27.198875,28.1869722222222,21.128125
29,29,29,29,29,29,29,29,29,29,29,29,29,29,34.0052419354839,34.1475537634409,32.8348521505376,35.3061424731183,34.2260752688172,27.6920161290323,33.1661693548387,36.0555913978495,35.5330376344086,34.7354032258065,37.4518817204301,40.95125,41.2744220430108,49.6001209677419
30,30,30,30,30,30,30,30,30,30,30,30,30,30,29.966125,30.6284861111111,29.7818611111111,30.2118888888889,30.0686388888889,28.2770277777778,30.286125,30.7272777777778,31.8023472222222,30.3655555555556,31.3016111111111,31.9455833333333,32.2586805555556,57.9675277777778
31,31,31,31,31,31,31,31,31,31,31,31,31,31,78.8594489247312,79.0340456989247,78.8323252688172,78.9684543010753,78.8473790322581,78.5175537634409,78.9513709677419,79.124435483871,79.5665322580645,79.0699462365591,79.8461827956989,84.9019086021505,80.4475672043011,101.470967741935
32,32,32,32,32,32,32,32,32,32,32,32,32,32,31.6615591397849,31.944247311828,31.6945833333333,31.6030510752688,31.6675268817204,31.5601209677419,31.7321370967742,31.865685483871,32.159623655914,31.8079704301075,31.9715860215054,32.5187231182796,33.6906317204301,33.2898521505376
33,33,33,33,33,33,33,33,33,33,33,33,33,33,27.1754444444444,27.5813611111111,27.0530277777778,27.2996388888889,27.1898055555556,26.1395972222222,27.1673055555556,27.5129861111111,27.7224166666667,27.1872638888889,27.8858472222222,27.6808888888889,28.3837638888889,27.1010972222222
34,34,34,34,34,34,34,34,34,34,34,34,34,34,29.9578225806452,30.981935483871,29.8891129032258,30.0341666666667,29.7725134408602,28.7613306451613,30.31,31.6359677419355,31.7811155913978,30.0698790322581,31.6454166666667,30.6249596774194,32.1269758064516,30.0045564516129
35,35,35,35,35,35,35,35,35,35,35,35,35,35,30.6445,31.3192361111111,30.2772083333333,31.2348888888889,29.8371805555556,28.71525,30.4680833333333,32.0412083333333,31.7303333333333,30.5158055555556,31.974125,33.4524444444444,33.5444861111111,31.2240277777778
36,36,36,36,36,36,36,36,36,36,36,36,36,36,30.268185483871,30.3335483870968,30.1919892473118,30.3982661290323,30.0893010752688,29.9440053763441,30.0947580645161,30.3092204301075,30.4620698924731,30.5826612903226,31.1319489247312,31.5535349462366,32.1127284946237,34.9808467741936
37,37,37,37,37,37,37,37,37,37,37,37,37,37,24.5925672043011,25.4260349462366,24.6834005376344,24.3326344086021,25.086061827957,23.8815456989247,25.1079569892473,26.7983333333333,25.5500806451613,24.9363037634409,24.3678360215054,24.4114919354839,27.0579032258065,27.4615322580645
38,38,38,38,38,38,38,38,38,38,38,38,38,38,21.186369047619,21.5078125,21.2506398809524,20.8649553571429,22.1256398809524,20.4911607142857,21.5138095238095,24.110119047619,21.644255952381,21.6669791666667,20.8511458333333,21.0662797619048,23.7289583333333,22.7989583333333
39,39,39,39,39,39,39,39,39,39,39,39,39,39,27.5657200538358,27.8320323014805,27.1890309555855,28.1037146702557,27.1355585464334,25.6696769851952,27.7421803499327,29.3516958277254,28.0803230148048,27.6493135935397,28.5940376850606,29.809798115747,30.5294885598923,31.2829609690444
40,40,40,40,40,40,40,40,40,40,40,40,40,40,22.6131805555556,23.8706527777778,22.2211666666667,22.9974027777778,22.4633333333333,19.551875,23.2703472222222,25.3635972222222,24.2645833333333,23.3147638888889,23.7184305555556,24.9983055555556,27.1478333333333,21.6992361111111
41,41,41,41,41,41,41,41,41,41,41,41,41,41,23.9599327956989,24.7942741935484,23.8837634408602,23.9788844086022,24.0599462365591,22.7026612903226,24.6762365591398,26.2460752688172,25.1536155913978,24.5086827956989,24.0114516129032,24.7881586021505,27.2109946236559,28.8519892473118
42,42,42,42,42,42,42,42,42,42,42,42,42,42,25.0855416666667,26.8976805555556,25.1715416666667,25.1758194444444,23.9043611111111,24.7085555555556,24.4167916666667,26.3912916666667,27.2267361111111,24.5195416666667,25.2079166666667,25.4585138888889,27.2595972222222,32.0267777777778
43,43,43,43,43,43,43,43,43,43,43,43,43,43,29.729623655914,29.9110080645161,29.6962365591398,29.7812903225806,29.6375,29.4554704301075,29.7090860215054,30.6671774193548,30.013064516129,29.7479166666667,29.8349462365591,30.0297177419355,31.1321639784946,32.075685483871
44,44,44,44,44,44,44,44,44,44,44,44,44,44,126.384086021505,126.625336021505,126.349838709677,126.52185483871,125.936545698925,126.315282258065,126.526922043011,127.696209677419,126.693387096774,126.670766129032,126.600913978495,126.897889784946,127.109018817204,128.876465053763
45,45,45,45,45,45,45,45,45,45,45,45,45,45,79.615625,80.5876527777778,79.4591944444444,79.9195833333333,78.9004722222222,78.42925,80.1695972222222,82.4363472222222,80.7792916666667,82.4672361111111,80.7741527777778,80.6986388888889,81.0091111111111,83.4711388888889
46,46,46,46,46,46,46,46,46,46,46,46,46,46,28.2470564516129,30.3936021505376,28.1317607526882,27.9959677419355,29.4684005376344,24.6681317204301,29.2804435483871,33.5536021505376,30.6423790322581,29.0158064516129,28.7329435483871,28.5543817204301,32.9421102150538,49.3833602150538
47,47,47,47,47,47,47,47,47,47,47,47,47,47,23.468375,24.0215,23.2572361111111,23.6286111111111,23.7185555555556,21.6602638888889,24.4080138888889,25.5751388888889,24.1816111111111,24.4852222222222,24.1536111111111,24.5175694444444,25.8037083333333,49.3408472222222
48,48,48,48,48,48,48,48,48,48,48,48,48,48,18.7150806451613,18.6725,18.623373655914,18.7319892473118,18.9525134408602,18.1364247311828,19.0517069892473,19.9978629032258,18.9198521505376,19.4568817204301,19.0068010752688,19.0850672043011,19.7868817204301,39.5025940860215
