<svg width="120" height="37" viewBox="0 0 120 37" fill="none" xmlns="http://www.w3.org/2000/svg">
<path d="M31.5342 21.5467C31.5342 26.3016 29.351 30.581 25.8857 33.4C25.4006 33.8075 24.9155 34.1472 24.3957 34.4868C24.3957 34.4868 24.3957 34.4868 24.361 34.4868C24.1531 34.6226 23.9452 34.7245 23.7373 34.8604C23.2521 35.1321 22.7323 35.4038 22.2125 35.6415C21.9007 35.7774 21.5541 35.9132 21.2076 36.0491C19.5096 36.6604 17.673 37.0001 15.7671 37.0001C15.7324 37.0001 15.6631 37.0001 15.6285 37.0001C15.3166 37.0001 14.9701 37.0001 14.6582 36.9661C13.9998 36.9322 13.3067 36.8303 12.683 36.6944C12.4404 36.6604 12.1632 36.5925 11.9206 36.5246C11.886 36.5246 11.886 36.5246 11.8513 36.5246C11.6087 36.4567 11.3662 36.3887 11.1236 36.3208C11.0889 36.3208 11.0543 36.2869 11.0196 36.2869C10.7424 36.185 10.4652 36.117 10.188 36.0151C10.1533 35.9812 10.084 35.9812 10.0493 35.9812C10.0147 35.9472 9.94539 35.9472 9.91074 35.9132C9.87608 35.9132 9.87608 35.9132 9.84143 35.8793C9.73747 35.8453 9.63351 35.8114 9.52956 35.7434C9.52956 35.7434 9.52956 35.7434 9.4949 35.7434C9.35629 35.6755 9.21768 35.6076 9.07907 35.5736C8.69789 35.4038 8.3167 35.2 7.93552 34.9962C7.83156 34.9283 7.7276 34.8604 7.62364 34.8264C7.41573 34.6906 7.20781 34.5887 7.03454 34.4528C6.86128 34.3509 6.68801 34.2151 6.51475 34.0792C6.41079 34.0113 6.30683 33.9434 6.20287 33.8754C6.06426 33.7736 5.891 33.6377 5.75239 33.5358C5.71773 33.5358 5.71773 33.5018 5.68308 33.5018L5.64843 33.4679C5.61377 33.4339 5.54447 33.4 5.50982 33.366C5.47516 33.332 5.40586 33.2981 5.3712 33.2301C5.26724 33.1282 5.12863 33.0264 5.02467 32.9245C4.99002 32.8905 4.95537 32.8565 4.92072 32.8565C4.88606 32.8226 4.81676 32.7886 4.7821 32.7207C4.74745 32.6867 4.67814 32.6188 4.64349 32.5848C4.36627 32.3131 4.08905 32.0414 3.84648 31.7357C3.70786 31.5659 3.56925 31.3961 3.43064 31.2263C3.39599 31.1584 3.32668 31.0904 3.29203 31.0225C3.25738 30.9885 3.22272 30.9546 3.22272 30.9206C3.08411 30.7508 2.98015 30.581 2.84154 30.4112C2.80689 30.3432 2.73758 30.2753 2.70293 30.2074C0.970282 27.6601 0 24.7053 0 21.5467C0 20.1542 0.173265 18.7957 0.554447 17.505C0.5891 17.3013 0.658406 17.1314 0.693059 16.9616C0.727711 16.8258 0.762364 16.7239 0.797017 16.588C0.83167 16.4861 0.866323 16.4182 0.900976 16.3163C0.970282 16.1125 1.03959 15.9088 1.14355 15.705C1.21285 15.5352 1.28216 15.3314 1.38612 15.1616C2.14848 13.4974 3.22272 11.969 4.50488 10.6784C4.53953 10.6444 4.57419 10.6105 4.57419 10.6105C4.60884 10.5765 4.64349 10.5425 4.64349 10.5425C4.64349 10.5425 4.64349 10.5425 4.67815 10.5086C4.74745 10.4406 4.81676 10.3727 4.88606 10.3048C4.95537 10.2369 5.05933 10.135 5.12863 10.067C5.3019 9.93119 5.44051 9.79534 5.61377 9.62552C5.85635 9.42174 6.13357 9.21796 6.41079 9.01418C8.10878 7.79149 10.084 6.87448 12.2325 6.39899C12.2671 6.39899 12.3018 6.39899 12.3364 6.36503C13.0295 6.22917 13.7572 6.12728 14.4849 6.05935C14.9008 6.02539 15.3166 6.02539 15.7324 6.02539C18.7126 6.02539 21.4848 6.84051 23.8412 8.23302C23.9452 8.30094 24.0491 8.36887 24.1531 8.40283L24.1877 8.4368C24.257 8.47076 24.3264 8.53869 24.3957 8.57265C24.8808 8.87832 25.3313 9.21796 25.7471 9.55759C25.7818 9.59156 25.8511 9.62552 25.8857 9.65948C25.9204 9.69345 25.955 9.72741 25.9897 9.76137C26.0937 9.86326 26.2323 9.96515 26.3362 10.067C26.96 10.6105 27.5144 11.1878 28.0342 11.8331C28.2421 12.1049 28.4501 12.3766 28.658 12.6483C28.9352 13.0219 29.1778 13.4294 29.4203 13.837C29.8015 14.4823 30.1134 15.1616 30.3906 15.8408C30.4946 16.0786 30.5639 16.3163 30.6332 16.5541C30.7371 16.7918 30.8065 17.0635 30.8758 17.3352C31.3262 18.6938 31.5342 20.0863 31.5342 21.5467Z" fill="#993292"/>
<path d="M9.07972 26.5095L8.00547 27.7322L7.65894 28.1398L3.74316 27.5284L5.23324 25.3548L6.09956 25.5585L8.00547 26.0001L5.9956 24.6076L7.24311 23.5547L8.62923 24.166L8.73319 24.234L8.80249 24.7094L9.07972 26.5095Z" fill="#F7941D"/>
<path d="M29.3863 4.15851L28.624 4.22644L28.1388 4.29437L28.0695 4.32833H28.0349L27.8616 4.39626L26.3715 4.97364L25.1933 5.51705L23.8072 6.16236L22.9062 6.23028H22.8369L21.6934 6.29821L20.8964 6.12839L17.8123 5.44912H17.7429L16.2529 5.17742L14.6588 4.90571L13.7579 4.93967L12.8222 4.97364L12.1292 5.0076L11.8866 5.07553L9.77277 5.78876L8.52527 6.23028L8.352 6.50199L7.65894 7.69071L7.45103 8.5398L7.13915 9.76248L6.89658 12.4116L7.1738 13.4985L7.38172 14.3815L7.7629 15.2646L8.45596 16.8948V16.9288V16.9627L11.0896 22.8045L11.9213 24.4347V24.5366L12.3717 30.2425C12.2678 30.2085 12.1638 30.1745 12.0599 30.1066C12.0599 30.1406 12.0252 30.1745 12.0252 30.2085C11.9559 30.3104 11.8173 30.3443 11.6787 30.3783C11.4708 30.4123 11.2628 30.4462 11.0549 30.4802C11.0203 30.4802 10.9856 30.4802 10.951 30.4802L10.5351 29.3254L10.2579 28.6122L10.0846 28.1707L9.59951 26.8801L9.35694 26.2008L9.07972 25.4536L8.83714 24.7064L8.66388 24.163L7.6936 21.3101L4.47088 14.3136L3.74316 11.189V8.67565L4.33226 6.84163L5.37185 5.27931L8.38666 3.03772L11.2975 1.67918L14.5549 0.694239L17.7429 0.21875L22.2825 0.456494L25.3666 1.37351L27.619 2.63016L29.1091 3.95473L29.2477 4.05662L29.3863 4.15851Z" fill="#F7941D"/>
<path d="M12.3717 30.2438C12.2678 30.2099 12.3024 30.3118 12.1985 30.2778C12.1985 30.3118 12.1292 30.2778 12.0945 30.3118C12.0252 30.4137 11.9212 30.5156 11.748 30.5495C11.5401 30.5835 11.3321 30.6854 11.1242 30.7193C11.0896 30.7193 10.9856 30.7873 10.951 30.7873C9.42623 31.025 7.83219 31.025 6.34211 30.5835C6.09954 30.5156 5.85697 30.3797 5.64906 30.2778L5.51044 30.2438C5.0253 29.9721 5.71836 29.5985 5.82232 29.5646L5.96093 29.5306C6.75795 29.3608 7.52031 29.0891 8.35198 28.9193C8.66386 28.8513 8.94108 28.8513 9.25296 28.7495C9.35692 28.7155 9.49553 28.6815 9.59949 28.6815C9.42623 28.5796 9.25296 28.6476 9.0797 28.5117C9.01039 28.5457 8.90643 28.6136 8.83713 28.6136C8.5599 28.6815 8.28268 28.7155 8.00546 28.7834C7.9015 28.8174 7.52031 28.8853 7.41636 28.9193C7.58962 28.7155 7.9708 28.3419 8.14407 28.0702C8.17872 28.0362 8.24803 27.9343 8.28268 27.8664C8.24803 27.8664 8.24803 27.8324 8.21337 27.8324L8.17872 27.7985L9.18365 26.6777L9.32227 26.2362L9.87671 24.2663L11.6787 24.0625L11.8866 24.572L11.9212 24.6059L12.3717 30.2438Z" fill="#F7941D"/>
<path d="M32.4342 11.2584V13.2623L31.9144 16.7265L31.6372 19.7493L30.9095 22.6022L30.8402 22.8739L29.6274 25.5231L28.5185 27.2552L28.3798 27.493L27.6868 28.1043L26.5779 29.0553L26.3007 29.293L25.9195 29.5987L25.7809 29.7346L25.4343 29.9044L23.4591 30.7874L22.87 31.0591L20.3404 31.5686L19.6473 31.7044L18.2265 31.8403L17.6721 31.9082L17.083 31.8403L16.0088 31.7044L14.2761 31.4667L13.8603 31.4327L13.4791 31.2289L12.4048 30.6516V30.6176L12.3702 30.21L11.9197 24.5042V24.4023L11.4346 23.2475L9.56331 19.3417L8.48907 16.9643V16.9303V16.8964L7.93462 15.6737L7.79601 15.2661L7.20691 13.5L6.92969 12.7188V10.9188L7.38018 8.84701L7.51879 8.5753L8.35046 6.8092L9.87519 5.82426L10.2564 5.58652L11.192 5.21292L11.989 5.11103L12.89 5.00914L13.4791 4.94121L13.7563 4.97518L16.286 5.21292L17.2216 5.31481L17.8454 5.48463L19.9592 6.12993L20.9295 6.1639L22.87 6.26579H22.9047H22.9393L25.2264 5.55255L26.37 5.07707L27.8254 4.46572L27.8601 4.43176L27.9294 4.3978L28.0333 4.36383H28.068L28.1373 4.32987L28.5531 4.19402L29.1422 3.99023H29.1769L29.2808 4.09212L29.3848 4.19402L30.6669 5.58652L31.2907 7.14884L31.6719 8.03189L32.2263 9.25457L32.4342 11.2584Z" fill="#FFC972"/>
<path d="M24.3604 13.5658L24.8108 16.3847L25.5039 17.7093L27.8256 18.7962L29.489 17.9131L30.6325 15.3998L30.9098 12.7507L30.2167 10.2034L29.1425 8.64107L28.1375 8.09766L26.3702 8.64107L25.5385 9.69394L24.6376 11.494L24.3604 13.5658Z" fill="white"/>
<path d="M17.2578 22.4652L17.5697 23.2463L21.5548 26.3031L23.4607 21.752L17.2578 22.4652Z" fill="#B83437"/>
<path d="M19.1641 22.2268L20.065 23.7551L20.7581 24.4005L21.3125 24.1287L21.07 21.9551L19.1641 22.2268Z" fill="#E96A64"/>
<path d="M15.143 20.8013L17.9845 20.3598L20.3409 18.6956L21.4152 17.0993L22.2815 15.3672L21.831 11.9029L20.7568 9.8311L18.2271 8.20086L16.7024 7.69141L13.7222 7.99708L11.4005 9.62732L9.77181 11.9708L9.39062 14.3143L9.94507 17.4389L11.5045 19.239L14.1381 20.4956L15.143 20.8013Z" fill="white"/>
<path d="M17.084 22.5L21.3116 26.2699L20.6186 26.5077H19.8562L18.9206 25.8624L17.6731 24.1302L17.084 22.5Z" fill="#E96964"/>
<path d="M19.3359 21.7516C19.3359 21.7516 21.7616 20.6988 24.2567 17.4043L25.4695 17.676L27.7566 18.8647L29.3506 20.7667V21.1063L27.2715 21.4459L19.3359 22.0233V21.7516Z" fill="#E96964"/>
<path d="M29.4194 20.3932C29.0382 19.9178 28.657 19.4423 28.3105 19.0347C28.761 18.6611 29.3154 18.3554 29.6966 17.9139C30.9441 16.3856 31.2906 14.5515 31.1174 12.6496C31.0134 11.325 30.6669 10.1023 29.7659 9.04945C28.8996 8.03054 27.6867 7.75883 26.5432 8.37018C25.9541 8.67585 25.5036 9.1853 25.1917 9.76268C24.0828 11.7326 23.9096 13.8383 24.4987 16.012C24.6026 16.4535 24.8105 16.895 24.9838 17.3705C24.8105 17.3365 24.7066 17.3705 24.6026 17.3026C24.2214 17.1667 23.9789 17.3026 23.7363 17.6422C22.9046 18.797 21.9343 19.8838 20.7215 20.6989C19.6126 21.4461 18.5037 22.1593 17.1176 22.2612C16.7711 22.2952 16.7711 22.499 16.875 22.7367C17.2908 23.9934 17.8799 25.1821 18.8502 26.1331C19.5433 26.8123 20.3057 27.0841 21.2759 26.8463C21.6225 26.7444 21.8997 26.6425 22.0036 26.3029C22.5234 24.9783 23.0432 23.6877 23.563 22.3631C23.5977 22.2273 23.7363 22.0914 23.8403 22.0575C24.2907 21.9895 24.7412 22.0235 25.1917 21.9556C26.6125 21.8197 28.0679 21.6499 29.4887 21.4801C29.7659 21.4461 29.8352 21.3103 29.7312 21.0725C29.6619 20.8008 29.558 20.5631 29.4194 20.3932ZM22.1423 24.6726C22.0036 25.0462 21.8304 25.3859 21.6918 25.7595C21.5878 25.9972 21.4492 26.0312 21.2759 25.8953C20.5136 25.318 19.7166 24.7406 18.9888 24.1292C18.5384 23.7556 18.1572 23.3141 17.776 22.9065C17.7413 22.8726 17.7413 22.8386 17.672 22.7028C18.0879 22.6348 18.5037 22.5669 18.9195 22.5329C18.9888 22.5329 19.1275 22.7028 19.1621 22.8047C19.4393 23.2462 19.6472 23.6877 19.9591 24.0953C20.2363 24.4689 20.5829 24.8085 21.1027 24.6387C21.5878 24.4689 21.6571 23.9934 21.6225 23.5519C21.5878 23.1783 21.5185 22.8386 21.4492 22.465C21.3799 22.2273 21.4492 22.0914 21.7264 22.0914C22.1769 22.0914 22.6274 22.0575 23.1818 22.0235C22.8007 22.9745 22.4888 23.8236 22.1423 24.6726ZM19.9245 26.2689C19.3007 25.9972 18.8502 25.4878 18.469 24.9783C18.1918 24.6047 17.9839 24.1972 17.8106 23.7556C18.8156 24.6047 19.8552 25.4198 20.8948 26.3029C20.5482 26.4387 20.2363 26.4048 19.9245 26.2689ZM20.6868 22.2612C20.7561 22.2612 20.8948 22.3292 20.8948 22.3631C20.9641 22.8726 21.1027 23.382 21.1027 23.9255C21.1027 24.2651 20.8601 24.333 20.5829 24.0953C20.0631 23.6537 19.8205 23.0764 19.5086 22.4311C19.9245 22.3292 20.3057 22.2952 20.6868 22.2612ZM20.0977 21.582C21.6918 20.665 22.9739 19.4083 24.0482 17.9479C24.1868 17.7441 24.3254 17.6762 24.568 17.7101C26.5085 18.0158 27.9293 19.1366 29.0035 20.665C29.0728 20.7329 29.0728 20.8687 29.1421 20.9706C26.058 21.582 22.9393 21.3442 19.8552 21.7518C19.9245 21.7178 20.0284 21.6499 20.0977 21.582ZM28.2065 8.53999C28.8996 8.70981 29.3847 9.1853 29.7312 9.76268C30.4243 10.8835 30.6669 12.0722 30.6322 13.3628C30.6322 14.7893 30.3203 16.1478 29.4887 17.3365C29.1075 17.8799 28.6224 18.3215 27.9639 18.4573C27.7907 18.4913 27.5828 18.4234 27.4095 18.3554C27.063 18.1856 26.7857 17.9139 26.4392 17.812C25.7115 17.6082 25.4343 17.0648 25.1917 16.4874C24.2907 14.144 24.3947 11.8345 25.7808 9.66079C26.3699 8.77774 27.3402 8.30225 28.2065 8.53999Z" fill="#4A1D46"/>
<path d="M22.421 13.4647C22.1438 10.1023 19.3369 7.55502 15.9063 7.45312C15.2132 7.58898 14.4855 7.65691 13.8271 7.89465C11.4707 8.70977 9.98063 10.3061 9.32222 12.6495C8.52521 15.5364 9.73806 18.5931 12.337 20.1215C14.6934 21.514 17.3964 21.3102 19.5102 19.8158C21.6587 18.2535 22.6289 16.0799 22.421 13.4647ZM13.6538 8.43807C16.4607 7.28331 19.8567 8.50599 21.2428 11.1891C22.5596 13.7024 22.0745 16.7931 19.9953 18.763C18.228 20.4611 15.5251 20.9706 13.3766 20.0875C11.0202 19.1026 9.56479 16.9289 9.56479 14.3817C9.59945 11.7325 11.1588 9.45697 13.6538 8.43807Z" fill="#4A1D46"/>
<path d="M28.6927 11.5641C27.8264 10.6471 26.5443 10.749 25.7819 11.7679C25.2275 12.5491 25.0195 13.3982 25.0195 14.451C25.0195 15.2322 25.1928 16.0813 25.7472 16.8285C26.5096 17.8813 27.7225 17.9832 28.6234 17.0662C29.9402 15.7417 29.9749 12.8887 28.6927 11.5641ZM28.2423 13.7038C27.8611 13.7038 27.4799 13.1944 27.4799 12.6849C27.4799 12.3113 27.6532 12.1076 27.9997 12.0736C28.4502 12.0736 28.7967 12.5151 28.7967 13.0925C28.762 13.4321 28.5195 13.7038 28.2423 13.7038Z" fill="#4A1D46"/>
<path d="M20.2721 12.8881C19.1285 10.6465 16.5296 10.137 14.6583 11.4276C13.3068 12.3786 12.6831 13.7032 12.6484 14.9598C12.6484 16.1146 12.787 16.7939 13.1336 17.4392C14.2771 19.7487 17.188 20.2921 19.1632 18.5939C20.7572 17.2014 21.2077 14.79 20.2721 12.8881ZM19.6483 14.5523C19.3365 14.9598 18.8167 14.9938 18.4355 14.6542C18.1236 14.3825 17.985 13.9749 17.985 13.4315C17.985 13.3636 18.0196 13.2277 18.0543 13.0579C18.2969 12.3786 18.9553 12.2428 19.4751 12.7183C19.9602 13.1258 20.0295 14.0428 19.6483 14.5523Z" fill="#4A1D46"/>
<path d="M32.123 8.4724C32.0884 8.40447 32.0884 8.37051 32.0537 8.30258C31.5339 6.67233 30.7716 5.17794 29.5587 3.95526C27.8607 2.22312 25.7815 1.17025 23.4598 0.558908C21.5192 0.0494557 19.544 -0.0863983 17.5688 0.0494556C15.5589 0.18531 13.5837 0.592871 11.7124 1.27214C9.9105 1.91745 8.24716 2.8005 6.68777 3.88733C4.81652 5.17794 3.74228 6.91008 3.53436 9.15167C3.49971 9.69508 3.46505 10.2385 3.49971 10.7819C3.56901 11.6989 3.74228 12.6159 4.0195 13.499C4.22742 14.1783 4.46999 14.8236 4.78186 15.5028C5.92541 18.0841 7.0343 20.6653 8.17785 23.2465C8.24716 23.3824 8.24716 23.5182 8.31646 23.722C8.03924 23.6201 7.86597 23.5522 7.69271 23.4843C7.34618 23.3824 7.0343 23.3484 6.72243 23.5522C6.47986 23.756 6.20263 23.9597 5.99472 24.1975C5.64819 24.5711 5.71749 24.673 6.13333 24.9107C6.54916 25.1485 6.965 25.4202 7.38083 25.6579C7.38083 25.6919 7.34618 25.7258 7.34618 25.7598C7.20757 25.7258 7.10361 25.6919 6.965 25.6579C6.65312 25.556 6.34124 25.4881 6.02937 25.3862C5.99472 25.3862 5.92541 25.3522 5.8561 25.3522C5.64819 25.2843 5.33631 25.2164 5.33631 25.2504L5.267 25.3862L3.81158 27.5599L3.63832 27.7976L7.58875 28.4769L7.38083 28.7826H7.34618C7.13826 28.8165 5.44027 29.2241 5.1977 29.8354V29.8694C5.1977 29.9373 5.23235 29.9713 5.267 30.0392C5.33631 30.1411 5.40562 30.209 5.50957 30.2769C5.57888 30.3449 7.31153 31.8393 12.0936 30.7524C12.0936 30.7864 12.1283 30.8204 12.1629 30.8543C12.1976 30.8883 14.45 32.1789 17.9153 32.1789C19.9598 32.1789 22.4549 31.7034 25.1924 30.2769C25.6429 30.0392 26.0588 29.8015 26.4746 29.5637C26.4746 29.5637 26.4746 29.5637 26.5092 29.5637C27.2716 29.0543 27.93 28.5108 28.5191 27.8655C29.0043 27.3561 29.4201 26.7787 29.7666 26.1334C30.9795 23.8918 31.6725 21.4804 31.9844 18.9671C32.0884 18.0161 32.123 17.0312 32.3309 16.0802C32.5389 15.1972 32.6775 14.3141 32.7121 13.4311C32.7814 11.7329 32.6082 10.1026 32.123 8.4724ZM8.00459 21.5823C7.34618 20.02 6.65312 18.4916 5.99472 16.9293C5.54423 15.9104 5.05909 14.9255 4.6779 13.8726C4.50464 13.465 4.36603 13.0575 4.26207 12.6499C4.0195 11.631 3.91554 10.6121 3.95019 9.59319C3.98485 8.77807 4.15811 7.92898 4.43533 7.11386C4.71256 6.23081 5.37096 5.55154 6.06402 4.9402C7.31153 3.88733 8.69764 3.0722 10.1877 2.39294C11.6778 1.6797 13.2372 1.17025 14.8659 0.864579C14.9005 0.864579 14.9352 0.830616 14.9698 0.830616C15.5243 0.728725 16.0787 0.660798 16.6332 0.592871C16.8064 0.558908 16.945 0.558908 17.1183 0.558908C20.1678 0.253237 23.1133 0.626835 25.8855 1.98537C26.8211 2.46086 27.6528 3.10617 28.5538 3.68355C28.6577 3.75147 28.7617 3.78544 28.9003 3.85336C28.8656 3.92129 28.831 3.95526 28.7963 4.02318C28.6577 4.02318 28.5538 4.02318 28.4152 4.02318C27.5488 4.09111 26.7865 4.43074 26.0241 4.80434C25.6429 5.00812 25.2617 5.2119 24.8459 5.38172C23.1133 6.16288 21.346 6.16288 19.544 5.65343C17.8807 5.17794 16.1827 4.77038 14.45 4.63452C12.7174 4.49867 11.0887 4.73641 9.59862 5.51757C9.3214 5.65343 9.07883 5.82325 8.83626 5.99306C8.7323 6.06099 8.66299 6.12892 8.55903 6.19684C8.24716 6.46855 7.96993 6.74026 7.76201 7.07989C7.51944 7.45349 7.31153 7.89502 7.17292 8.33654C6.41055 10.8159 6.47986 13.2612 7.58875 15.6387C8.28181 17.0991 8.97487 18.5935 9.66793 20.0539C10.257 21.3106 10.8115 22.5333 11.3659 23.7899C11.3659 23.8239 11.3659 23.8579 11.3659 23.9597C11.054 23.9597 10.7768 23.9937 10.4996 23.9597C9.9105 23.9258 9.77188 23.9597 9.56397 24.5032C9.49466 24.7069 9.42535 24.9447 9.3214 25.2164C9.25209 25.1145 9.21744 25.0805 9.21744 25.0466C8.97487 23.8579 8.48973 22.7031 8.00459 21.5823ZM6.34124 24.5032C6.75708 23.8579 7.10361 23.7899 7.72736 23.9937C8.35111 24.1975 8.66299 24.5711 8.66299 25.2164C8.66299 25.4541 8.69764 25.6579 8.7323 25.9976C7.90063 25.4541 7.13826 24.9786 6.34124 24.5032ZM7.38083 27.8995C6.34124 27.7297 5.57888 27.5599 4.53929 27.3901C4.46999 27.3901 4.50464 27.3901 4.43533 27.3561C4.85117 26.7787 5.16305 26.2693 5.47492 25.7938C5.50957 25.7258 5.50957 25.7258 5.54423 25.7258C5.8561 25.8277 6.13333 25.9296 6.4452 25.9976L6.51451 26.0315C7.17291 26.2353 7.86597 26.473 8.55903 26.7108C8.59369 26.7108 8.62834 26.7447 8.69764 26.8127C8.45507 27.0504 8.2125 27.2882 8.00459 27.5259L7.93528 27.5938C7.83132 27.6957 7.76201 27.7637 7.65806 27.8655C7.5541 27.8995 7.45014 27.8995 7.38083 27.8995ZM12.059 30.0732C11.9897 30.1411 11.8857 30.209 11.7124 30.209C11.5045 30.243 11.2966 30.277 11.0887 30.3109C11.054 30.3109 11.0194 30.3109 10.9847 30.3109C9.46001 30.5487 7.93528 30.6505 6.47986 30.209C6.23729 30.1411 5.96006 30.0732 5.75215 29.9373L5.68284 29.9034C5.44027 29.7675 5.47492 29.6656 5.57888 29.5977H5.61353L5.64819 29.5637C5.64819 29.5637 5.68284 29.5637 5.68284 29.5298H5.71749C5.7868 29.4958 5.89076 29.4958 5.89076 29.4618C6.06402 29.4279 6.20263 29.3939 6.3759 29.3599C7.0343 29.2241 7.65806 29.0882 8.31646 28.9524C8.62834 28.8844 8.94021 28.8165 9.28674 28.7146C9.3907 28.6807 9.46001 28.6807 9.56397 28.6467L10.1184 28.5108C10.1531 28.5108 10.1877 28.4769 10.2224 28.4769C10.2917 28.4429 10.361 28.4429 10.3956 28.375C10.4649 28.2731 10.4996 28.1712 10.5689 28.0354C10.4649 28.0014 10.3263 27.9674 10.2224 27.9674C10.1877 27.9674 10.1184 28.0014 10.0838 28.0014C9.73723 28.0693 9.3907 28.1712 9.07883 28.2391C9.00952 28.2391 8.94021 28.2731 8.87091 28.3071C8.59369 28.375 8.35111 28.4429 8.07389 28.5108C7.96993 28.5448 7.86597 28.5448 7.72736 28.5448C7.90063 28.341 8.03924 28.1372 8.2125 27.8995C8.24716 27.8655 8.31646 27.7637 8.35111 27.6957C8.35111 27.6618 8.38577 27.6618 8.38577 27.6618C8.55903 27.458 8.7323 27.2202 8.94021 27.0844C9.14813 26.9485 9.3907 26.8127 9.63327 26.7447H9.66793C10.0491 26.6429 10.4649 26.5749 10.8461 26.473C10.9501 26.4391 11.0194 26.3032 11.1233 26.2013C10.9847 26.1674 10.8461 26.0655 10.7075 26.0994C10.3263 26.1674 9.9798 26.2353 9.63327 26.3372C9.59862 26.3032 9.56397 26.2693 9.52931 26.2353C9.70258 25.624 9.9105 25.0126 10.1184 24.4352C10.1531 24.3673 10.2917 24.3333 10.3956 24.3333C10.7075 24.3333 10.9847 24.3673 11.2966 24.3333C11.6431 24.2994 11.7471 24.4692 11.7818 24.7749C11.8511 25.5221 11.955 26.2353 11.9897 26.9825C12.059 28.0014 12.059 28.7826 12.1283 29.8015C12.0936 29.9713 12.0936 30.0392 12.059 30.0732ZM31.7418 16.0123C31.4993 17.0312 31.4646 18.0841 31.3607 19.103C31.2913 19.7822 31.1874 20.4615 31.0141 21.1068C30.5636 23.2125 29.732 25.1824 28.4498 27.0165C27.9647 27.7297 27.3063 28.2731 26.6132 28.7486C25.8162 29.258 25.0538 29.8354 24.2222 30.243C24.0835 30.3109 23.9103 30.3788 23.7717 30.4468C21.7618 31.3298 19.5787 31.6355 17.1183 31.6355C16.5639 31.6015 15.7322 31.5676 14.9005 31.4317C14.8659 31.4317 14.7966 31.3977 14.7619 31.3977C14.7273 31.3977 14.6926 31.3638 14.6579 31.3638C14.4154 31.3298 14.2075 31.2619 13.9649 31.16C13.653 31.0581 13.3758 30.9562 13.0986 30.8543H13.0639C13.0639 30.8543 13.0639 30.8543 13.0293 30.8543C12.9946 30.8543 12.96 30.8204 12.96 30.8204C12.8906 30.7864 12.856 30.7524 12.7867 30.7185C12.6827 30.6166 12.6481 30.4807 12.6134 30.3109C12.6134 30.277 12.6134 30.2769 12.6134 30.243C12.5788 29.8694 12.5788 29.4958 12.5441 29.1562C12.4748 27.7297 12.3709 26.2693 12.1976 24.8428C12.1283 24.1975 11.7124 23.5861 11.4352 22.9748C10.7768 21.5483 10.1184 20.1558 9.49466 18.6954C8.8016 17.0991 8.03924 15.5028 7.48479 13.8726C6.82639 12.0046 7.10361 10.1366 7.72736 8.30258C8.1432 7.0799 9.04417 6.29874 10.2224 5.78928C11.7471 5.11001 13.3065 5.00812 14.9698 5.17794C16.4946 5.34776 17.95 5.75532 19.4054 6.12892C19.9945 6.26477 20.5836 6.40063 21.1727 6.46855C22.5588 6.67233 23.841 6.36666 25.0885 5.82325C25.5736 5.61947 26.0934 5.38172 26.5786 5.14398C26.8211 5.04209 27.0637 4.9402 27.2716 4.80434C27.8261 4.5666 28.4152 4.49867 29.0043 4.49867C29.1082 4.49867 29.2122 4.49867 29.3161 4.49867C29.4547 4.49867 29.5934 4.63452 29.6627 4.73641C30.0438 5.2119 30.3904 5.72136 30.7022 6.26477C30.9795 6.77422 31.222 7.28368 31.43 7.82709C31.9498 9.18563 32.1923 10.5781 32.2616 11.9706C32.227 13.3292 32.0537 14.6537 31.7418 16.0123Z" fill="#4A1D46"/>
<path d="M36.3172 30.1735C35.7974 30.2075 34.3767 30.2075 33.4064 30.1735C33.0252 30.1396 32.748 29.8339 32.8173 29.4603L33.1292 27.6602C33.1985 27.3546 33.4757 27.1168 33.7876 27.1508C34.6192 27.2187 35.9707 27.2527 36.3865 27.2187C37.4261 27.1168 37.842 26.2338 37.7034 24.5696L36.2133 11.7314C36.1786 11.4257 36.3865 11.154 36.6638 11.0861L38.9509 10.4747C39.332 10.3728 39.7132 10.6445 39.7479 11.0181L40.5102 23.4488C40.6835 25.2488 40.5449 27.1847 39.7479 28.4754C38.9855 29.766 37.7034 30.0377 36.3172 30.1735Z" fill="#854282"/>
<path d="M45.2573 29.8323C44.3564 29.7983 43.6286 29.4926 43.0742 28.8813C42.5198 28.2699 42.2772 27.4888 42.3118 26.5378C42.4851 24.6358 42.5544 22.7339 42.5198 20.798L42.4851 18.2168C42.4851 17.9111 42.693 17.6394 43.0049 17.6054L45.1187 17.2997C45.4999 17.2318 45.8811 17.5714 45.8464 17.945L45.292 24.7377C45.2573 25.451 45.3959 25.9944 45.6385 26.334C45.8811 26.6737 46.2969 26.8435 46.886 26.8774C47.0939 26.8774 47.3019 26.8435 47.5791 26.8095C48.6187 26.5718 49.3464 25.6548 49.381 24.6358L49.3464 18.6243C49.3464 18.3186 49.5543 18.0469 49.8662 18.013L51.98 17.6394C52.3612 17.5714 52.7424 17.9111 52.7077 18.2847L52.4305 21.681C52.3265 23.0396 52.2572 24.3981 52.2226 25.7566C52.1879 26.6397 52.3612 27.5227 52.7077 28.4398C52.8463 28.7454 52.6731 29.119 52.3612 29.2209L50.8365 29.8323C50.5246 29.9681 50.178 29.7983 50.0394 29.4926C49.6583 28.6435 49.5889 28.6096 49.5196 28.0662C47.8563 29.7304 46.3662 29.8662 45.2573 29.8323Z" fill="#854282"/>
<path d="M62.5491 21.1064C62.4105 20.6989 61.96 20.4611 61.2323 20.3592C60.6779 20.2913 60.0541 20.3592 59.3264 20.597C58.8759 20.7328 58.5294 21.1404 58.4947 21.5819L58.3215 22.6687L57.8017 27.967C57.767 28.2727 57.5244 28.5105 57.2126 28.5105L55.0987 28.6124C54.6829 28.6463 54.371 28.2727 54.4403 27.8991L55.0294 24.8764C55.4799 22.6008 55.7225 20.2573 55.7571 17.9478C55.7571 17.744 55.7571 17.5063 55.7571 17.3025C55.7571 16.9629 55.9997 16.6912 56.3462 16.6912L58.2175 16.5553C58.5987 16.5214 58.9106 16.827 58.8759 17.1667C58.8413 17.9139 58.8066 18.6271 58.7373 19.3064C59.0492 19.0007 59.361 18.729 59.7422 18.4573C60.1234 18.1856 60.6779 17.8799 61.4056 17.5742C62.1679 17.2686 62.861 17.1667 63.5887 17.2686C64.2818 17.3704 64.8709 17.6761 65.2867 18.1856C65.7025 18.695 65.9451 19.3403 65.9451 20.1554C67.5738 18.695 69.0985 18.0497 70.5193 18.2535C71.4203 18.3893 72.0787 18.7629 72.4945 19.4083C72.945 20.0536 73.0836 20.9026 72.945 21.8876C72.5638 23.7216 72.3212 25.5556 72.1133 27.4236L71.8708 30.0728C71.8361 30.3785 71.5935 30.6162 71.2817 30.6162L69.1332 30.7181C68.7173 30.7521 68.4055 30.3785 68.4748 30.0049L69.549 24.4348C69.7223 23.3141 69.7223 22.5329 69.5837 22.1253C69.4451 21.7178 68.9946 21.48 68.2668 21.3781C67.7124 21.3102 67.1233 21.3781 66.4302 21.5819C65.9798 21.7178 65.6679 22.0914 65.5986 22.5329L65.356 23.6877L64.8362 29.1218C64.8016 29.4275 64.559 29.6652 64.2471 29.6652L62.0986 29.7671C61.6828 29.8011 61.3709 29.4275 61.4402 29.0539L62.5145 23.4839C62.6877 22.2951 62.6877 21.514 62.5491 21.1064Z" fill="#854282"/>
<path d="M85.5932 22.1907C85.5239 20.6963 85.1081 19.4736 84.3457 18.5226C83.5833 17.6056 82.6477 17.1641 81.5042 17.232C81.4349 17.232 81.4002 17.232 81.3309 17.232H81.2962C80.8804 17.3 79.9101 17.5377 78.0042 18.5226L77.9349 17.1301V11.4582C77.9349 11.0507 77.5537 10.779 77.1725 10.8809L75.0241 11.3903C74.7122 11.4582 74.5043 11.7299 74.5389 12.0356L75.0934 18.9981C75.3706 22.3945 75.5092 25.7908 75.5439 29.1872C75.5439 29.4928 75.7864 29.7646 76.133 29.7985C77.8309 29.9344 79.0785 29.9683 79.8408 29.9344C81.6774 29.8325 83.1675 29.0853 84.2417 27.6249C85.2467 26.1984 85.7318 24.3644 85.5932 22.1907ZM80.6032 27.2173C80.1527 27.2513 79.6676 27.2513 79.1478 27.2173C78.8359 27.2173 78.5587 26.9796 78.5587 26.6739L78.2468 23.5492L78.1428 21.7831C78.1428 21.5454 78.2814 21.3077 78.4894 21.2058C79.2864 20.8322 80.0141 20.5944 80.6725 20.5605C82.024 20.4925 82.7517 21.5794 82.8556 23.787C82.9596 25.9606 82.2319 27.1154 80.6032 27.2173Z" fill="#854282"/>
<path d="M88.2276 29.2905C87.5346 28.7131 87.1534 27.932 87.0494 26.8791C86.9455 25.8262 87.3613 24.8753 88.2623 24.0262C89.1633 23.1771 90.3415 22.7016 91.7276 22.5658L93.4602 22.4299L93.4256 22.0223C93.3563 21.2072 93.1484 20.6638 92.7672 20.3921C92.386 20.1204 91.7622 20.0185 90.8266 20.1204C90.4454 20.1543 89.9949 20.2562 89.4752 20.46C89.1286 20.5959 88.7474 20.7657 88.3316 21.0034C88.0197 21.1732 87.6039 21.0714 87.4653 20.7317L87.0494 19.8826C86.9108 19.6109 87.0148 19.3053 87.2227 19.1354C87.8118 18.6939 88.5395 18.2864 89.3365 17.8788C90.3415 17.4033 91.1731 17.1316 91.8662 17.0637C94.4998 16.8259 95.9552 17.9807 96.1632 20.494L96.6136 25.3508C96.683 26.1319 96.9602 26.947 97.4453 27.8301C97.6186 28.1358 97.5146 28.5094 97.2028 28.6792L95.7127 29.4603C95.4355 29.6302 95.0543 29.5283 94.881 29.2226C94.5345 28.6452 94.3959 28.3056 94.1879 27.8301C93.3909 29.2905 92.1434 29.9019 90.7226 30.0377C89.7524 30.0717 88.8861 29.8339 88.2276 29.2905ZM91.589 27.3886C92.2127 27.3206 92.8365 27.015 93.5642 26.4036C93.7028 26.2678 93.8068 26.098 93.7721 25.8942L93.7028 25.0111C93.6681 24.7054 93.4256 24.5017 93.1484 24.4677C92.4553 24.3998 91.9009 24.3658 91.4504 24.4337C90.3761 24.5356 89.891 25.0451 89.9949 25.9621C90.0296 26.4376 90.2029 26.8112 90.5147 27.0829C90.7573 27.2867 91.1385 27.4225 91.589 27.3886Z" fill="#854282"/>
<path d="M101.43 34.4185L103.266 29.1881L100.945 24.3313L98.207 19.2028C98.0337 18.8632 98.207 18.4217 98.5882 18.3198L100.633 17.7764C100.945 17.7085 101.256 17.8443 101.395 18.15L103.266 22.803L104.548 25.7238L104.652 25.2144L105.103 23.3464L106.281 17.6745C106.35 17.3688 106.593 17.165 106.905 17.199L108.741 17.2669C109.157 17.2669 109.435 17.6745 109.331 18.0481L106.073 29.1881L104.618 35.0298C104.548 35.3355 104.237 35.5393 103.925 35.5053L101.915 35.2676C101.534 35.1996 101.291 34.7921 101.43 34.4185Z" fill="#854282"/>
<path d="M109.885 28.1019C109.366 27.3886 109.192 26.5056 109.4 25.4527C109.573 24.3998 110.232 23.5847 111.341 23.0073C112.45 22.43 113.697 22.2262 115.083 22.4639L116.781 22.7696L116.851 22.362C116.989 21.5469 116.92 20.9695 116.643 20.6299C116.365 20.2903 115.776 20.0186 114.841 19.8487C114.46 19.7808 113.974 19.7808 113.42 19.8487C113.039 19.8827 112.623 19.9846 112.172 20.0865C111.826 20.1884 111.445 19.9506 111.41 19.611L111.237 18.694C111.168 18.4223 111.341 18.1166 111.618 18.0147C112.311 17.743 113.108 17.5053 114.009 17.3354C115.118 17.1317 115.984 17.0637 116.643 17.1996C119.276 17.6411 120.351 19.1355 119.9 21.6148L119.034 26.4376C118.895 27.1848 118.964 28.0679 119.207 29.0528C119.276 29.3925 119.068 29.7321 118.757 29.8L117.093 30.1736C116.781 30.2416 116.435 30.0717 116.365 29.7321C116.192 29.0868 116.088 28.7132 116.019 28.2037C114.841 29.3925 113.524 29.6981 112.138 29.4604C111.168 29.2566 110.405 28.8151 109.885 28.1019ZM113.663 27.1169C114.252 27.2188 114.979 27.083 115.846 26.6414C116.019 26.5395 116.158 26.4037 116.192 26.1999L116.331 25.3508C116.365 25.0791 116.227 24.7734 115.95 24.6715C115.326 24.4338 114.771 24.264 114.321 24.1961C113.281 24.0262 112.658 24.3659 112.484 25.2829C112.415 25.7584 112.45 26.1659 112.692 26.5056C112.9 26.8452 113.212 27.049 113.663 27.1169Z" fill="#854282"/>
</svg>
