<svg width="23" height="22" viewBox="0 0 23 22" fill="none" xmlns="http://www.w3.org/2000/svg">
<path fill-rule="evenodd" clip-rule="evenodd" d="M22.06 11.25C22.06 10.47 21.99 9.72 21.86 9H11.5V13.255H17.42C17.165 14.63 16.39 15.795 15.225 16.575V19.335H18.78C20.86 17.42 22.06 14.6 22.06 11.25Z" fill="#4285F4"/>
<path fill-rule="evenodd" clip-rule="evenodd" d="M11.4989 21.9998C14.4689 21.9998 16.9589 21.0148 18.7789 19.3348L15.2239 16.5748C14.2389 17.2348 12.9789 17.6248 11.4989 17.6248C8.63395 17.6248 6.20895 15.6898 5.34395 13.0898H1.66895V15.9398C3.47895 19.5348 7.19895 21.9998 11.4989 21.9998Z" fill="#34A853"/>
<path fill-rule="evenodd" clip-rule="evenodd" d="M5.345 13.0886C5.125 12.4286 5 11.7236 5 10.9986C5 10.2736 5.125 9.56859 5.345 8.90859V6.05859H1.67C0.925 7.54359 0.5 9.22359 0.5 10.9986C0.5 12.7736 0.925 14.4536 1.67 15.9386L5.345 13.0886Z" fill="#FBBC05"/>
<path fill-rule="evenodd" clip-rule="evenodd" d="M11.4989 4.375C13.1139 4.375 14.5639 4.93 15.7039 6.02L18.8589 2.865C16.9539 1.09 14.4639 0 11.4989 0C7.19895 0 3.47895 2.465 1.66895 6.06L5.34395 8.91C6.20895 6.31 8.63395 4.375 11.4989 4.375Z" fill="#EA4335"/>
</svg>
