interval,output,model_id,model_label,model_theory,model_colour,timbre_label
11.75,-1.635163017001911e-4,Seth93,Sethares (1993),interference,#B50000,Pure tones
11.7505005005005,-1.634328261095629e-4,Seth93,Sethares (1993),interference,#B50000,Pure tones
11.751001001001,-1.63349557151776e-4,Seth93,Sethares (1993),interference,#B50000,Pure tones
11.751501501501501,-1.632661617330206e-4,Seth93,Sethares (1993),interference,#B50000,Pure tones
11.752002002002001,-1.6318297275121272e-4,Seth93,Sethares (1993),interference,#B50000,Pure tones
11.752502502502503,-1.6309965743246054e-4,Seth93,Sethares (1993),interference,#B50000,Pure tones
11.753003003003004,-1.6301654835493317e-4,Seth93,Sethares (1993),interference,#B50000,Pure tones
11.753503503503504,-1.629333130643722e-4,Seth93,Sethares (1993),interference,#B50000,Pure tones
11.754004004004004,-1.6285028381949086e-4,Seth93,Sethares (1993),interference,#B50000,Pure tones
11.754504504504505,-1.6276712848536872e-4,Seth93,Sethares (1993),interference,#B50000,Pure tones
11.755005005005005,-1.6268417900154833e-4,Seth93,Sethares (1993),interference,#B50000,Pure tones
11.755505505505505,-1.6260110355217333e-4,Seth93,Sethares (1993),interference,#B50000,Pure tones
11.756006006006006,-1.6251823375789643e-4,Seth93,Sethares (1993),interference,#B50000,Pure tones
11.756506506506506,-1.6243523812163526e-4,Seth93,Sethares (1993),interference,#B50000,Pure tones
11.757007007007006,-1.6235244794544101e-4,Seth93,Sethares (1993),interference,#B50000,Pure tones
11.757507507507508,-1.6226953205071757e-4,Seth93,Sethares (1993),interference,#B50000,Pure tones
11.758008008008009,-1.621868214212043e-4,Seth93,Sethares (1993),interference,#B50000,Pure tones
11.758508508508509,-1.621039851965059e-4,Seth93,Sethares (1993),interference,#B50000,Pure tones
11.75900900900901,-1.6202135404232946e-4,Seth93,Sethares (1993),interference,#B50000,Pure tones
11.75950950950951,-1.6193859741619877e-4,Seth93,Sethares (1993),interference,#B50000,Pure tones
11.76001001001001,-1.6185604566607914e-4,Seth93,Sethares (1993),interference,#B50000,Pure tones
11.76051051051051,-1.6177336856711816e-4,Seth93,Sethares (1993),interference,#B50000,Pure tones
11.76101101101101,-1.6169089614982536e-4,Seth93,Sethares (1993),interference,#B50000,Pure tones
11.761511511511511,-1.616082985066975e-4,Seth93,Sethares (1993),interference,#B50000,Pure tones
11.762012012012011,-1.615259053510661e-4,Seth93,Sethares (1993),interference,#B50000,Pure tones
11.762512512512513,-1.6144338709249168e-4,Seth93,Sethares (1993),interference,#B50000,Pure tones
11.763013013013014,-1.61361073127416e-4,Seth93,Sethares (1993),interference,#B50000,Pure tones
11.763513513513514,-1.6127863418217506e-4,Seth93,Sethares (1993),interference,#B50000,Pure tones
11.764014014014014,-1.6119639933660535e-4,Seth93,Sethares (1993),interference,#B50000,Pure tones
11.764514514514515,-1.6111403963353632e-4,Seth93,Sethares (1993),interference,#B50000,Pure tones
11.765015015015015,-1.6103188383648323e-4,Seth93,Sethares (1993),interference,#B50000,Pure tones
11.765515515515515,-1.6094960330448335e-4,Seth93,Sethares (1993),interference,#B50000,Pure tones
11.766016016016016,-1.6086752648501794e-4,Seth93,Sethares (1993),interference,#B50000,Pure tones
11.766516516516516,-1.6078532505304406e-4,Seth93,Sethares (1993),interference,#B50000,Pure tones
11.767017017017016,-1.6070332714028792e-4,Seth93,Sethares (1993),interference,#B50000,Pure tones
11.767517517517518,-1.6062120473735598e-4,Seth93,Sethares (1993),interference,#B50000,Pure tones
11.768018018018019,-1.6053928566049763e-4,Seth93,Sethares (1993),interference,#B50000,Pure tones
11.768518518518519,-1.6045724221568e-4,Seth93,Sethares (1993),interference,#B50000,Pure tones
11.76901901901902,-1.6037540190396614e-4,Seth93,Sethares (1993),interference,#B50000,Pure tones
11.76951951951952,-1.6029343734639406e-4,Seth93,Sethares (1993),interference,#B50000,Pure tones
11.77002002002002,-1.6021167572912584e-4,Seth93,Sethares (1993),interference,#B50000,Pure tones
11.77052052052052,-1.601297899879921e-4,Seth93,Sethares (1993),interference,#B50000,Pure tones
11.77102102102102,-1.6004810699453173e-4,Seth93,Sethares (1993),interference,#B50000,Pure tones
11.771521521521521,-1.599662999990851e-4,Seth93,Sethares (1993),interference,#B50000,Pure tones
11.772022022022021,-1.598846955588515e-4,Seth93,Sethares (1993),interference,#B50000,Pure tones
11.772522522522523,-1.5980296723840044e-4,Seth93,Sethares (1993),interference,#B50000,Pure tones
11.773023023023024,-1.597214412808755e-4,Seth93,Sethares (1993),interference,#B50000,Pure tones
11.773523523523524,-1.5963979156478607e-4,Seth93,Sethares (1993),interference,#B50000,Pure tones
11.774024024024024,-1.595583440195015e-4,Seth93,Sethares (1993),interference,#B50000,Pure tones
11.774524524524525,-1.5947677283719848e-4,Seth93,Sethares (1993),interference,#B50000,Pure tones
11.775025025025025,-1.5939540363375113e-4,Seth93,Sethares (1993),interference,#B50000,Pure tones
11.775525525525525,-1.5931391091471802e-4,Seth93,Sethares (1993),interference,#B50000,Pure tones
11.776026026026026,-1.5923261998276127e-4,Seth93,Sethares (1993),interference,#B50000,Pure tones
11.776526526526526,-1.5915120565654017e-4,Seth93,Sethares (1993),interference,#B50000,Pure tones
11.777027027027026,-1.5906999292578528e-4,Seth93,Sethares (1993),interference,#B50000,Pure tones
11.777527527527528,-1.5898865692197582e-4,Seth93,Sethares (1993),interference,#B50000,Pure tones
11.778028028028029,-1.5890752232219208e-4,Seth93,Sethares (1993),interference,#B50000,Pure tones
11.778528528528529,-1.588262645704518e-4,Seth93,Sethares (1993),interference,#B50000,Pure tones
11.77902902902903,-1.5874520803146931e-4,Seth93,Sethares (1993),interference,#B50000,Pure tones
11.77952952952953,-1.5866402846151546e-4,Seth93,Sethares (1993),interference,#B50000,Pure tones
11.78003003003003,-1.5858304991321655e-4,Seth93,Sethares (1993),interference,#B50000,Pure tones
11.78053053053053,-1.5850194845482286e-4,Seth93,Sethares (1993),interference,#B50000,Pure tones
11.78103103103103,-1.5842104782715186e-4,Seth93,Sethares (1993),interference,#B50000,Pure tones
11.781531531531531,-1.5834002441015234e-4,Seth93,Sethares (1993),interference,#B50000,Pure tones
11.782032032032031,-1.5825920163311136e-4,Seth93,Sethares (1993),interference,#B50000,Pure tones
11.782532532532533,-1.5817825618739568e-4,Seth93,Sethares (1993),interference,#B50000,Pure tones
11.783033033033034,-1.5809751119104493e-4,Seth93,Sethares (1993),interference,#B50000,Pure tones
11.783533533533534,-1.5801664364656224e-4,Seth93,Sethares (1993),interference,#B50000,Pure tones
11.784034034034034,-1.579359763610185e-4,Seth93,Sethares (1993),interference,#B50000,Pure tones
11.784534534534535,-1.5785518664777591e-4,Seth93,Sethares (1993),interference,#B50000,Pure tones
11.785035035035035,-1.5777459700321776e-4,Seth93,Sethares (1993),interference,#B50000,Pure tones
11.785535535535535,-1.57693885051279e-4,Seth93,Sethares (1993),interference,#B50000,Pure tones
11.786036036036036,-1.5761337297793478e-4,Seth93,Sethares (1993),interference,#B50000,Pure tones
11.786536536536536,-1.575327387174239e-4,Seth93,Sethares (1993),interference,#B50000,Pure tones
11.787037037037036,-1.5745230414558663e-4,Seth93,Sethares (1993),interference,#B50000,Pure tones
11.787537537537538,-1.5737174750668373e-4,Seth93,Sethares (1993),interference,#B50000,Pure tones
11.788038038038039,-1.5729139036670255e-4,Seth93,Sethares (1993),interference,#B50000,Pure tones
11.788538538538539,-1.572109112796447e-4,Seth93,Sethares (1993),interference,#B50000,Pure tones
11.78903903903904,-1.5713063150192533e-4,Seth93,Sethares (1993),interference,#B50000,Pure tones
11.78953953953954,-1.5705022989701041e-4,Seth93,Sethares (1993),interference,#B50000,Pure tones
11.79004004004004,-1.5697002741201792e-4,Seth93,Sethares (1993),interference,#B50000,Pure tones
11.79054054054054,-1.5688970321959877e-4,Seth93,Sethares (1993),interference,#B50000,Pure tones
11.79104104104104,-1.5680957795785442e-4,Seth93,Sethares (1993),interference,#B50000,Pure tones
11.791541541541541,-1.567293311083425e-4,Seth93,Sethares (1993),interference,#B50000,Pure tones
11.792042042042041,-1.5664928300042732e-4,Seth93,Sethares (1993),interference,#B50000,Pure tones
11.792542542542543,-1.565691134242925e-4,Seth93,Sethares (1993),interference,#B50000,Pure tones
11.793043043043044,-1.5648914240083898e-4,Seth93,Sethares (1993),interference,#B50000,Pure tones
11.793543543543544,-1.5640905002860744e-4,Seth93,Sethares (1993),interference,#B50000,Pure tones
11.794044044044044,-1.5632915602031247e-4,Seth93,Sethares (1993),interference,#B50000,Pure tones
11.794544544544545,-1.5624914078256902e-4,Seth93,Sethares (1993),interference,#B50000,Pure tones
11.795045045045045,-1.5616932372018415e-4,Seth93,Sethares (1993),interference,#B50000,Pure tones
11.795545545545545,-1.5608938554756974e-4,Seth93,Sethares (1993),interference,#B50000,Pure tones
11.796046046046046,-1.5600964536190314e-4,Seth93,Sethares (1993),interference,#B50000,Pure tones
11.796546546546546,-1.559297841851182e-4,Seth93,Sethares (1993),interference,#B50000,Pure tones
11.797047047047046,-1.558501208070364e-4,Seth93,Sethares (1993),interference,#B50000,Pure tones
11.797547547547548,-1.5577033655683796e-4,Seth93,Sethares (1993),interference,#B50000,Pure tones
11.798048048048049,-1.5569074991726684e-4,Seth93,Sethares (1993),interference,#B50000,Pure tones
11.798548548548549,-1.5561104252446818e-4,Seth93,Sethares (1993),interference,#B50000,Pure tones
11.79904904904905,-1.5553153255438502e-4,Seth93,Sethares (1993),interference,#B50000,Pure tones
11.79954954954955,-1.5545190194985768e-4,Seth93,Sethares (1993),interference,#B50000,Pure tones
11.80005005005005,-1.55372468580302e-4,Seth93,Sethares (1993),interference,#B50000,Pure tones
11.80055055055055,-1.552929146949745e-4,Seth93,Sethares (1993),interference,#B50000,Pure tones
11.80105105105105,-1.55213557857043e-4,Seth93,Sethares (1993),interference,#B50000,Pure tones
11.801551551551551,-1.551340806219015e-4,Seth93,Sethares (1993),interference,#B50000,Pure tones
11.802052052052051,-1.5505480024674488e-4,Seth93,Sethares (1993),interference,#B50000,Pure tones
11.802552552552553,-1.549753995928338e-4,Seth93,Sethares (1993),interference,#B50000,Pure tones
11.803053053053054,-1.5489619561166168e-4,Seth93,Sethares (1993),interference,#B50000,Pure tones
11.803553553553554,-1.5481687147008067e-4,Seth93,Sethares (1993),interference,#B50000,Pure tones
11.804054054054054,-1.547377438141621e-4,Seth93,Sethares (1993),interference,#B50000,Pure tones
11.804554554554555,-1.5465849611606835e-4,Seth93,Sethares (1993),interference,#B50000,Pure tones
11.805055055055055,-1.5457944471672223e-4,Seth93,Sethares (1993),interference,#B50000,Pure tones
11.805555555555555,-1.545002733933316e-4,Seth93,Sethares (1993),interference,#B50000,Pure tones
11.806056056056056,-1.54421298181941e-4,Seth93,Sethares (1993),interference,#B50000,Pure tones
11.806556556556556,-1.5434220316452453e-4,Seth93,Sethares (1993),interference,#B50000,Pure tones
11.807057057057056,-1.5426330407252556e-4,Seth93,Sethares (1993),interference,#B50000,Pure tones
11.807557557557558,-1.5418428529241236e-4,Seth93,Sethares (1993),interference,#B50000,Pure tones
11.808058058058059,-1.541054622513011e-4,Seth93,Sethares (1993),interference,#B50000,Pure tones
11.808558558558559,-1.540265196398762e-4,Seth93,Sethares (1993),interference,#B50000,Pure tones
11.80905905905906,-1.5394777258120244e-4,Seth93,Sethares (1993),interference,#B50000,Pure tones
11.80955955955956,-1.5386890606990857e-4,Seth93,Sethares (1993),interference,#B50000,Pure tones
11.81006006006006,-1.5379023492528368e-4,Seth93,Sethares (1993),interference,#B50000,Pure tones
11.81056056056056,-1.5371144444561834e-4,Seth93,Sethares (1993),interference,#B50000,Pure tones
11.81106106106106,-1.5363284914670324e-4,Seth93,Sethares (1993),interference,#B50000,Pure tones
11.811561561561561,-1.5355413463022678e-4,Seth93,Sethares (1993),interference,#B50000,Pure tones
11.812062062062061,-1.5347561510874161e-4,Seth93,Sethares (1993),interference,#B50000,Pure tones
11.812562562562563,-1.5339697648706594e-4,Seth93,Sethares (1993),interference,#B50000,Pure tones
11.813063063063064,-1.533185326747897e-4,Seth93,Sethares (1993),interference,#B50000,Pure tones
11.813563563563564,-1.5323996987958387e-4,Seth93,Sethares (1993),interference,#B50000,Pure tones
11.814064064064064,-1.531616017083524e-4,Seth93,Sethares (1993),interference,#B50000,Pure tones
11.814564564564565,-1.5308311467134318e-4,Seth93,Sethares (1993),interference,#B50000,Pure tones
11.815065065065065,-1.5300482207304653e-4,Seth93,Sethares (1993),interference,#B50000,Pure tones
11.815565565565565,-1.5292641072601738e-4,Seth93,Sethares (1993),interference,#B50000,Pure tones
11.816066066066066,-1.5284819363260376e-4,Seth93,Sethares (1993),interference,#B50000,Pure tones
11.816566566566566,-1.5276985790739454e-4,Seth93,Sethares (1993),interference,#B50000,Pure tones
11.817067067067066,-1.5269171625086972e-4,Seth93,Sethares (1993),interference,#B50000,Pure tones
11.817567567567568,-1.5261345607937634e-4,Seth93,Sethares (1993),interference,#B50000,Pure tones
11.818068068068069,-1.5253538979179766e-4,Seth93,Sethares (1993),interference,#B50000,Pure tones
11.818568568568569,-1.5245720510597362e-4,Seth93,Sethares (1993),interference,#B50000,Pure tones
11.81906906906907,-1.5237921411945926e-4,Seth93,Sethares (1993),interference,#B50000,Pure tones
11.81956956956957,-1.523011048513143e-4,Seth93,Sethares (1993),interference,#B50000,Pure tones
11.82007007007007,-1.5222318909803735e-4,Seth93,Sethares (1993),interference,#B50000,Pure tones
11.82057057057057,-1.5214515517963668e-4,Seth93,Sethares (1993),interference,#B50000,Pure tones
11.82107107107107,-1.5206731459182794e-4,Seth93,Sethares (1993),interference,#B50000,Pure tones
11.821571571571571,-1.5198935595529367e-4,Seth93,Sethares (1993),interference,#B50000,Pure tones
11.822072072072071,-1.5191159046523895e-4,Seth93,Sethares (1993),interference,#B50000,Pure tones
11.822572572572573,-1.5183370704275007e-4,Seth93,Sethares (1993),interference,#B50000,Pure tones
11.823073073073074,-1.517560165827932e-4,Seth93,Sethares (1993),interference,#B50000,Pure tones
11.823573573573574,-1.5167820830658488e-4,Seth93,Sethares (1993),interference,#B50000,Pure tones
11.824074074074074,-1.5160059280912012e-4,Seth93,Sethares (1993),interference,#B50000,Pure tones
11.824574574574575,-1.515228596114837e-4,Seth93,Sethares (1993),interference,#B50000,Pure tones
11.825075075075075,-1.5144531900896779e-4,Seth93,Sethares (1993),interference,#B50000,Pure tones
11.825575575575575,-1.5136766082225018e-4,Seth93,Sethares (1993),interference,#B50000,Pure tones
11.826076076076076,-1.5129019504719335e-4,Seth93,Sethares (1993),interference,#B50000,Pure tones
11.826576576576576,-1.5121261180379948e-4,Seth93,Sethares (1993),interference,#B50000,Pure tones
11.827077077077076,-1.5113522078876804e-4,Seth93,Sethares (1993),interference,#B50000,Pure tones
11.827577577577578,-1.5105771242115767e-4,Seth93,Sethares (1993),interference,#B50000,Pure tones
11.828078078078079,-1.5098039609877508e-4,Seth93,Sethares (1993),interference,#B50000,Pure tones
11.828578578578579,-1.509029625394636e-4,Seth93,Sethares (1993),interference,#B50000,Pure tones
11.82907907907908,-1.5082572084241087e-4,Seth93,Sethares (1993),interference,#B50000,Pure tones
11.82957957957958,-1.5074836202396728e-4,Seth93,Sethares (1993),interference,#B50000,Pure tones
11.83008008008008,-1.506711948849771e-4,Seth93,Sethares (1993),interference,#B50000,Pure tones
11.83058058058058,-1.5059391074003563e-4,Seth93,Sethares (1993),interference,#B50000,Pure tones
11.83108108108108,-1.5051681809189472e-4,Seth93,Sethares (1993),interference,#B50000,Pure tones
11.831581581581581,-1.5043960855313647e-4,Seth93,Sethares (1993),interference,#B50000,Pure tones
11.832082082082081,-1.5036259032869518e-4,Seth93,Sethares (1993),interference,#B50000,Pure tones
11.832582582582583,-1.5028545532886042e-4,Seth93,Sethares (1993),interference,#B50000,Pure tones
11.833083083083084,-1.5020851146101984e-4,Seth93,Sethares (1993),interference,#B50000,Pure tones
11.833583583583584,-1.5013145093290418e-4,Seth93,Sethares (1993),interference,#B50000,Pure tones
11.834084084084084,-1.5005458135462264e-4,Seth93,Sethares (1993),interference,#B50000,Pure tones
11.834584584584585,-1.4997759523107786e-4,Seth93,Sethares (1993),interference,#B50000,Pure tones
11.835085085085085,-1.499007998753698e-4,Seth93,Sethares (1993),interference,#B50000,Pure tones
11.835585585585585,-1.4982388808930356e-4,Seth93,Sethares (1993),interference,#B50000,Pure tones
11.836086086086086,-1.4974716688923942e-4,Seth93,Sethares (1993),interference,#B50000,Pure tones
11.836586586586586,-1.4967032937361624e-4,Seth93,Sethares (1993),interference,#B50000,Pure tones
11.837087087087086,-1.4959368226231712e-4,Seth93,Sethares (1993),interference,#B50000,Pure tones
11.837587587587588,-1.4951691895015424e-4,Seth93,Sethares (1993),interference,#B50000,Pure tones
11.838088088088089,-1.4944034586080246e-4,Seth93,Sethares (1993),interference,#B50000,Pure tones
11.838588588588589,-1.493636566851761e-4,Seth93,Sethares (1993),interference,#B50000,Pure tones
11.83908908908909,-1.4928715755100865e-4,Seth93,Sethares (1993),interference,#B50000,Pure tones
11.83958958958959,-1.492105424450489e-4,Seth93,Sethares (1993),interference,#B50000,Pure tones
11.84009009009009,-1.4913411719935763e-4,Seth93,Sethares (1993),interference,#B50000,Pure tones
11.84059059059059,-1.4905757609624953e-4,Seth93,Sethares (1993),interference,#B50000,Pure tones
11.84109109109109,-1.4898122467238087e-4,Seth93,Sethares (1993),interference,#B50000,Pure tones
11.841591591591591,-1.4890475750536805e-4,Seth93,Sethares (1993),interference,#B50000,Pure tones
11.842092092092091,-1.4882847983672693e-4,Seth93,Sethares (1993),interference,#B50000,Pure tones
11.842592592592593,-1.4875208653910532e-4,Seth93,Sethares (1993),interference,#B50000,Pure tones
11.843093093093094,-1.4867588255914542e-4,Seth93,Sethares (1993),interference,#B50000,Pure tones
11.843593593593594,-1.4859956306426838e-4,Seth93,Sethares (1993),interference,#B50000,Pure tones
11.844094094094094,-1.4852343270650552e-4,Seth93,Sethares (1993),interference,#B50000,Pure tones
11.844594594594595,-1.4844718694778078e-4,Seth93,Sethares (1993),interference,#B50000,Pure tones
11.845095095095095,-1.4837113014578332e-4,Seth93,Sethares (1993),interference,#B50000,Pure tones
11.845595595595595,-1.4829495805667348e-4,Seth93,Sethares (1993),interference,#B50000,Pure tones
11.846096096096096,-1.4821897474406607e-4,Seth93,Sethares (1993),interference,#B50000,Pure tones
11.846596596596596,-1.4814287625809124e-4,Seth93,Sethares (1993),interference,#B50000,Pure tones
11.847097097097096,-1.4806696636855248e-4,Seth93,Sethares (1993),interference,#B50000,Pure tones
11.847597597597598,-1.479909414192865e-4,Seth93,Sethares (1993),interference,#B50000,Pure tones
11.848098098098099,-1.47915104886553e-4,Seth93,Sethares (1993),interference,#B50000,Pure tones
11.848598598598599,-1.4783915340762583e-4,Seth93,Sethares (1993),interference,#B50000,Pure tones
11.8490990990991,-1.4776339016548242e-4,Seth93,Sethares (1993),interference,#B50000,Pure tones
11.8495995995996,-1.4768751209057816e-4,Seth93,Sethares (1993),interference,#B50000,Pure tones
11.8501001001001,-1.4761182207287258e-4,Seth93,Sethares (1993),interference,#B50000,Pure tones
11.8506006006006,-1.4753601733573084e-4,Seth93,Sethares (1993),interference,#B50000,Pure tones
11.8511011011011,-1.4746040047636193e-4,Seth93,Sethares (1993),interference,#B50000,Pure tones
11.851601601601601,-1.4738466901077877e-4,Seth93,Sethares (1993),interference,#B50000,Pure tones
11.852102102102101,-1.4730912524370103e-4,Seth93,Sethares (1993),interference,#B50000,Pure tones
11.852602602602603,-1.4723346698352664e-4,Seth93,Sethares (1993),interference,#B50000,Pure tones
11.853103103103104,-1.4715799624274997e-4,Seth93,Sethares (1993),interference,#B50000,Pure tones
11.853603603603604,-1.4708241112188825e-4,Seth93,Sethares (1993),interference,#B50000,Pure tones
11.854104104104104,-1.4700701334147842e-4,Seth93,Sethares (1993),interference,#B50000,Pure tones
11.854604604604605,-1.4693150129389075e-4,Seth93,Sethares (1993),interference,#B50000,Pure tones
11.855105105105105,-1.4685617640796804e-4,Seth93,Sethares (1993),interference,#B50000,Pure tones
11.855605605605605,-1.4678073736766915e-4,Seth93,Sethares (1993),interference,#B50000,Pure tones
11.856106106106106,-1.4670548531040464e-4,Seth93,Sethares (1993),interference,#B50000,Pure tones
11.856606606606606,-1.4663011921146426e-4,Seth93,Sethares (1993),interference,#B50000,Pure tones
11.857107107107106,-1.4655493991708906e-4,Seth93,Sethares (1993),interference,#B50000,Pure tones
11.857607607607608,-1.4647964669363314e-4,Seth93,Sethares (1993),interference,#B50000,Pure tones
11.858108108108109,-1.464045400964305e-4,Seth93,Sethares (1993),interference,#B50000,Pure tones
11.858608608608609,-1.463293196826396e-4,Seth93,Sethares (1993),interference,#B50000,Pure tones
11.85910910910911,-1.4625428571694808e-4,Seth93,Sethares (1993),interference,#B50000,Pure tones
11.85960960960961,-1.4617913804705577e-4,Seth93,Sethares (1993),interference,#B50000,Pure tones
11.86011011011011,-1.4610417664727044e-4,Seth93,Sethares (1993),interference,#B50000,Pure tones
11.86061061061061,-1.4602910165556664e-4,Seth93,Sethares (1993),interference,#B50000,Pure tones
11.86111111111111,-1.4595421275613593e-4,Seth93,Sethares (1993),interference,#B50000,Pure tones
11.861611611611611,-1.4587921037696508e-4,Seth93,Sethares (1993),interference,#B50000,Pure tones
11.862112112112111,-1.458043939123879e-4,Seth93,Sethares (1993),interference,#B50000,Pure tones
11.862612612612613,-1.4572946408014916e-4,Seth93,Sethares (1993),interference,#B50000,Pure tones
11.863113113113114,-1.4565471998498523e-4,Seth93,Sethares (1993),interference,#B50000,Pure tones
11.863613613613614,-1.4557986263413183e-4,Seth93,Sethares (1993),interference,#B50000,Pure tones
11.864114114114114,-1.4550519084299308e-4,Seth93,Sethares (1993),interference,#B50000,Pure tones
11.864614614614615,-1.45430405908033e-4,Seth93,Sethares (1993),interference,#B50000,Pure tones
11.865115115115115,-1.4535580635558504e-4,Seth93,Sethares (1993),interference,#B50000,Pure tones
11.865615615615615,-1.452810937710826e-4,Seth93,Sethares (1993),interference,#B50000,Pure tones
11.866116116116116,-1.4520656639204605e-4,Seth93,Sethares (1993),interference,#B50000,Pure tones
11.866616616616616,-1.4513192609261674e-4,Seth93,Sethares (1993),interference,#B50000,Pure tones
11.867117117117116,-1.4505747082176951e-4,Seth93,Sethares (1993),interference,#B50000,Pure tones
11.867617617617618,-1.4498290274208642e-4,Seth93,Sethares (1993),interference,#B50000,Pure tones
11.868118118118119,-1.4490851951425352e-4,Seth93,Sethares (1993),interference,#B50000,Pure tones
11.868618618618619,-1.4483402358904222e-4,Seth93,Sethares (1993),interference,#B50000,Pure tones
11.86911911911912,-1.4475971233910898e-4,Seth93,Sethares (1993),interference,#B50000,Pure tones
11.86961961961962,-1.446852885031509e-4,Seth93,Sethares (1993),interference,#B50000,Pure tones
11.87012012012012,-1.4461104916605589e-4,Seth93,Sethares (1993),interference,#B50000,Pure tones
11.87062062062062,-1.4453669735418667e-4,Seth93,Sethares (1993),interference,#B50000,Pure tones
11.87112112112112,-1.4446252986492138e-4,Seth93,Sethares (1993),interference,#B50000,Pure tones
11.871621621621621,-1.4438825001202892e-4,Seth93,Sethares (1993),interference,#B50000,Pure tones
11.872122122122121,-1.4431415430564122e-4,Seth93,Sethares (1993),interference,#B50000,Pure tones
11.872622622622623,-1.4423994634667027e-4,Seth93,Sethares (1993),interference,#B50000,Pure tones
11.873123123123124,-1.441659223582603e-4,Seth93,Sethares (1993),interference,#B50000,Pure tones
11.873623623623624,-1.4409178622820784e-4,Seth93,Sethares (1993),interference,#B50000,Pure tones
11.874124124124124,-1.440178338929314e-4,Seth93,Sethares (1993),interference,#B50000,Pure tones
11.874624624624625,-1.4394376952685123e-4,Seth93,Sethares (1993),interference,#B50000,Pure tones
11.875125125125125,-1.43869888779914e-4,Seth93,Sethares (1993),interference,#B50000,Pure tones
11.875625625625625,-1.4379589611291093e-4,Seth93,Sethares (1993),interference,#B50000,Pure tones
11.876126126126126,-1.437220868895776e-4,Seth93,Sethares (1993),interference,#B50000,Pure tones
11.876626626626626,-1.4364816585681297e-4,Seth93,Sethares (1993),interference,#B50000,Pure tones
11.877127127127126,-1.4357442809240106e-4,Seth93,Sethares (1993),interference,#B50000,Pure tones
11.877627627627628,-1.4350057862908897e-4,Seth93,Sethares (1993),interference,#B50000,Pure tones
11.878128128128129,-1.434269122589689e-4,Seth93,Sethares (1993),interference,#B50000,Pure tones
11.87862862862863,-1.4335313430037782e-4,Seth93,Sethares (1993),interference,#B50000,Pure tones
11.87912912912913,-1.432795392599737e-4,Seth93,Sethares (1993),interference,#B50000,Pure tones
11.87962962962963,-1.432058327414271e-4,Seth93,Sethares (1993),interference,#B50000,Pure tones
11.88013013013013,-1.4313230896621969e-4,Seth93,Sethares (1993),interference,#B50000,Pure tones
11.88063063063063,-0.00014305867382309321,Seth93,Sethares (1993),interference,#B50000,Pure tones
11.88113113113113,-1.4298522124861138e-4,Seth93,Sethares (1993),interference,#B50000,Pure tones
11.881631631631631,-1.4291165741633642e-4,Seth93,Sethares (1993),interference,#B50000,Pure tones
11.882132132132131,-1.4283827597816806e-4,Seth93,Sethares (1993),interference,#B50000,Pure tones
11.882632632632633,-1.4276478339222758e-4,Seth93,Sethares (1993),interference,#B50000,Pure tones
11.883133133133134,-1.426914730260134e-4,Seth93,Sethares (1993),interference,#B50000,Pure tones
11.883633633633634,-1.426180516219468e-4,Seth93,Sethares (1993),interference,#B50000,Pure tones
11.884134134134134,-1.4254481226337988e-4,Seth93,Sethares (1993),interference,#B50000,Pure tones
11.884634634634635,-1.4247146197677812e-4,Seth93,Sethares (1993),interference,#B50000,Pure tones
11.885135135135135,-1.423982935616061e-4,Seth93,Sethares (1993),interference,#B50000,Pure tones
11.885635635635635,-1.4232501432811633e-4,Seth93,Sethares (1993),interference,#B50000,Pure tones
11.886136136136136,-1.42251916792142e-4,Seth93,Sethares (1993),interference,#B50000,Pure tones
11.886636636636636,-1.4217870854746185e-4,Seth93,Sethares (1993),interference,#B50000,Pure tones
11.887137137137136,-1.4210568182653643e-4,Seth93,Sethares (1993),interference,#B50000,Pure tones
11.887637637637638,-1.4203254450642088e-4,Seth93,Sethares (1993),interference,#B50000,Pure tones
11.888138138138139,-1.4195958853645307e-4,Seth93,Sethares (1993),interference,#B50000,Pure tones
11.88863863863864,-1.4188652207670755e-4,Seth93,Sethares (1993),interference,#B50000,Pure tones
11.88913913913914,-1.4181363679366028e-4,Seth93,Sethares (1993),interference,#B50000,Pure tones
11.88963963963964,-1.417406411301462e-4,Seth93,Sethares (1993),interference,#B50000,Pure tones
11.89014014014014,-1.4166782647003436e-4,Seth93,Sethares (1993),interference,#B50000,Pure tones
11.89064064064064,-1.4159490153866492e-4,Seth93,Sethares (1993),interference,#B50000,Pure tones
11.89114114114114,-1.4152215743755685e-4,Seth93,Sethares (1993),interference,#B50000,Pure tones
11.891641641641641,-1.4144930317429923e-4,Seth93,Sethares (1993),interference,#B50000,Pure tones
11.892142142142141,-1.4137662956831672e-4,Seth93,Sethares (1993),interference,#B50000,Pure tones
11.892642642642643,-1.413038459091927e-4,Seth93,Sethares (1993),interference,#B50000,Pure tones
11.893143143143144,-1.4123124273451328e-4,Seth93,Sethares (1993),interference,#B50000,Pure tones
11.893643643643644,-1.4115852961559726e-4,Seth93,Sethares (1993),interference,#B50000,Pure tones
11.894144144144144,-1.410859968084454e-4,Seth93,Sethares (1993),interference,#B50000,Pure tones
11.894644644644645,-1.410133541658642e-4,Seth93,Sethares (1993),interference,#B50000,Pure tones
11.895145145145145,-1.4094089166252386e-4,Seth93,Sethares (1993),interference,#B50000,Pure tones
11.895645645645645,-1.4086831943245964e-4,Seth93,Sethares (1993),interference,#B50000,Pure tones
11.896146146146146,-1.4079592716926601e-4,Seth93,Sethares (1993),interference,#B50000,Pure tones
11.896646646646646,-1.4072342528795157e-4,Seth93,Sethares (1993),interference,#B50000,Pure tones
11.897147147147146,-1.4065110320129307e-4,Seth93,Sethares (1993),interference,#B50000,Pure tones
11.897647647647648,-1.4057867160501767e-4,Seth93,Sethares (1993),interference,#B50000,Pure tones
11.898148148148149,-1.4050641963133515e-4,Seth93,Sethares (1993),interference,#B50000,Pure tones
11.89864864864865,-1.404340582564386e-4,Seth93,Sethares (1993),interference,#B50000,Pure tones
11.89914914914915,-1.4036187633222917e-4,Seth93,Sethares (1993),interference,#B50000,Pure tones
11.89964964964965,-1.4028958511510623e-4,Seth93,Sethares (1993),interference,#B50000,Pure tones
11.90015015015015,-1.402174731769132e-4,Seth93,Sethares (1993),interference,#B50000,Pure tones
11.90065065065065,-1.4014525205401128e-4,Seth93,Sethares (1993),interference,#B50000,Pure tones
11.90115115115115,-1.400732100384372e-4,Seth93,Sethares (1993),interference,#B50000,Pure tones
11.901651651651651,-1.4000105894625635e-4,Seth93,Sethares (1993),interference,#B50000,Pure tones
11.902152152152151,-1.3992908678995498e-4,Seth93,Sethares (1993),interference,#B50000,Pure tones
11.902652652652653,-1.398570056650479e-4,Seth93,Sethares (1993),interference,#B50000,Pure tones
11.903153153153154,-1.3978510330472604e-4,Seth93,Sethares (1993),interference,#B50000,Pure tones
11.903653653653654,-1.3971309208370082e-4,Seth93,Sethares (1993),interference,#B50000,Pure tones
11.904154154154154,-1.396412594561169e-4,Seth93,Sethares (1993),interference,#B50000,Pure tones
11.904654654654655,-1.395693180756315e-4,Seth93,Sethares (1993),interference,#B50000,Pure tones
11.905155155155155,-1.394975551176013e-4,Seth93,Sethares (1993),interference,#B50000,Pure tones
11.905655655655655,-1.394256835143689e-4,Seth93,Sethares (1993),interference,#B50000,Pure tones
11.906156156156156,-1.393539901627529e-4,Seth93,Sethares (1993),interference,#B50000,Pure tones
11.906656656656656,-1.392821882735388e-4,Seth93,Sethares (1993),interference,#B50000,Pure tones
11.907157157157156,-1.3921056446525662e-4,Seth93,Sethares (1993),interference,#B50000,Pure tones
11.907657657657658,-1.391388322268788e-4,Seth93,Sethares (1993),interference,#B50000,Pure tones
11.908158158158159,-1.3906727789890093e-4,Seth93,Sethares (1993),interference,#B50000,Pure tones
11.90865865865866,-1.3899561524823118e-4,Seth93,Sethares (1993),interference,#B50000,Pure tones
11.90915915915916,-1.3892413033758132e-4,Seth93,Sethares (1993),interference,#B50000,Pure tones
11.90965965965966,-1.3885253721154252e-4,Seth93,Sethares (1993),interference,#B50000,Pure tones
11.91016016016016,-1.3878112165529728e-4,Seth93,Sethares (1993),interference,#B50000,Pure tones
11.91066066066066,-1.387095979908663e-4,Seth93,Sethares (1993),interference,#B50000,Pure tones
11.91116116116116,-1.3863825172615341e-4,Seth93,Sethares (1993),interference,#B50000,Pure tones
11.911661661661661,-1.3856679746036008e-4,Seth93,Sethares (1993),interference,#B50000,Pure tones
11.912162162162161,-1.3849552042436293e-4,Seth93,Sethares (1993),interference,#B50000,Pure tones
11.912662662662663,-1.3842413549428834e-4,Seth93,Sethares (1993),interference,#B50000,Pure tones
11.913163163163164,-1.3835292762423782e-4,Seth93,Sethares (1993),interference,#B50000,Pure tones
11.913663663663664,-1.382816119670171e-4,Seth93,Sethares (1993),interference,#B50000,Pure tones
11.914164164164164,-1.3821047320020045e-4,Seth93,Sethares (1993),interference,#B50000,Pure tones
11.914664664664665,-1.3813922675301997e-4,Seth93,Sethares (1993),interference,#B50000,Pure tones
11.915165165165165,-1.3806815702677703e-4,Seth93,Sethares (1993),interference,#B50000,Pure tones
11.915665665665665,-1.3799697972687784e-4,Seth93,Sethares (1993),interference,#B50000,Pure tones
11.916166166166166,-1.3792597897859804e-4,Seth93,Sethares (1993),interference,#B50000,Pure tones
11.916666666666666,-1.3785487076327133e-4,Seth93,Sethares (1993),interference,#B50000,Pure tones
11.917167167167166,-1.3778393893040062e-4,Seth93,Sethares (1993),interference,#B50000,Pure tones
11.917667667667668,-1.377128997369912e-4,Seth93,Sethares (1993),interference,#B50000,Pure tones
11.918168168168169,-1.376420367570255e-4,Seth93,Sethares (1993),interference,#B50000,Pure tones
11.91866866866867,-1.375710665229317e-4,Seth93,Sethares (1993),interference,#B50000,Pure tones
11.91916916916917,-1.37500272333416e-4,Seth93,Sethares (1993),interference,#B50000,Pure tones
11.91966966966967,-1.374293709960861e-4,Seth93,Sethares (1993),interference,#B50000,Pure tones
11.92017017017017,-1.3735864553462285e-4,Seth93,Sethares (1993),interference,#B50000,Pure tones
11.92067067067067,-1.3728781303155917e-4,Seth93,Sethares (1993),interference,#B50000,Pure tones
11.92117117117117,-1.372171562358013e-4,Seth93,Sethares (1993),interference,#B50000,Pure tones
11.921671671671671,-1.3714639250455852e-4,Seth93,Sethares (1993),interference,#B50000,Pure tones
11.922172172172171,-1.3707580431221054e-4,Seth93,Sethares (1993),interference,#B50000,Pure tones
11.922672672672673,-1.3700510929039487e-4,Seth93,Sethares (1993),interference,#B50000,Pure tones
11.923173173173174,-1.369345896392148e-4,Seth93,Sethares (1993),interference,#B50000,Pure tones
11.923673673673674,-1.3686396326448327e-4,Seth93,Sethares (1993),interference,#B50000,Pure tones
11.924174174174174,-1.367935120922823e-4,Seth93,Sethares (1993),interference,#B50000,Pure tones
11.924674674674675,-1.3672295430234777e-4,Seth93,Sethares (1993),interference,#B50000,Pure tones
11.925175175175175,-1.366525715469828e-4,Seth93,Sethares (1993),interference,#B50000,Pure tones
11.925675675675675,-1.3658208227960812e-4,Seth93,Sethares (1993),interference,#B50000,Pure tones
11.926176176176176,-1.3651176787899403e-4,Seth93,Sethares (1993),interference,#B50000,Pure tones
11.926676676676676,-1.364413470719937e-4,Seth93,Sethares (1993),interference,#B50000,Pure tones
11.927177177177176,-1.363711009640965e-4,Seth93,Sethares (1993),interference,#B50000,Pure tones
11.927677677677679,-1.3630074855533833e-4,Seth93,Sethares (1993),interference,#B50000,Pure tones
11.928178178178179,-1.3623057067817517e-4,Seth93,Sethares (1993),interference,#B50000,Pure tones
11.92867867867868,-1.3616028660557876e-4,Seth93,Sethares (1993),interference,#B50000,Pure tones
11.92917917917918,-1.3609017689721785e-4,Seth93,Sethares (1993),interference,#B50000,Pure tones
11.92967967967968,-1.3601996109875435e-4,Seth93,Sethares (1993),interference,#B50000,Pure tones
11.93018018018018,-1.3594991949731933e-4,Seth93,Sethares (1993),interference,#B50000,Pure tones
11.93068068068068,-1.358797719110099e-4,Seth93,Sethares (1993),interference,#B50000,Pure tones
11.93118118118118,-1.3580979835467227e-4,Seth93,Sethares (1993),interference,#B50000,Pure tones
11.931681681681681,-1.357397189185956e-4,Seth93,Sethares (1993),interference,#B50000,Pure tones
11.932182182182181,-1.3566981334557727e-4,Seth93,Sethares (1993),interference,#B50000,Pure tones
11.932682682682684,-1.3559980199785954e-4,Seth93,Sethares (1993),interference,#B50000,Pure tones
11.933183183183184,-1.355299643464388e-4,Seth93,Sethares (1993),interference,#B50000,Pure tones
11.933683683683684,-1.3546002102525812e-4,Seth93,Sethares (1993),interference,#B50000,Pure tones
11.934184184184184,-1.353902512337642e-4,Seth93,Sethares (1993),interference,#B50000,Pure tones
11.934684684684685,-1.3532037587735113e-4,Seth93,Sethares (1993),interference,#B50000,Pure tones
11.935185185185185,-1.3525067388416286e-4,Seth93,Sethares (1993),interference,#B50000,Pure tones
11.935685685685685,-1.351808664308003e-4,Seth93,Sethares (1993),interference,#B50000,Pure tones
11.936186186186186,-1.3511123217435026e-4,Seth93,Sethares (1993),interference,#B50000,Pure tones
11.936686686686686,-1.350414925623716e-4,Seth93,Sethares (1993),interference,#B50000,Pure tones
11.937187187187186,-1.349719259811438e-4,Seth93,Sethares (1993),interference,#B50000,Pure tones
11.937687687687689,-1.3490225414893609e-4,Seth93,Sethares (1993),interference,#B50000,Pure tones
11.938188188188189,-1.3483275518146195e-4,Seth93,Sethares (1993),interference,#B50000,Pure tones
11.93868868868869,-1.347631510674619e-4,Seth93,Sethares (1993),interference,#B50000,Pure tones
11.93918918918919,-1.3469371965232836e-4,Seth93,Sethares (1993),interference,#B50000,Pure tones
11.93968968968969,-1.346241831950258e-4,Seth93,Sethares (1993),interference,#B50000,Pure tones
11.94019019019019,-1.345548192708716e-4,Seth93,Sethares (1993),interference,#B50000,Pure tones
11.94069069069069,-1.344853504088075e-4,Seth93,Sethares (1993),interference,#B50000,Pure tones
11.94119119119119,-1.344160539143213e-4,Seth93,Sethares (1993),interference,#B50000,Pure tones
11.941691691691691,-1.3434665258608636e-4,Seth93,Sethares (1993),interference,#B50000,Pure tones
11.942192192192191,-1.3427742346000938e-4,Seth93,Sethares (1993),interference,#B50000,Pure tones
11.942692692692694,-1.3420808960424807e-4,Seth93,Sethares (1993),interference,#B50000,Pure tones
11.943193193193194,-1.3413892778537317e-4,Seth93,Sethares (1993),interference,#B50000,Pure tones
11.943693693693694,-1.3406966134078065e-4,Seth93,Sethares (1993),interference,#B50000,Pure tones
11.944194194194194,-1.3400056676794814e-4,Seth93,Sethares (1993),interference,#B50000,Pure tones
11.944694694694695,-1.3393136767327085e-4,Seth93,Sethares (1993),interference,#B50000,Pure tones
11.945195195195195,-1.3386234028537646e-4,Seth93,Sethares (1993),interference,#B50000,Pure tones
11.945695695695695,-1.337932084794128e-4,Seth93,Sethares (1993),interference,#B50000,Pure tones
11.946196196196196,-1.3372424821540187e-4,Seth93,Sethares (1993),interference,#B50000,Pure tones
11.946696696696696,-1.336551836370012e-4,Seth93,Sethares (1993),interference,#B50000,Pure tones
11.947197197197196,-1.3358629043587096e-4,Seth93,Sethares (1993),interference,#B50000,Pure tones
11.947697697697699,-1.335172930239339e-4,Seth93,Sethares (1993),interference,#B50000,Pure tones
11.948198198198199,-1.3344846682473258e-4,Seth93,Sethares (1993),interference,#B50000,Pure tones
11.9486986986987,-1.3337953651821013e-4,Seth93,Sethares (1993),interference,#B50000,Pure tones
11.9491991991992,-1.333107772600394e-4,Seth93,Sethares (1993),interference,#B50000,Pure tones
11.9496996996997,-1.3324191399793347e-4,Seth93,Sethares (1993),interference,#B50000,Pure tones
11.9502002002002,-1.3317322161994074e-4,Seth93,Sethares (1993),interference,#B50000,Pure tones
11.9507007007007,-1.33104425341309e-4,Seth93,Sethares (1993),interference,#B50000,Pure tones
11.9512012012012,-1.330357997826941e-4,Seth93,Sethares (1993),interference,#B50000,Pure tones
11.951701701701701,-1.3296707042664016e-4,Seth93,Sethares (1993),interference,#B50000,Pure tones
11.952202202202201,-1.3289851162665803e-4,Seth93,Sethares (1993),interference,#B50000,Pure tones
11.952702702702704,-1.328298491323377e-4,Seth93,Sethares (1993),interference,#B50000,Pure tones
11.953203203203204,-1.3276135703029163e-4,Seth93,Sethares (1993),interference,#B50000,Pure tones
11.953703703703704,-1.3269276133691312e-4,Seth93,Sethares (1993),interference,#B50000,Pure tones
11.954204204204204,-1.3262433587215642e-4,Seth93,Sethares (1993),interference,#B50000,Pure tones
11.954704704704705,-1.3255580691897865e-4,Seth93,Sethares (1993),interference,#B50000,Pure tones
11.955205205205205,-1.324874480309172e-4,Seth93,Sethares (1993),interference,#B50000,Pure tones
11.955705705705705,-1.3241898575724913e-4,Seth93,Sethares (1993),interference,#B50000,Pure tones
11.956206206206206,-1.323506933853406e-4,Seth93,Sethares (1993),interference,#B50000,Pure tones
11.956706706706706,-1.3228229773054267e-4,Seth93,Sethares (1993),interference,#B50000,Pure tones
11.957207207207206,-1.3221407181429116e-4,Seth93,Sethares (1993),interference,#B50000,Pure tones
11.957707707707709,-1.321457427177747e-4,Seth93,Sethares (1993),interference,#B50000,Pure tones
11.958208208208209,-1.3207758319673857e-4,Seth93,Sethares (1993),interference,#B50000,Pure tones
11.95870870870871,-1.3200932059796624e-4,Seth93,Sethares (1993),interference,#B50000,Pure tones
11.95920920920921,-1.3194122741175463e-4,Seth93,Sethares (1993),interference,#B50000,Pure tones
11.95970970970971,-1.3187303125023882e-4,Seth93,Sethares (1993),interference,#B50000,Pure tones
11.96021021021021,-1.3180500433851043e-4,Seth93,Sethares (1993),interference,#B50000,Pure tones
11.96071071071071,-1.3173687455381568e-4,Seth93,Sethares (1993),interference,#B50000,Pure tones
11.96121121121121,-1.3166891385628057e-4,Seth93,Sethares (1993),interference,#B50000,Pure tones
11.961711711711711,-1.3160085038802126e-4,Seth93,Sethares (1993),interference,#B50000,Pure tones
11.962212212212211,-1.3153295584444153e-4,Seth93,Sethares (1993),interference,#B50000,Pure tones
11.962712712712714,-1.3146495863228307e-4,Seth93,Sethares (1993),interference,#B50000,Pure tones
11.963213213213214,-1.3139713018246605e-4,Seth93,Sethares (1993),interference,#B50000,Pure tones
11.963713713713714,-1.313291991661237e-4,Seth93,Sethares (1993),interference,#B50000,Pure tones
11.964214214214214,-1.3126143674993418e-4,Seth93,Sethares (1993),interference,#B50000,Pure tones
11.964714714714715,-1.3119357186917486e-4,Seth93,Sethares (1993),interference,#B50000,Pure tones
11.965215215215215,-1.3112587542652305e-4,Seth93,Sethares (1993),interference,#B50000,Pure tones
11.965715715715715,-1.3105807662116504e-4,Seth93,Sethares (1993),interference,#B50000,Pure tones
11.966216216216216,-1.3099044609201366e-4,Seth93,Sethares (1993),interference,#B50000,Pure tones
11.966716716716716,-1.3092271330192336e-4,Seth93,Sethares (1993),interference,#B50000,Pure tones
11.967217217217216,-1.3085514862628715e-4,Seth93,Sethares (1993),interference,#B50000,Pure tones
11.967717717717719,-1.3078748179138274e-4,Seth93,Sethares (1993),interference,#B50000,Pure tones
11.968218218218219,-1.3071998290932593e-4,Seth93,Sethares (1993),interference,#B50000,Pure tones
11.96871871871872,-1.306523819695773e-4,Seth93,Sethares (1993),interference,#B50000,Pure tones
11.96921921921922,-1.3058494882120958e-4,Seth93,Sethares (1993),interference,#B50000,Pure tones
11.96971971971972,-1.305174137166353e-4,Seth93,Sethares (1993),interference,#B50000,Pure tones
11.97022022022022,-1.3045004624212328e-4,Seth93,Sethares (1993),interference,#B50000,Pure tones
11.97072072072072,-1.3038257691279313e-4,Seth93,Sethares (1993),interference,#B50000,Pure tones
11.97122122122122,-1.303152750523509e-4,Seth93,Sethares (1993),interference,#B50000,Pure tones
11.971721721721721,-1.3024787143838502e-4,Seth93,Sethares (1993),interference,#B50000,Pure tones
11.972222222222221,-1.3018063513227618e-4,Seth93,Sethares (1993),interference,#B50000,Pure tones
11.972722722722724,-1.301132971738448e-4,Seth93,Sethares (1993),interference,#B50000,Pure tones
11.973223223223224,-1.3004612636238606e-4,Seth93,Sethares (1993),interference,#B50000,Pure tones
11.973723723723724,-1.2997885399970978e-4,Seth93,Sethares (1993),interference,#B50000,Pure tones
11.974224224224224,-1.2991174862326486e-4,Seth93,Sethares (1993),interference,#B50000,Pure tones
11.974724724724725,-1.298445417966147e-4,Seth93,Sethares (1993),interference,#B50000,Pure tones
11.975225225225225,-1.2977750179560084e-4,Seth93,Sethares (1993),interference,#B50000,Pure tones
11.975725725725725,-1.2971036044529812e-4,Seth93,Sethares (1993),interference,#B50000,Pure tones
11.976226226226226,-1.2964338576017706e-4,Seth93,Sethares (1993),interference,#B50000,Pure tones
11.976726726726726,-1.295763098265918e-4,Seth93,Sethares (1993),interference,#B50000,Pure tones
11.977227227227226,-1.2950940039788074e-4,Seth93,Sethares (1993),interference,#B50000,Pure tones
11.977727727727729,-1.294423898214355e-4,Seth93,Sethares (1993),interference,#B50000,Pure tones
11.978228228228229,-1.2937554558969925e-4,Seth93,Sethares (1993),interference,#B50000,Pure tones
11.97872872872873,-1.2930860031086462e-4,Seth93,Sethares (1993),interference,#B50000,Pure tones
11.97922922922923,-1.292418212167194e-4,Seth93,Sethares (1993),interference,#B50000,Pure tones
11.97972972972973,-1.2917494117601808e-4,Seth93,Sethares (1993),interference,#B50000,Pure tones
11.98023023023023,-1.2910822716012826e-4,Seth93,Sethares (1993),interference,#B50000,Pure tones
11.98073073073073,-1.2904141229813095e-4,Seth93,Sethares (1993),interference,#B50000,Pure tones
11.98123123123123,-1.289747633012138e-4,Seth93,Sethares (1993),interference,#B50000,Pure tones
11.981731731731731,-1.2890801355854205e-4,Seth93,Sethares (1993),interference,#B50000,Pure tones
11.982232232232231,-1.2884142952135876e-4,Seth93,Sethares (1993),interference,#B50000,Pure tones
11.982732732732734,-1.2877474483868483e-4,Seth93,Sethares (1993),interference,#B50000,Pure tones
11.983233233233234,-1.2870822570205186e-4,Seth93,Sethares (1993),interference,#B50000,Pure tones
11.983733733733734,-1.2864160602009658e-4,Seth93,Sethares (1993),interference,#B50000,Pure tones
11.984234234234235,-1.2857515172487907e-4,Seth93,Sethares (1993),interference,#B50000,Pure tones
11.984734734734735,-1.2850859698441356e-4,Seth93,Sethares (1993),interference,#B50000,Pure tones
11.985235235235235,-1.2844220747152581e-4,Seth93,Sethares (1993),interference,#B50000,Pure tones
11.985735735735735,-1.2837571761337125e-4,Seth93,Sethares (1993),interference,#B50000,Pure tones
11.986236236236236,-1.2830939282377701e-4,Seth93,Sethares (1993),interference,#B50000,Pure tones
11.986736736736736,-1.2824296778880462e-4,Seth93,Sethares (1993),interference,#B50000,Pure tones
11.987237237237236,-1.2817670766352026e-4,Seth93,Sethares (1993),interference,#B50000,Pure tones
11.987737737737739,-1.2811034739264998e-4,Seth93,Sethares (1993),interference,#B50000,Pure tones
11.988238238238239,-1.28044151872734e-4,Seth93,Sethares (1993),interference,#B50000,Pure tones
11.98873873873874,-1.27977856306937e-4,Seth93,Sethares (1993),interference,#B50000,Pure tones
11.98923923923924,-1.279117253335055e-4,Seth93,Sethares (1993),interference,#B50000,Pure tones
11.98973973973974,-1.2784549441380126e-4,Seth93,Sethares (1993),interference,#B50000,Pure tones
11.99024024024024,-1.2777942792801546e-4,Seth93,Sethares (1993),interference,#B50000,Pure tones
11.99074074074074,-1.2771326159547456e-4,Seth93,Sethares (1993),interference,#B50000,Pure tones
11.99124124124124,-1.2764725953854755e-4,Seth93,Sethares (1993),interference,#B50000,Pure tones
11.991741741741741,-1.2758115773428834e-4,Seth93,Sethares (1993),interference,#B50000,Pure tones
11.992242242242241,-1.2751522004748168e-4,Seth93,Sethares (1993),interference,#B50000,Pure tones
11.992742742742744,-1.2744918271267273e-4,Seth93,Sethares (1993),interference,#B50000,Pure tones
11.993243243243244,-1.2738330933729675e-4,Seth93,Sethares (1993),interference,#B50000,Pure tones
11.993743743743744,-1.2731733641315826e-4,Seth93,Sethares (1993),interference,#B50000,Pure tones
11.994244244244245,-1.2725152729057515e-4,Seth93,Sethares (1993),interference,#B50000,Pure tones
11.994744744744745,-1.2718561871837385e-4,Seth93,Sethares (1993),interference,#B50000,Pure tones
11.995245245245245,-1.271198737899901e-4,Seth93,Sethares (1993),interference,#B50000,Pure tones
11.995745745745745,-1.2705402951104292e-4,Seth93,Sethares (1993),interference,#B50000,Pure tones
11.996246246246246,-1.2698834871832006e-4,Seth93,Sethares (1993),interference,#B50000,Pure tones
11.996746746746746,-1.2692256867399444e-4,Seth93,Sethares (1993),interference,#B50000,Pure tones
11.997247247247246,-1.2685695195844058e-4,Seth93,Sethares (1993),interference,#B50000,Pure tones
11.997747747747749,-1.2679123609015197e-4,Seth93,Sethares (1993),interference,#B50000,Pure tones
11.998248248248249,-1.2672568339332455e-4,Seth93,Sethares (1993),interference,#B50000,Pure tones
11.99874874874875,-1.2666003164253875e-4,Seth93,Sethares (1993),interference,#B50000,Pure tones
11.99924924924925,-1.265945429060448e-4,Seth93,Sethares (1993),interference,#B50000,Pure tones
11.99974974974975,-1.2652895521427657e-4,Seth93,Sethares (1993),interference,#B50000,Pure tones
12.00025025025025,-1.2646353037977382e-4,Seth93,Sethares (1993),interference,#B50000,Pure tones
12.00075075075075,-1.26398006688588e-4,Seth93,Sethares (1993),interference,#B50000,Pure tones
12.00125125125125,-1.2633264569777798e-4,Seth93,Sethares (1993),interference,#B50000,Pure tones
12.001751751751751,-1.26267185948787e-4,Seth93,Sethares (1993),interference,#B50000,Pure tones
12.002252252252251,-1.2620188874342612e-4,Seth93,Sethares (1993),interference,#B50000,Pure tones
12.002752752752754,-1.2613649287829254e-4,Seth93,Sethares (1993),interference,#B50000,Pure tones
12.003253253253254,-1.2607125940018466e-4,Seth93,Sethares (1993),interference,#B50000,Pure tones
12.003753753753754,-1.2600592736062018e-4,Seth93,Sethares (1993),interference,#B50000,Pure tones
12.004254254254255,-1.2594075755161695e-4,Seth93,Sethares (1993),interference,#B50000,Pure tones
12.004754754754755,-1.2587548927938218e-4,Seth93,Sethares (1993),interference,#B50000,Pure tones
12.005255255255255,-1.2581038308138635e-4,Seth93,Sethares (1993),interference,#B50000,Pure tones
12.005755755755755,-1.257451785182906e-4,Seth93,Sethares (1993),interference,#B50000,Pure tones
12.006256256256256,-1.256801358732538e-4,Seth93,Sethares (1993),interference,#B50000,Pure tones
12.006756756756756,-1.2561499496115672e-4,Seth93,Sethares (1993),interference,#B50000,Pure tones
12.007257257257256,-1.2555001581107358e-4,Seth93,Sethares (1993),interference,#B50000,Pure tones
12.007757757757759,-1.2548493849188293e-4,Seth93,Sethares (1993),interference,#B50000,Pure tones
12.008258258258259,-1.2542002277880434e-4,Seth93,Sethares (1993),interference,#B50000,Pure tones
12.00875875875876,-1.2535500899447753e-4,Seth93,Sethares (1993),interference,#B50000,Pure tones
12.00925925925926,-1.2529015666050056e-4,Seth93,Sethares (1993),interference,#B50000,Pure tones
12.00975975975976,-1.2522520635304193e-4,Seth93,Sethares (1993),interference,#B50000,Pure tones
12.01026026026026,-1.251604173403129e-4,Seth93,Sethares (1993),interference,#B50000,Pure tones
12.01076076076076,-1.2509553045177754e-4,Seth93,Sethares (1993),interference,#B50000,Pure tones
12.01126126126126,-1.250308047024908e-4,Seth93,Sethares (1993),interference,#B50000,Pure tones
12.011761761761761,-1.2496598117498265e-4,Seth93,Sethares (1993),interference,#B50000,Pure tones
12.012262262262261,-1.2490131863138166e-4,Seth93,Sethares (1993),interference,#B50000,Pure tones
12.012762762762764,-1.2483655840705277e-4,Seth93,Sethares (1993),interference,#B50000,Pure tones
12.013263263263264,-1.2477195901143098e-4,Seth93,Sethares (1993),interference,#B50000,Pure tones
12.013763763763764,-1.2470726203248268e-4,Seth93,Sethares (1993),interference,#B50000,Pure tones
12.014264264264265,-1.2464272572717752e-4,Seth93,Sethares (1993),interference,#B50000,Pure tones
12.014764764764765,-1.2457809193585918e-4,Seth93,Sethares (1993),interference,#B50000,Pure tones
12.015265265265265,-1.2451361866326217e-4,Seth93,Sethares (1993),interference,#B50000,Pure tones
12.015765765765765,-1.2444904800187277e-4,Seth93,Sethares (1993),interference,#B50000,Pure tones
12.016266266266266,-1.2438463770442167e-4,Seth93,Sethares (1993),interference,#B50000,Pure tones
12.016766766766766,-1.2432013011530823e-4,Seth93,Sethares (1993),interference,#B50000,Pure tones
12.017267267267266,-1.242557827354897e-4,Seth93,Sethares (1993),interference,#B50000,Pure tones
12.017767767767769,-1.241913381610481e-4,Seth93,Sethares (1993),interference,#B50000,Pure tones
12.018268268268269,-1.2412705364139674e-4,Seth93,Sethares (1993),interference,#B50000,Pure tones
12.01876876876877,-1.2406267202407108e-4,Seth93,Sethares (1993),interference,#B50000,Pure tones
12.01926926926927,-1.2399845030717298e-4,Seth93,Sethares (1993),interference,#B50000,Pure tones
12.01976976976977,-1.2393413158945604e-4,Seth93,Sethares (1993),interference,#B50000,Pure tones
12.02027027027027,-1.238699726179397e-4,Seth93,Sethares (1993),interference,#B50000,Pure tones
12.02077077077077,-1.238057167423733e-4,Seth93,Sethares (1993),interference,#B50000,Pure tones
12.02127127127127,-1.237416204589199e-4,Seth93,Sethares (1993),interference,#B50000,Pure tones
12.021771771771771,-1.2367742736809454e-4,Seth93,Sethares (1993),interference,#B50000,Pure tones
12.022272272272271,-1.23613393715433e-4,Seth93,Sethares (1993),interference,#B50000,Pure tones
12.022772772772774,-1.2354926335198655e-4,Seth93,Sethares (1993),interference,#B50000,Pure tones
12.023273273273274,-1.2348529227289464e-4,Seth93,Sethares (1993),interference,#B50000,Pure tones
12.023773773773774,-1.2342122457951386e-4,Seth93,Sethares (1993),interference,#B50000,Pure tones
12.024274274274275,-1.2335731601681644e-4,Seth93,Sethares (1993),interference,#B50000,Pure tones
12.024774774774775,-1.232933109362371e-4,Seth93,Sethares (1993),interference,#B50000,Pure tones
12.025275275275275,-1.232294648328093e-4,Seth93,Sethares (1993),interference,#B50000,Pure tones
12.025775775775776,-1.2316552230781465e-4,Seth93,Sethares (1993),interference,#B50000,Pure tones
12.026276276276276,-1.2310173860657494e-4,Seth93,Sethares (1993),interference,#B50000,Pure tones
12.026776776776776,-1.230378585799963e-4,Seth93,Sethares (1993),interference,#B50000,Pure tones
12.027277277277276,-1.2297413722391686e-4,Seth93,Sethares (1993),interference,#B50000,Pure tones
12.027777777777779,-1.229103196386349e-4,Seth93,Sethares (1993),interference,#B50000,Pure tones
12.028278278278279,-1.228466605707341e-4,Seth93,Sethares (1993),interference,#B50000,Pure tones
12.02877877877878,-1.2278290536967603e-4,Seth93,Sethares (1993),interference,#B50000,Pure tones
12.02927927927928,-1.227193085330199e-4,Seth93,Sethares (1993),interference,#B50000,Pure tones
12.02977977977978,-1.226556156591635e-4,Seth93,Sethares (1993),interference,#B50000,Pure tones
12.03028028028028,-1.225920809968664e-4,Seth93,Sethares (1993),interference,#B50000,Pure tones
12.03078078078078,-1.2252845039323546e-4,Seth93,Sethares (1993),interference,#B50000,Pure tones
12.03128128128128,-1.2246497784845932e-4,Seth93,Sethares (1993),interference,#B50000,Pure tones
12.031781781781781,-1.224014094581279e-4,Seth93,Sethares (1993),interference,#B50000,Pure tones
12.032282282282281,-1.2233799897408458e-4,Seth93,Sethares (1993),interference,#B50000,Pure tones
12.032782782782784,-1.222744927401722e-4,Seth93,Sethares (1993),interference,#B50000,Pure tones
12.033283283283284,-1.2221114426011712e-4,Seth93,Sethares (1993),interference,#B50000,Pure tones
12.033783783783784,-1.221477001257931e-4,Seth93,Sethares (1993),interference,#B50000,Pure tones
12.034284284284285,-1.2208441359303474e-4,Seth93,Sethares (1993),interference,#B50000,Pure tones
12.034784784784785,-1.2202103150151559e-4,Seth93,Sethares (1993),interference,#B50000,Pure tones
12.035285285285285,-1.2195780685940745e-4,Seth93,Sethares (1993),interference,#B50000,Pure tones
12.035785785785786,-1.2189448675395848e-4,Seth93,Sethares (1993),interference,#B50000,Pure tones
12.036286286286286,-1.2183132394590243e-4,Seth93,Sethares (1993),interference,#B50000,Pure tones
12.036786786786786,-1.2176806576983624e-4,Seth93,Sethares (1993),interference,#B50000,Pure tones
12.037287287287286,-1.2170496473928199e-4,Seth93,Sethares (1993),interference,#B50000,Pure tones
12.037787787787789,-1.2164176843595953e-4,Seth93,Sethares (1993),interference,#B50000,Pure tones
12.038288288288289,-1.2157872912640711e-4,Seth93,Sethares (1993),interference,#B50000,Pure tones
12.03878878878879,-1.2151559463923613e-4,Seth93,Sethares (1993),interference,#B50000,Pure tones
12.03928928928929,-1.2145261699422667e-4,Seth93,Sethares (1993),interference,#B50000,Pure tones
12.03978978978979,-1.2138954426666467e-4,Seth93,Sethares (1993),interference,#B50000,Pure tones
12.04029029029029,-1.2132662822979304e-4,Seth93,Sethares (1993),interference,#B50000,Pure tones
12.04079079079079,-1.212636172053436e-4,Seth93,Sethares (1993),interference,#B50000,Pure tones
12.04129129129129,-1.2120076272025107e-4,Seth93,Sethares (1993),interference,#B50000,Pure tones
12.041791791791791,-1.2113781334246531e-4,Seth93,Sethares (1993),interference,#B50000,Pure tones
12.042292292292291,-1.2107502035283928e-4,Seth93,Sethares (1993),interference,#B50000,Pure tones
12.042792792792794,-1.2101213256531731e-4,Seth93,Sethares (1993),interference,#B50000,Pure tones
12.043293293293294,-1.2094940101489518e-4,Seth93,Sethares (1993),interference,#B50000,Pure tones
12.043793793793794,-1.2088657476128375e-4,Seth93,Sethares (1993),interference,#B50000,Pure tones
12.044294294294295,-1.2082390459384978e-4,Seth93,Sethares (1993),interference,#B50000,Pure tones
12.044794794794795,-1.2076113981784501e-4,Seth93,Sethares (1993),interference,#B50000,Pure tones
12.045295295295295,-1.2069853097722631e-4,Seth93,Sethares (1993),interference,#B50000,Pure tones
12.045795795795796,-1.2063582762256912e-4,Seth93,Sethares (1993),interference,#B50000,Pure tones
12.046296296296296,-1.2057328005264699e-4,Seth93,Sethares (1993),interference,#B50000,Pure tones
12.046796796796796,-1.2051063806312844e-4,Seth93,Sethares (1993),interference,#B50000,Pure tones
12.047297297297296,-1.204481517078277e-4,Seth93,Sethares (1993),interference,#B50000,Pure tones
12.047797797797799,-1.2038557102728513e-4,Seth93,Sethares (1993),interference,#B50000,Pure tones
12.048298298298299,-1.2032314583058001e-4,Seth93,Sethares (1993),interference,#B50000,Pure tones
12.0487987987988,-1.2026062640289802e-4,Seth93,Sethares (1993),interference,#B50000,Pure tones
12.0492992992993,-1.2019826230880883e-4,Seth93,Sethares (1993),interference,#B50000,Pure tones
12.0497997997998,-1.2013580407792101e-4,Seth93,Sethares (1993),interference,#B50000,Pure tones
12.0503003003003,-1.2007350103051714e-4,Seth93,Sethares (1993),interference,#B50000,Pure tones
12.0508008008008,-1.2001110394040063e-4,Seth93,Sethares (1993),interference,#B50000,Pure tones
12.0513013013013,-1.1994886188379706e-4,Seth93,Sethares (1993),interference,#B50000,Pure tones
12.051801801801801,-1.1988652587848218e-4,Seth93,Sethares (1993),interference,#B50000,Pure tones
12.052302302302301,-1.1982434475683927e-4,Seth93,Sethares (1993),interference,#B50000,Pure tones
12.052802802802804,-1.1976206978039964e-4,Seth93,Sethares (1993),interference,#B50000,Pure tones
12.053303303303304,-1.1969994953792818e-4,Seth93,Sethares (1993),interference,#B50000,Pure tones
12.053803803803804,-1.1963773553448643e-4,Seth93,Sethares (1993),interference,#B50000,Pure tones
12.054304304304305,-1.1957567611544376e-4,Seth93,Sethares (1993),interference,#B50000,Pure tones
12.054804804804805,-1.1951352302916835e-4,Seth93,Sethares (1993),interference,#B50000,Pure tones
12.055305305305305,-1.1945152437785898e-4,Seth93,Sethares (1993),interference,#B50000,Pure tones
12.055805805805806,-1.1938943215296622e-4,Seth93,Sethares (1993),interference,#B50000,Pure tones
12.056306306306306,-1.1932749421374164e-4,Seth93,Sethares (1993),interference,#B50000,Pure tones
12.056806806806806,-1.1926546279449591e-4,Seth93,Sethares (1993),interference,#B50000,Pure tones
12.057307307307306,-1.192035855117557e-4,Seth93,Sethares (1993),interference,#B50000,Pure tones
12.057807807807809,-1.1914161484246727e-4,Seth93,Sethares (1993),interference,#B50000,Pure tones
12.058308308308309,-1.1907979816065368e-4,Seth93,Sethares (1993),interference,#B50000,Pure tones
12.05880880880881,-1.190178881856804e-4,Seth93,Sethares (1993),interference,#B50000,Pure tones
12.05930930930931,-1.1895613204928816e-4,Seth93,Sethares (1993),interference,#B50000,Pure tones
12.05980980980981,-1.1889428271303498e-4,Seth93,Sethares (1993),interference,#B50000,Pure tones
12.06031031031031,-1.1883258706660308e-4,Seth93,Sethares (1993),interference,#B50000,Pure tones
12.06081081081081,-1.1877079831352224e-4,Seth93,Sethares (1993),interference,#B50000,Pure tones
12.06131131131131,-1.1870916310163771e-4,Seth93,Sethares (1993),interference,#B50000,Pure tones
12.061811811811811,-1.1864743487622801e-4,Seth93,Sethares (1993),interference,#B50000,Pure tones
12.062312312312311,-1.1858586004352411e-4,Seth93,Sethares (1993),interference,#B50000,Pure tones
12.062812812812814,-1.1852419229033163e-4,Seth93,Sethares (1993),interference,#B50000,Pure tones
12.063313313313314,-1.1846267778148979e-4,Seth93,Sethares (1993),interference,#B50000,Pure tones
12.063813813813814,-1.1840107044510875e-4,Seth93,Sethares (1993),interference,#B50000,Pure tones
12.064314314314315,-1.183396162048518e-4,Seth93,Sethares (1993),interference,#B50000,Pure tones
12.064814814814815,-1.182780692299213e-4,Seth93,Sethares (1993),interference,#B50000,Pure tones
12.065315315315315,-1.1821667520302601e-4,Seth93,Sethares (1993),interference,#B50000,Pure tones
12.065815815815816,-1.1815518853423199e-4,Seth93,Sethares (1993),interference,#B50000,Pure tones
12.066316316316316,-1.1809385466551957e-4,Seth93,Sethares (1993),interference,#B50000,Pure tones
12.066816816816816,-1.1803242824759656e-4,Seth93,Sethares (1993),interference,#B50000,Pure tones
12.067317317317316,-1.179711544819327e-4,Seth93,Sethares (1993),interference,#B50000,Pure tones
12.067817817817819,-1.1790978825966156e-4,Seth93,Sethares (1993),interference,#B50000,Pure tones
12.068318318318319,-1.1784857454196027e-4,Seth93,Sethares (1993),interference,#B50000,Pure tones
12.06881881881882,-1.1778726846016826e-4,Seth93,Sethares (1993),interference,#B50000,Pure tones
12.06931931931932,-1.1772611473539298e-4,Seth93,Sethares (1993),interference,#B50000,Pure tones
12.06981981981982,-1.1766486873895158e-4,Seth93,Sethares (1993),interference,#B50000,Pure tones
12.07032032032032,-1.1760377495210756e-4,Seth93,Sethares (1993),interference,#B50000,Pure tones
12.07082082082082,-1.1754258898594078e-4,Seth93,Sethares (1993),interference,#B50000,Pure tones
12.07132132132132,-1.1748155508208008e-4,Seth93,Sethares (1993),interference,#B50000,Pure tones
12.071821821821821,-1.1742042909115365e-4,Seth93,Sethares (1993),interference,#B50000,Pure tones
12.072322322322321,-1.1735945501537865e-4,Seth93,Sethares (1993),interference,#B50000,Pure tones
12.072822822822824,-1.1729838894470633e-4,Seth93,Sethares (1993),interference,#B50000,Pure tones
12.073323323323324,-1.1723747464216404e-4,Seth93,Sethares (1993),interference,#B50000,Pure tones
12.073823823823824,-1.1717646843680747e-4,Seth93,Sethares (1993),interference,#B50000,Pure tones
12.074324324324325,-1.1711561385269055e-4,Seth93,Sethares (1993),interference,#B50000,Pure tones
12.074824824824825,-1.1705466745775546e-4,Seth93,Sethares (1993),interference,#B50000,Pure tones
12.075325325325325,-1.169938725373043e-4,Seth93,Sethares (1993),interference,#B50000,Pure tones
12.075825825825826,-1.1693298589794458e-4,Seth93,Sethares (1993),interference,#B50000,Pure tones
12.076326326326326,-1.1687225058644698e-4,Seth93,Sethares (1993),interference,#B50000,Pure tones
12.076826826826826,-1.168114236478636e-4,Seth93,Sethares (1993),interference,#B50000,Pure tones
12.077327327327327,-1.167507478906484e-4,Seth93,Sethares (1993),interference,#B50000,Pure tones
12.077827827827829,-1.1668998059808679e-4,Seth93,Sethares (1993),interference,#B50000,Pure tones
12.078328328328329,-1.1662936434053556e-4,Seth93,Sethares (1993),interference,#B50000,Pure tones
12.07882882882883,-1.1656865663928898e-4,Seth93,Sethares (1993),interference,#B50000,Pure tones
12.07932932932933,-1.1650809982682629e-4,Seth93,Sethares (1993),interference,#B50000,Pure tones
12.07982982982983,-1.1644745166223416e-4,Seth93,Sethares (1993),interference,#B50000,Pure tones
12.08033033033033,-1.1638695424033151e-4,Seth93,Sethares (1993),interference,#B50000,Pure tones
12.08083083083083,-1.163263655577796e-4,Seth93,Sethares (1993),interference,#B50000,Pure tones
12.08133133133133,-1.1626592747195511e-4,Seth93,Sethares (1993),interference,#B50000,Pure tones
12.081831831831831,-1.1620539821687472e-4,Seth93,Sethares (1993),interference,#B50000,Pure tones
12.082332332332332,-1.1614501941269374e-4,Seth93,Sethares (1993),interference,#B50000,Pure tones
12.082832832832834,-1.1608454953056303e-4,Seth93,Sethares (1993),interference,#B50000,Pure tones
12.083333333333334,-1.1602422995363255e-4,Seth93,Sethares (1993),interference,#B50000,Pure tones
12.083833833833834,-1.1596381938997654e-4,Seth93,Sethares (1993),interference,#B50000,Pure tones
12.084334334334335,-1.1590355898595361e-4,Seth93,Sethares (1993),interference,#B50000,Pure tones
12.084834834834835,-1.1584320768634273e-4,Seth93,Sethares (1993),interference,#B50000,Pure tones
12.085335335335335,-1.1578300640093066e-4,Seth93,Sethares (1993),interference,#B50000,Pure tones
12.085835835835836,-1.1572271431098149e-4,Seth93,Sethares (1993),interference,#B50000,Pure tones
12.086336336336336,-1.1566257208992847e-4,Seth93,Sethares (1993),interference,#B50000,Pure tones
12.086836836836836,-1.156023391553037e-4,Seth93,Sethares (1993),interference,#B50000,Pure tones
12.087337337337337,-1.1554225594440372e-4,Seth93,Sethares (1993),interference,#B50000,Pure tones
12.087837837837839,-1.1548208211081301e-4,Seth93,Sethares (1993),interference,#B50000,Pure tones
12.088338338338339,-1.1542205785590828e-4,Seth93,Sethares (1993),interference,#B50000,Pure tones
12.08883883883884,-1.1536194306910592e-4,Seth93,Sethares (1993),interference,#B50000,Pure tones
12.08933933933934,-1.153019777160793e-4,Seth93,Sethares (1993),interference,#B50000,Pure tones
12.08983983983984,-1.1524192192186657e-4,Seth93,Sethares (1993),interference,#B50000,Pure tones
12.09034034034034,-1.1518201541665196e-4,Seth93,Sethares (1993),interference,#B50000,Pure tones
12.09084084084084,-1.151220185608762e-4,Seth93,Sethares (1993),interference,#B50000,Pure tones
12.09134134134134,-1.1506217084945134e-4,Seth93,Sethares (1993),interference,#B50000,Pure tones
12.091841841841841,-1.1500223287800516e-4,Seth93,Sethares (1993),interference,#B50000,Pure tones
12.092342342342342,-1.1494244390639386e-4,Seth93,Sethares (1993),interference,#B50000,Pure tones
12.092842842842844,-1.1488256476521711e-4,Seth93,Sethares (1993),interference,#B50000,Pure tones
12.093343343343344,-1.1482283447948956e-4,Seth93,Sethares (1993),interference,#B50000,Pure tones
12.093843843843844,-1.1476301411456587e-4,Seth93,Sethares (1993),interference,#B50000,Pure tones
12.094344344344345,-1.1470334246083702e-4,Seth93,Sethares (1993),interference,#B50000,Pure tones
12.094844844844845,-1.1464358081819715e-4,Seth93,Sethares (1993),interference,#B50000,Pure tones
12.095345345345345,-1.1458396774263039e-4,Seth93,Sethares (1993),interference,#B50000,Pure tones
12.095845845845846,-1.1452426476835145e-4,Seth93,Sethares (1993),interference,#B50000,Pure tones
12.096346346346346,-1.1446471021714912e-4,Seth93,Sethares (1993),interference,#B50000,Pure tones
12.096846846846846,-1.1440506585735306e-4,Seth93,Sethares (1993),interference,#B50000,Pure tones
12.097347347347347,-1.1434556977677092e-4,Seth93,Sethares (1993),interference,#B50000,Pure tones
12.097847847847849,-1.1428598397762497e-4,Seth93,Sethares (1993),interference,#B50000,Pure tones
12.098348348348349,-1.1422654631396076e-4,Seth93,Sethares (1993),interference,#B50000,Pure tones
12.09884884884885,-1.1416701902167892e-4,Seth93,Sethares (1993),interference,#B50000,Pure tones
12.09934934934935,-1.1410763972127596e-4,Seth93,Sethares (1993),interference,#B50000,Pure tones
12.09984984984985,-1.140481708821177e-4,Seth93,Sethares (1993),interference,#B50000,Pure tones
12.10035035035035,-1.1398884989136572e-4,Seth93,Sethares (1993),interference,#B50000,Pure tones
12.10085085085085,-1.139294394516351e-4,Seth93,Sethares (1993),interference,#B50000,Pure tones
12.10135135135135,-1.1387017671697092e-4,Seth93,Sethares (1993),interference,#B50000,Pure tones
12.101851851851851,-1.1381082462301928e-4,Seth93,Sethares (1993),interference,#B50000,Pure tones
12.102352352352352,-1.1375162009091904e-4,Seth93,Sethares (1993),interference,#B50000,Pure tones
12.102852852852854,-1.1369232628914221e-4,Seth93,Sethares (1993),interference,#B50000,Pure tones
12.103353353353354,-1.1363317990613391e-4,Seth93,Sethares (1993),interference,#B50000,Pure tones
12.103853853853854,-1.1357394434297372e-4,Seth93,Sethares (1993),interference,#B50000,Pure tones
12.104354354354355,-1.1351485605562859e-4,Seth93,Sethares (1993),interference,#B50000,Pure tones
12.104854854854855,-1.1345567867757173e-4,Seth93,Sethares (1993),interference,#B50000,Pure tones
12.105355355355355,-1.1339664843250537e-4,Seth93,Sethares (1993),interference,#B50000,Pure tones
12.105855855855856,-1.1333752918608521e-4,Seth93,Sethares (1993),interference,#B50000,Pure tones
12.106356356356356,-1.1327855692996023e-4,Seth93,Sethares (1993),interference,#B50000,Pure tones
12.106856856856856,-1.1321949576175358e-4,Seth93,Sethares (1993),interference,#B50000,Pure tones
12.107357357357357,-1.1316058144127944e-4,Seth93,Sethares (1993),interference,#B50000,Pure tones
12.107857857857859,-1.1310157829791007e-4,Seth93,Sethares (1993),interference,#B50000,Pure tones
12.108358358358359,-1.1304272185983515e-4,Seth93,Sethares (1993),interference,#B50000,Pure tones
12.10885885885886,-1.1298377668797186e-4,Seth93,Sethares (1993),interference,#B50000,Pure tones
12.10935935935936,-1.1292497807909558e-4,Seth93,Sethares (1993),interference,#B50000,Pure tones
12.10985985985986,-1.1286609082545261e-4,Seth93,Sethares (1993),interference,#B50000,Pure tones
12.11036036036036,-1.1280734999261825e-4,Seth93,Sethares (1993),interference,#B50000,Pure tones
12.11086086086086,-1.1274852060395378e-4,Seth93,Sethares (1993),interference,#B50000,Pure tones
12.11136136136136,-1.1268983749404977e-4,Seth93,Sethares (1993),interference,#B50000,Pure tones
12.111861861861861,-1.1263106591716902e-4,Seth93,Sethares (1993),interference,#B50000,Pure tones
12.112362362362362,-1.1257244047712792e-4,Seth93,Sethares (1993),interference,#B50000,Pure tones
12.112862862862864,-1.1251372665888073e-4,Seth93,Sethares (1993),interference,#B50000,Pure tones
12.113363363363364,-1.1245515883568125e-4,Seth93,Sethares (1993),interference,#B50000,Pure tones
12.113863863863864,-1.1239650272296246e-4,Seth93,Sethares (1993),interference,#B50000,Pure tones
12.114364364364365,-1.1233799246362955e-4,Seth93,Sethares (1993),interference,#B50000,Pure tones
12.114864864864865,-1.1227939400337874e-4,Seth93,Sethares (1993),interference,#B50000,Pure tones
12.115365365365365,-1.1222094125497783e-4,Seth93,Sethares (1993),interference,#B50000,Pure tones
12.115865865865866,-1.1216240039418088e-4,Seth93,Sethares (1993),interference,#B50000,Pure tones
12.116366366366366,-1.1210400510382637e-4,Seth93,Sethares (1993),interference,#B50000,Pure tones
12.116866866866866,-1.1204552178951306e-4,Seth93,Sethares (1993),interference,#B50000,Pure tones
12.117367367367367,-1.1198718390436417e-4,Seth93,Sethares (1993),interference,#B50000,Pure tones
12.117867867867869,-1.1192875808360933e-4,Seth93,Sethares (1993),interference,#B50000,Pure tones
12.118368368368369,-1.1187047755086896e-4,Seth93,Sethares (1993),interference,#B50000,Pure tones
12.11886886886887,-1.1181210917079383e-4,Seth93,Sethares (1993),interference,#B50000,Pure tones
12.11936936936937,-1.1175388593771025e-4,Seth93,Sethares (1993),interference,#B50000,Pure tones
12.11986986986987,-1.1169557494547902e-4,Seth93,Sethares (1993),interference,#B50000,Pure tones
12.12037037037037,-1.116374089593471e-4,Seth93,Sethares (1993),interference,#B50000,Pure tones
12.12087087087087,-1.1157915530217033e-4,Seth93,Sethares (1993),interference,#B50000,Pure tones
12.121371371371371,-1.1152104651032465e-4,Seth93,Sethares (1993),interference,#B50000,Pure tones
12.121871871871871,-1.114628501354578e-4,Seth93,Sethares (1993),interference,#B50000,Pure tones
12.122372372372372,-1.114047984852823e-4,Seth93,Sethares (1993),interference,#B50000,Pure tones
12.122872872872874,-1.1134665934002491e-4,Seth93,Sethares (1993),interference,#B50000,Pure tones
12.123373373373374,-1.1128866477894725e-4,Seth93,Sethares (1993),interference,#B50000,Pure tones
12.123873873873874,-1.1123058281064388e-4,Seth93,Sethares (1993),interference,#B50000,Pure tones
12.124374374374375,-1.1117264528613655e-4,Seth93,Sethares (1993),interference,#B50000,Pure tones
12.124874874874875,-1.1111462044217715e-4,Seth93,Sethares (1993),interference,#B50000,Pure tones
12.125375375375375,-1.1105673990175648e-4,Seth93,Sethares (1993),interference,#B50000,Pure tones
12.125875875875876,-1.1099877212957443e-4,Seth93,Sethares (1993),interference,#B50000,Pure tones
12.126376376376376,-1.1094094852080475e-4,Seth93,Sethares (1993),interference,#B50000,Pure tones
12.126876876876876,-1.1088303776787954e-4,Seth93,Sethares (1993),interference,#B50000,Pure tones
12.127377377377377,-1.1082527103836254e-4,Seth93,Sethares (1993),interference,#B50000,Pure tones
12.127877877877879,-1.107674172522179e-4,Seth93,Sethares (1993),interference,#B50000,Pure tones
12.128378378378379,-1.1070970734960601e-4,Seth93,Sethares (1993),interference,#B50000,Pure tones
12.12887887887888,-1.1065191047781061e-4,Seth93,Sethares (1993),interference,#B50000,Pure tones
12.12937937937938,-1.1059425734979957e-4,Seth93,Sethares (1993),interference,#B50000,Pure tones
12.12987987987988,-1.1053651733996548e-4,Seth93,Sethares (1993),interference,#B50000,Pure tones
12.13038038038038,-1.1047892093429461e-4,Seth93,Sethares (1993),interference,#B50000,Pure tones
12.13088088088088,-1.1042123773408027e-4,Seth93,Sethares (1993),interference,#B50000,Pure tones
12.131381381381381,-1.1036369799853436e-4,Seth93,Sethares (1993),interference,#B50000,Pure tones
12.131881881881881,-1.1030607155564124e-4,Seth93,Sethares (1993),interference,#B50000,Pure tones
12.132382382382382,-1.1024858843804833e-4,Seth93,Sethares (1993),interference,#B50000,Pure tones
12.132882882882884,-1.1019101870022356e-4,Seth93,Sethares (1993),interference,#B50000,Pure tones
12.133383383383384,-1.1013359214845829e-4,Seth93,Sethares (1993),interference,#B50000,Pure tones
12.133883883883884,-1.1007607906349293e-4,Seth93,Sethares (1993),interference,#B50000,Pure tones
12.134384384384385,-1.1001870902547003e-4,Seth93,Sethares (1993),interference,#B50000,Pure tones
12.134884884884885,-1.0996125254119899e-4,Seth93,Sethares (1993),interference,#B50000,Pure tones
12.135385385385385,-1.0990393896488221e-4,Seth93,Sethares (1993),interference,#B50000,Pure tones
12.135885885885886,-1.0984653902918583e-4,Seth93,Sethares (1993),interference,#B50000,Pure tones
12.136386386386386,-1.0978928186258074e-4,Seth93,Sethares (1993),interference,#B50000,Pure tones
12.136886886886886,-1.0973193842338313e-4,Seth93,Sethares (1993),interference,#B50000,Pure tones
12.137387387387387,-1.0967473761454012e-4,Seth93,Sethares (1993),interference,#B50000,Pure tones
12.137887887887889,-1.0961745061981057e-4,Seth93,Sethares (1993),interference,#B50000,Pure tones
12.138388388388389,-1.0956030611682468e-4,Seth93,Sethares (1993),interference,#B50000,Pure tones
12.13888888888889,-1.0950307551457539e-4,Seth93,Sethares (1993),interference,#B50000,Pure tones
12.13938938938939,-1.0944598726558647e-4,Seth93,Sethares (1993),interference,#B50000,Pure tones
12.13988988988989,-1.0938881300387514e-4,Seth93,Sethares (1993),interference,#B50000,Pure tones
12.14039039039039,-1.0933178095706334e-4,Seth93,Sethares (1993),interference,#B50000,Pure tones
12.14089089089089,-1.0927466298399148e-4,Seth93,Sethares (1993),interference,#B50000,Pure tones
12.141391391391391,-1.0921768708758577e-4,Seth93,Sethares (1993),interference,#B50000,Pure tones
12.141891891891891,-1.0916062535129914e-4,Seth93,Sethares (1993),interference,#B50000,Pure tones
12.142392392392392,-1.0910370555357007e-4,Seth93,Sethares (1993),interference,#B50000,Pure tones
12.142892892892894,-1.0904670000225822e-4,Seth93,Sethares (1993),interference,#B50000,Pure tones
12.143393393393394,-1.0898983625152175e-4,Seth93,Sethares (1993),interference,#B50000,Pure tones
12.143893893893894,-1.0893288683341861e-4,Seth93,Sethares (1993),interference,#B50000,Pure tones
12.144394394394395,-1.0887607907803437e-4,Seth93,Sethares (1993),interference,#B50000,Pure tones
12.144894894894895,-1.0881918574141813e-4,Seth93,Sethares (1993),interference,#B50000,Pure tones
12.145395395395395,-1.0876243392979014e-4,Seth93,Sethares (1993),interference,#B50000,Pure tones
12.145895895895896,-1.0870559662298388e-4,Seth93,Sethares (1993),interference,#B50000,Pure tones
12.146396396396396,-1.0864890070355709e-4,Seth93,Sethares (1993),interference,#B50000,Pure tones
12.146896896896896,-1.0859211937492576e-4,Seth93,Sethares (1993),interference,#B50000,Pure tones
12.147397397397397,-1.085354792961923e-4,Seth93,Sethares (1993),interference,#B50000,Pure tones
12.147897897897899,-1.0847875389414686e-4,Seth93,Sethares (1993),interference,#B50000,Pure tones
12.148398398398399,-1.084221696046424e-4,Seth93,Sethares (1993),interference,#B50000,Pure tones
12.1488988988989,-1.0836550007763697e-4,Seth93,Sethares (1993),interference,#B50000,Pure tones
12.1493993993994,-1.083089715259401e-4,Seth93,Sethares (1993),interference,#B50000,Pure tones
12.1498998998999,-1.0825235782247259e-4,Seth93,Sethares (1993),interference,#B50000,Pure tones
12.1504004004004,-1.0819588495720683e-4,Seth93,Sethares (1993),interference,#B50000,Pure tones
12.1509009009009,-1.0813932702581905e-4,Seth93,Sethares (1993),interference,#B50000,Pure tones
12.151401401401401,-1.0808290979565068e-4,Seth93,Sethares (1993),interference,#B50000,Pure tones
12.151901901901901,-1.0802640758492923e-4,Seth93,Sethares (1993),interference,#B50000,Pure tones
12.152402402402402,-1.0797004593856998e-4,Seth93,Sethares (1993),interference,#B50000,Pure tones
12.152902902902904,-1.079135993971442e-4,Seth93,Sethares (1993),interference,#B50000,Pure tones
12.153403403403404,-1.0785729328334511e-4,Seth93,Sethares (1993),interference,#B50000,Pure tones
12.153903903903904,-1.0780090235988819e-4,Seth93,Sethares (1993),interference,#B50000,Pure tones
12.154404404404405,-1.0774465172744937e-4,Seth93,Sethares (1993),interference,#B50000,Pure tones
12.154904904904905,-1.0768831637067916e-4,Seth93,Sethares (1993),interference,#B50000,Pure tones
12.155405405405405,-1.0763212116844096e-4,Seth93,Sethares (1993),interference,#B50000,Pure tones
12.155905905905906,-1.075758413271183e-4,Seth93,Sethares (1993),interference,#B50000,Pure tones
12.156406406406406,-1.0751970150396685e-4,Seth93,Sethares (1993),interference,#B50000,Pure tones
12.156906906906906,-1.074634771268965e-4,Seth93,Sethares (1993),interference,#B50000,Pure tones
12.157407407407407,-1.0740739263175977e-4,Seth93,Sethares (1993),interference,#B50000,Pure tones
12.157907907907909,-1.0735122366778996e-4,Seth93,Sethares (1993),interference,#B50000,Pure tones
12.158408408408409,-1.0729519444964213e-4,Seth93,Sethares (1993),interference,#B50000,Pure tones
12.15890890890891,-1.0723908084766494e-4,Seth93,Sethares (1993),interference,#B50000,Pure tones
12.15940940940941,-1.0718310685551849e-4,Seth93,Sethares (1993),interference,#B50000,Pure tones
12.15990990990991,-1.0712704856446974e-4,Seth93,Sethares (1993),interference,#B50000,Pure tones
12.16041041041041,-1.0707112974738533e-4,Seth93,Sethares (1993),interference,#B50000,Pure tones
12.16091091091091,-1.070151267162443e-4,Seth93,Sethares (1993),interference,#B50000,Pure tones
12.161411411411411,-1.0695926302332548e-4,Seth93,Sethares (1993),interference,#B50000,Pure tones
12.161911911911911,-1.0690331520111421e-4,Seth93,Sethares (1993),interference,#B50000,Pure tones
12.162412412412412,-1.068475065815065e-4,Seth93,Sethares (1993),interference,#B50000,Pure tones
12.162912912912914,-1.0679161391729183e-4,Seth93,Sethares (1993),interference,#B50000,Pure tones
12.163413413413414,-1.0673586032018449e-4,Seth93,Sethares (1993),interference,#B50000,Pure tones
12.163913913913914,-1.066800227630762e-4,Seth93,Sethares (1993),interference,#B50000,Pure tones
12.164414414414415,-1.0662432413770396e-4,Seth93,Sethares (1993),interference,#B50000,Pure tones
12.164914914914915,-1.0656854163685445e-4,Seth93,Sethares (1993),interference,#B50000,Pure tones
12.165415415415415,-1.0651289793249104e-4,Seth93,Sethares (1993),interference,#B50000,Pure tones
12.165915915915916,-1.0645717043709658e-4,Seth93,Sethares (1993),interference,#B50000,Pure tones
12.166416416416416,-1.0640158160306276e-4,Seth93,Sethares (1993),interference,#B50000,Pure tones
12.166916916916916,-1.0634590906236405e-4,Seth93,Sethares (1993),interference,#B50000,Pure tones
12.167417417417417,-1.0629037504802241e-4,Seth93,Sethares (1993),interference,#B50000,Pure tones
12.167917917917919,-1.0623475741130239e-4,Seth93,Sethares (1993),interference,#B50000,Pure tones
12.168418418418419,-1.0617927816605868e-4,Seth93,Sethares (1993),interference,#B50000,Pure tones
12.16891891891892,-1.0612371538264395e-4,Seth93,Sethares (1993),interference,#B50000,Pure tones
12.16941941941942,-1.0606829085594737e-4,Seth93,Sethares (1993),interference,#B50000,Pure tones
12.16991991991992,-1.0601278287520726e-4,Seth93,Sethares (1993),interference,#B50000,Pure tones
12.17042042042042,-1.059574130165522e-4,Seth93,Sethares (1993),interference,#B50000,Pure tones
12.17092092092092,-1.0590195978789852e-4,Seth93,Sethares (1993),interference,#B50000,Pure tones
12.171421421421421,-1.0584664454681855e-4,Seth93,Sethares (1993),interference,#B50000,Pure tones
12.171921921921921,-1.0579124601971024e-4,Seth93,Sethares (1993),interference,#B50000,Pure tones
12.172422422422422,-1.0573598534578246e-4,Seth93,Sethares (1993),interference,#B50000,Pure tones
12.172922922922924,-1.0568064146971695e-4,Seth93,Sethares (1993),interference,#B50000,Pure tones
12.173423423423424,-1.0562543531256524e-4,Seth93,Sethares (1993),interference,#B50000,Pure tones
12.173923923923924,-1.0557014603708459e-4,Seth93,Sethares (1993),interference,#B50000,Pure tones
12.174424424424425,-1.0551499434637249e-4,Seth93,Sethares (1993),interference,#B50000,Pure tones
12.174924924924925,-1.0545975962106392e-4,Seth93,Sethares (1993),interference,#B50000,Pure tones
12.175425425425425,-1.0540466234649931e-4,Seth93,Sethares (1993),interference,#B50000,Pure tones
12.175925925925926,-1.0534948212099013e-4,Seth93,Sethares (1993),interference,#B50000,Pure tones
12.176426426426426,-1.0529443921232379e-4,Seth93,Sethares (1993),interference,#B50000,Pure tones
12.176926926926926,-1.0523931343628604e-4,Seth93,Sethares (1993),interference,#B50000,Pure tones
12.177427427427427,-1.0518432484331325e-4,Seth93,Sethares (1993),interference,#B50000,Pure tones
12.177927927927929,-1.0512925346646078e-4,Seth93,Sethares (1993),interference,#B50000,Pure tones
12.178428428428429,-1.0507431913901426e-4,Seth93,Sethares (1993),interference,#B50000,Pure tones
12.17892892892893,-1.0501930211110529e-4,Seth93,Sethares (1993),interference,#B50000,Pure tones
12.17942942942943,-1.0496442199906644e-4,Seth93,Sethares (1993),interference,#B50000,Pure tones
12.17992992992993,-1.049094592699013e-4,Seth93,Sethares (1993),interference,#B50000,Pure tones
12.18043043043043,-1.0485463332319209e-4,Seth93,Sethares (1993),interference,#B50000,Pure tones
12.18093093093093,-1.0479972484261407e-4,Seth93,Sethares (1993),interference,#B50000,Pure tones
12.181431431431431,-1.0474495301119874e-4,Seth93,Sethares (1993),interference,#B50000,Pure tones
12.181931931931931,-1.0469009872909433e-4,Seth93,Sethares (1993),interference,#B50000,Pure tones
12.182432432432432,-1.0463538096298153e-4,Seth93,Sethares (1993),interference,#B50000,Pure tones
12.182932932932934,-1.0458058082927917e-4,Seth93,Sethares (1993),interference,#B50000,Pure tones
12.183433433433434,-1.0452591707851954e-4,Seth93,Sethares (1993),interference,#B50000,Pure tones
12.183933933933934,-1.044711710431919e-4,Seth93,Sethares (1993),interference,#B50000,Pure tones
12.184434434434435,-1.0441656125787638e-4,Seth93,Sethares (1993),interference,#B50000,Pure tones
12.184934934934935,-1.0436186927093693e-4,Seth93,Sethares (1993),interference,#B50000,Pure tones
12.185435435435435,-1.043073134012023e-4,Seth93,Sethares (1993),interference,#B50000,Pure tones
12.185935935935936,-1.0425267541270957e-4,Seth93,Sethares (1993),interference,#B50000,Pure tones
12.186436436436436,-1.0419817340873412e-4,Seth93,Sethares (1993),interference,#B50000,Pure tones
12.186936936936936,-1.0414358936878717e-4,Seth93,Sethares (1993),interference,#B50000,Pure tones
12.187437437437438,-1.040891411807925e-4,Seth93,Sethares (1993),interference,#B50000,Pure tones
12.187937937937939,-1.0403461103953456e-4,Seth93,Sethares (1993),interference,#B50000,Pure tones
12.188438438438439,-1.0398021661778266e-4,Seth93,Sethares (1993),interference,#B50000,Pure tones
12.18893893893894,-1.039257403253992e-4,Seth93,Sethares (1993),interference,#B50000,Pure tones
12.18943943943944,-1.0387139962019878e-4,Seth93,Sethares (1993),interference,#B50000,Pure tones
12.18993993993994,-1.0381697712691548e-4,Seth93,Sethares (1993),interference,#B50000,Pure tones
12.19044044044044,-1.0376269008861323e-4,Seth93,Sethares (1993),interference,#B50000,Pure tones
12.19094094094094,-1.0370832134470383e-4,Seth93,Sethares (1993),interference,#B50000,Pure tones
12.191441441441441,-1.036540879236894e-4,Seth93,Sethares (1993),interference,#B50000,Pure tones
12.191941941941941,-1.0359977287946528e-4,Seth93,Sethares (1993),interference,#B50000,Pure tones
12.192442442442442,-1.0354559302617336e-4,Seth93,Sethares (1993),interference,#B50000,Pure tones
12.192942942942944,-1.034913316319902e-4,Seth93,Sethares (1993),interference,#B50000,Pure tones
12.193443443443444,-1.0343720529689601e-4,Seth93,Sethares (1993),interference,#B50000,Pure tones
12.193943943943944,-1.0338299750315138e-4,Seth93,Sethares (1993),interference,#B50000,Pure tones
12.194444444444445,-1.0332892463677384e-4,Seth93,Sethares (1993),interference,#B50000,Pure tones
12.194944944944945,-1.0327477039390857e-4,Seth93,Sethares (1993),interference,#B50000,Pure tones
12.195445445445445,-1.0322075094680706e-4,Seth93,Sethares (1993),interference,#B50000,Pure tones
12.195945945945946,-1.0316665020530428e-4,Seth93,Sethares (1993),interference,#B50000,Pure tones
12.196446446446446,-1.0311268412808384e-4,Seth93,Sethares (1993),interference,#B50000,Pure tones
12.196946946946946,-1.0305863683846784e-4,Seth93,Sethares (1993),interference,#B50000,Pure tones
12.197447447447448,-1.030047240817704e-4,Seth93,Sethares (1993),interference,#B50000,Pure tones
12.197947947947949,-1.029507301946087e-4,Seth93,Sethares (1993),interference,#B50000,Pure tones
12.198448448448449,-1.0289687070912287e-4,Seth93,Sethares (1993),interference,#B50000,Pure tones
12.19894894894895,-1.0284293017502532e-4,Seth93,Sethares (1993),interference,#B50000,Pure tones
12.19944944944945,-1.027891239114806e-4,Seth93,Sethares (1993),interference,#B50000,Pure tones
12.19994994994995,-1.0273523668109912e-4,Seth93,Sethares (1993),interference,#B50000,Pure tones
12.20045045045045,-1.0268148359026702e-4,Seth93,Sethares (1993),interference,#B50000,Pure tones
12.20095095095095,-1.0262764961429594e-4,Seth93,Sethares (1993),interference,#B50000,Pure tones
12.201451451451451,-1.0257394964698995e-4,Seth93,Sethares (1993),interference,#B50000,Pure tones
12.201951951951951,-1.025201688761658e-4,Seth93,Sethares (1993),interference,#B50000,Pure tones
12.202452452452452,-1.0246652198324386e-4,Seth93,Sethares (1993),interference,#B50000,Pure tones
12.202952952952954,-1.024127943683447e-4,Seth93,Sethares (1993),interference,#B50000,Pure tones
12.203453453453454,-1.0235920050070114e-4,Seth93,Sethares (1993),interference,#B50000,Pure tones
12.203953953953954,-1.0230552599254853e-4,Seth93,Sethares (1993),interference,#B50000,Pure tones
12.204454454454455,-1.0225198510112453e-4,Seth93,Sethares (1993),interference,#B50000,Pure tones
12.204954954954955,-1.0219836365058053e-4,Seth93,Sethares (1993),interference,#B50000,Pure tones
12.205455455455455,-1.0214487568635832e-4,Seth93,Sethares (1993),interference,#B50000,Pure tones
12.205955955955956,-1.0209130724432854e-4,Seth93,Sethares (1993),interference,#B50000,Pure tones
12.206456456456456,-1.0203787215833181e-4,Seth93,Sethares (1993),interference,#B50000,Pure tones
12.206956956956956,-1.01984356675763e-4,Seth93,Sethares (1993),interference,#B50000,Pure tones
12.207457457457458,-1.0193097441905754e-4,Seth93,Sethares (1993),interference,#B50000,Pure tones
12.207957957957959,-1.0187751184693807e-4,Seth93,Sethares (1993),interference,#B50000,Pure tones
12.208458458458459,-1.0182418237063321e-4,Seth93,Sethares (1993),interference,#B50000,Pure tones
12.20895895895896,-1.017707726599947e-4,Seth93,Sethares (1993),interference,#B50000,Pure tones
12.20945945945946,-1.0171749591523696e-4,Seth93,Sethares (1993),interference,#B50000,Pure tones
12.20995995995996,-1.0166413901715102e-4,Seth93,Sethares (1993),interference,#B50000,Pure tones
12.21046046046046,-1.0161091495513364e-4,Seth93,Sethares (1993),interference,#B50000,Pure tones
12.21096096096096,-1.015576108207161e-4,Seth93,Sethares (1993),interference,#B50000,Pure tones
12.211461461461461,-1.0150443939267179e-4,Seth93,Sethares (1993),interference,#B50000,Pure tones
12.211961961961961,-1.014511879730793e-4,Seth93,Sethares (1993),interference,#B50000,Pure tones
12.212462462462462,-1.013980691302829e-4,Seth93,Sethares (1993),interference,#B50000,Pure tones
12.212962962962964,-1.0134487037671341e-4,Seth93,Sethares (1993),interference,#B50000,Pure tones
12.213463463463464,-1.0129180407048206e-4,Seth93,Sethares (1993),interference,#B50000,Pure tones
12.213963963963964,-1.0123865793417571e-4,Seth93,Sethares (1993),interference,#B50000,Pure tones
12.214464464464465,-1.0118564411586771e-4,Seth93,Sethares (1993),interference,#B50000,Pure tones
12.214964964964965,-1.0113255054810657e-4,Seth93,Sethares (1993),interference,#B50000,Pure tones
12.215465465465465,-1.010795891691241e-4,Seth93,Sethares (1993),interference,#B50000,Pure tones
12.215965965965966,-1.0102654812123203e-4,Seth93,Sethares (1993),interference,#B50000,Pure tones
12.216466466466466,-1.0097363913301238e-4,Seth93,Sethares (1993),interference,#B50000,Pure tones
12.216966966966966,-1.0092065055635529e-4,Seth93,Sethares (1993),interference,#B50000,Pure tones
12.217467467467468,-1.0086779391038408e-4,Seth93,Sethares (1993),interference,#B50000,Pure tones
12.217967967967969,-1.0081485775636867e-4,Seth93,Sethares (1993),interference,#B50000,Pure tones
12.218468468468469,-1.0076205340417093e-4,Seth93,Sethares (1993),interference,#B50000,Pure tones
12.21896896896897,-1.0070916962424591e-4,Seth93,Sethares (1993),interference,#B50000,Pure tones
12.21946946946947,-1.0065641751738788e-4,Seth93,Sethares (1993),interference,#B50000,Pure tones
12.21996996996997,-1.0060358606304377e-4,Seth93,Sethares (1993),interference,#B50000,Pure tones
12.22047047047047,-1.0055088615313316e-4,Seth93,Sethares (1993),interference,#B50000,Pure tones
12.22097097097097,-1.0049810697590171e-4,Seth93,Sethares (1993),interference,#B50000,Pure tones
12.221471471471471,-1.004454592145901e-4,Seth93,Sethares (1993),interference,#B50000,Pure tones
12.221971971971971,-1.0039273226604496e-4,Seth93,Sethares (1993),interference,#B50000,Pure tones
12.222472472472472,-1.0034013660502e-4,Seth93,Sethares (1993),interference,#B50000,Pure tones
12.222972972972974,-1.0028746183677635e-4,Seth93,Sethares (1993),interference,#B50000,Pure tones
12.223473473473474,-1.0023491822777159e-4,Seth93,Sethares (1993),interference,#B50000,Pure tones
12.223973973973974,-1.0018229559148575e-4,Seth93,Sethares (1993),interference,#B50000,Pure tones
12.224474474474475,-1.0012980398627537e-4,Seth93,Sethares (1993),interference,#B50000,Pure tones
12.224974974974975,-1.0007723343364496e-4,Seth93,Sethares (1993),interference,#B50000,Pure tones
12.225475475475475,-1.0002479378404349e-4,Seth93,Sethares (1993),interference,#B50000,Pure tones
12.225975975975976,-9.997227526680822e-5,Seth93,Sethares (1993),interference,#B50000,Pure tones
12.226476476476476,-9.99198875246724e-5,Seth93,Sethares (1993),interference,#B50000,Pure tones
12.226976976976976,-9.98674209946134e-5,Seth93,Sethares (1993),interference,#B50000,Pure tones
12.227477477477478,-9.98150851118414e-5,Seth93,Sethares (1993),interference,#B50000,Pure tones
12.227977977977979,-9.976267052078025e-5,Seth93,Sethares (1993),interference,#B50000,Pure tones
12.228478478478479,-9.971038644930926e-5,Seth93,Sethares (1993),interference,#B50000,Pure tones
12.22897897897898,-9.965802374910982e-5,Seth93,Sethares (1993),interference,#B50000,Pure tones
12.22947947947948,-9.96057914409205e-5,Seth93,Sethares (1993),interference,#B50000,Pure tones
12.22997997997998,-9.955348058348677e-5,Seth93,Sethares (1993),interference,#B50000,Pure tones
12.23048048048048,-9.950129999060103e-5,Seth93,Sethares (1993),interference,#B50000,Pure tones
12.23098098098098,-9.944904092787978e-5,Seth93,Sethares (1993),interference,#B50000,Pure tones
12.231481481481481,-9.93969120023596e-5,Seth93,Sethares (1993),interference,#B50000,Pure tones
12.231981981981981,-9.934470468633739e-5,Seth93,Sethares (1993),interference,#B50000,Pure tones
12.232482482482482,-9.929262738028642e-5,Seth93,Sethares (1993),interference,#B50000,Pure tones
12.232982982982984,-9.924047176299201e-5,Seth93,Sethares (1993),interference,#B50000,Pure tones
12.233483483483484,-9.918844602855486e-5,Seth93,Sethares (1993),interference,#B50000,Pure tones
12.233983983983984,-9.913634206205756e-5,Seth93,Sethares (1993),interference,#B50000,Pure tones
12.234484484484485,-9.908436785142197e-5,Seth93,Sethares (1993),interference,#B50000,Pure tones
12.234984984984985,-9.903231548783254e-5,Seth93,Sethares (1993),interference,#B50000,Pure tones
12.235485485485485,-9.898039275322169e-5,Seth93,Sethares (1993),interference,#B50000,Pure tones
12.235985985985986,-9.892839194469145e-5,Seth93,Sethares (1993),interference,#B50000,Pure tones
12.236486486486486,-9.887652063837517e-5,Seth93,Sethares (1993),interference,#B50000,Pure tones
12.236986986986986,-9.882457133709741e-5,Seth93,Sethares (1993),interference,#B50000,Pure tones
12.237487487487488,-9.877275141138435e-5,Seth93,Sethares (1993),interference,#B50000,Pure tones
12.237987987987989,-9.872085356959253e-5,Seth93,Sethares (1993),interference,#B50000,Pure tones
12.238488488488489,-9.866908497683178e-5,Seth93,Sethares (1993),interference,#B50000,Pure tones
12.23898898898899,-9.861723854680124e-5,Seth93,Sethares (1993),interference,#B50000,Pure tones
12.23948948948949,-9.856552123938369e-5,Seth93,Sethares (1993),interference,#B50000,Pure tones
12.23998998998999,-9.851372617343003e-5,Seth93,Sethares (1993),interference,#B50000,Pure tones
12.24049049049049,-9.846206010378863e-5,Seth93,Sethares (1993),interference,#B50000,Pure tones
12.24099099099099,-9.841031635426844e-5,Seth93,Sethares (1993),interference,#B50000,Pure tones
12.241491491491491,-9.835870147487212e-5,Seth93,Sethares (1993),interference,#B50000,Pure tones
12.241991991991991,-9.830700899418335e-5,Seth93,Sethares (1993),interference,#B50000,Pure tones
12.242492492492492,-9.825544525754676e-5,Seth93,Sethares (1993),interference,#B50000,Pure tones
12.242992992992994,-9.82038039981276e-5,Seth93,Sethares (1993),interference,#B50000,Pure tones
12.243493493493494,-9.815229135680511e-5,Seth93,Sethares (1993),interference,#B50000,Pure tones
12.243993993993994,-9.810070127113457e-5,Seth93,Sethares (1993),interference,#B50000,Pure tones
12.244494494494495,-9.804923967772044e-5,Seth93,Sethares (1993),interference,#B50000,Pure tones
12.244994994994995,-9.799770071831977e-5,Seth93,Sethares (1993),interference,#B50000,Pure tones
12.245495495495495,-9.79462901254486e-5,Seth93,Sethares (1993),interference,#B50000,Pure tones
12.245995995995996,-9.789480224487807e-5,Seth93,Sethares (1993),interference,#B50000,Pure tones
12.246496496496496,-9.784344260522811e-5,Seth93,Sethares (1993),interference,#B50000,Pure tones
12.246996996996996,-9.779200575608944e-5,Seth93,Sethares (1993),interference,#B50000,Pure tones
12.247497497497498,-9.774069702237407e-5,Seth93,Sethares (1993),interference,#B50000,Pure tones
12.247997997997999,-9.768931115730918e-5,Seth93,Sethares (1993),interference,#B50000,Pure tones
12.248498498498499,-9.763805328228726e-5,Seth93,Sethares (1993),interference,#B50000,Pure tones
12.248998998999,-9.758671835398033e-5,Seth93,Sethares (1993),interference,#B50000,Pure tones
12.2494994994995,-9.75355112904492e-5,Seth93,Sethares (1993),interference,#B50000,Pure tones
12.25,-9.748422725162297e-5,Seth93,Sethares (1993),interference,#B50000,Pure tones
