interval,rating,rating_boot_mean,rating_boot_se
3.65,-0.20028396499237566,-0.20104769234998207,0.030722381311018888
3.6505005005005002,-0.19982306078179246,-0.20059602373269164,0.03061410959936189
3.651001001001001,-0.1993587796032659,-0.2001410054512255,0.03050581546945599
3.6515015015015013,-0.19889110285935108,-0.19968261847906804,0.030397504442498034
3.652002002002002,-0.198420012177685,-0.19922084399799805,0.030289182109917007
3.6525025025025024,-0.19794548942062137,-0.19875566340730955,0.03018085413241435
3.6530030030030027,-0.197467516694979,-0.1982870583331398,0.030072526238936068
3.6535035035035035,-0.19698607636191376,-0.1978150106379253,0.02996420422558218
3.654004004004004,-0.19650115104694466,-0.19733950242997297,0.029855893954450707
3.6545045045045046,-0.19601272365004524,-0.1968605160731358,0.029747601352409007
3.655005005005005,-0.19552077735589388,-0.19637803419660396,0.029639332409803598
3.6555055055055052,-0.19502529564422025,-0.1958920397048096,0.029531093179096714
3.656006006006006,-0.19452626230025208,-0.19540251578741685,0.02942288977343259
3.6565065065065063,-0.1940236614252885,-0.19490944592943765,0.02931472836513882
3.657007007007007,-0.19351747744735315,-0.19441281392141968,0.029206615184150183
3.6575075075075074,-0.19300769513196409,-0.19391260386975068,0.02909855651636502
3.6580080080080077,-0.19249429959298103,-0.19340880020702658,0.028990558701927807
3.6585085085085085,-0.19197727630354788,-0.19290138770253035,0.028882628133440957
3.659009009009009,-0.1914566111071238,-0.19239035147277236,0.02877477125410277
3.6595095095095096,-0.19093229022858726,-0.19187567699211613,0.02866699455577263
3.66001001001001,-0.19040430028541136,-0.19135735010346963,0.028559304576963547
3.6605105105105102,-0.1898726282989167,-0.19083535702904925,0.028451707900761725
3.661011011011011,-0.1893372617055808,-0.19030968438119633,0.028344211152672116
3.6615115115115113,-0.18879818836839665,-0.18978031917325167,0.02823682099839301
3.662012012012012,-0.18825539658830198,-0.1892472488304823,0.028129544141514824
3.6625125125125124,-0.18770887511562803,-0.18871046120104493,0.028022387321150487
3.6630130130130127,-0.1871586131616006,-0.18816994456699065,0.027915357309490317
3.6635135135135135,-0.18660460040986662,-0.1876256876552952,0.027808460909288128
3.664014014014014,-0.1860468270280376,-0.18707767964891905,0.02770170495127513
3.6645145145145146,-0.1854852836792603,-0.1865259101978743,0.027595096291505073
3.665015015015015,-0.18491996153377896,-0.18597036943030743,0.027488641808629873
3.6655155155155152,-0.18435085228050224,-0.1854110479635771,0.027382348401106545
3.666016016016016,-0.18377794813856344,-0.1848479369153293,0.02727622298433927
3.6665165165165163,-0.18320124186885614,-0.18428102791455644,0.02717027248775471
3.667017017017017,-0.18262072678554125,-0.1837103131126272,0.027064503851812943
3.6675175175175174,-0.1820363967675235,-0.1831357851942963,0.02695892402495771
3.6680180180180177,-0.18144824626986578,-0.18255743738865318,0.026853539960503707
3.6685185185185185,-0.18085627033516602,-0.18197526348004114,0.02674835861346621
3.669019019019019,-0.18026046460484543,-0.18138925781890003,0.026643386937333546
3.6695195195195196,-0.17966082533037472,-0.18079941533254942,0.026538631880784903
3.67002002002002,-0.17905734938439824,-0.18020573153588454,0.02643410038435488
3.6705205205205202,-0.17845003427177297,-0.17960820254198645,0.026329799377048903
3.671021021021021,-0.17783887814047428,-0.17900682507262602,0.02622573577290953
3.6715215215215213,-0.17722387979239568,-0.17840159646866402,0.02612191646753939
3.672022022022022,-0.1766050386940099,-0.17779251470031907,0.02601834833458066
3.6725225225225224,-0.17598235498687467,-0.1771795783773107,0.025915038222156794
3.6730230230230227,-0.17535582949798048,-0.17656278675884748,0.02581199294927713
3.6735235235235235,-0.1747254637499255,-0.1759421397634635,0.025709219302208812
3.674024024024024,-0.17409125997092026,-0.1753176379786869,0.025606724030820493
3.6745245245245246,-0.173453221104552,-0.17468928267051642,0.025504513844898456
3.675025025025025,-0.172811350819389,-0.17405707579272192,0.025402595410443266
3.6755255255255253,-0.17216565351830454,-0.17342101999591356,0.02530097534594471
3.676026026026026,-0.17151613434760013,-0.17278111863641207,0.025199660218645246
3.6765265265265263,-0.1708627992058646,-0.17213737578488233,0.025098656540792734
3.677027027027027,-0.17020565475254032,-0.1714897962347053,0.024997970765885478
3.6775275275275274,-0.16954470841623792,-0.17083838551011513,0.02489760928491768
3.6780280280280278,-0.16887996840273395,-0.17018314987404154,0.0247975784226265
3.6785285285285285,-0.16821144370265678,-0.16952409633567825,0.024697884433745824
3.679029029029029,-0.16753914409884904,-0.16886123265774852,0.024598533499273975
3.6795295295295296,-0.16686308017337798,-0.16819456736344762,0.024499531722755586
3.68003003003003,-0.16618326331420558,-0.1675241097430775,0.024400885126587734
3.6805305305305303,-0.16549970572145495,-0.16684986986031008,0.02430259964834948
3.681031031031031,-0.1648124204133149,-0.1661718585581214,0.0242046811371662
3.6815315315315313,-0.16412142123152706,-0.1654900874643387,0.024107135350107663
3.682032032032032,-0.16342672284645324,-0.16480456899680487,0.0240099679486301
3.6825325325325324,-0.1627283407617069,-0.16411531636814966,0.02391318449506345
3.6830330330330328,-0.16202629131834084,-0.16342234359013877,0.023816790449152067
3.6835335335335335,-0.1613205916985538,-0.16272566547760023,0.023720791164652578
3.684034034034034,-0.16061125992894204,-0.16202529765191376,0.023625191885995447
3.6845345345345346,-0.15989831488321166,-0.16132125654403062,0.023529997745012125
3.685035035035035,-0.15918177628442848,-0.16061355939703578,0.023435213757740245
3.6855355355355357,-0.15846166470669915,-0.1599022242682231,0.023340844821303563
3.686036036036036,-0.15773800157634407,-0.15918727003067132,0.02324689571087982
3.6865365365365363,-0.15701080917248833,-0.1584687163743089,0.023153371076755847
3.687037037037037,-0.15628011062709768,-0.15774658380645823,0.02306027544147959
3.6875375375375374,-0.15554592992442867,-0.15702089365184124,0.022967613197112432
3.688038038038038,-0.15480829189987402,-0.15629166805203365,0.022875388602586786
3.6885385385385385,-0.15406722223820973,-0.15555892996436022,0.022783605781175616
3.689039039039039,-0.15332274747120198,-0.15482270316021182,0.02269226871807771
3.6895395395395396,-0.15257489497459087,-0.15408301222277765,0.022601381258124813
3.69004004004004,-0.15182369296442527,-0.15333988254418737,0.022510947103616064
3.6905405405405407,-0.151069170492726,-0.1525933403220304,0.022420969812282483
3.691041041041041,-0.1503113574424875,-0.15184341255526718,0.02233145279538924
3.6915415415415413,-0.14955028452199942,-0.15109012703951274,0.02224239931597883
3.692042042042042,-0.14878598325847206,-0.15033351236167364,0.022153812487260588
3.6925425425425424,-0.14801848599095663,-0.14957359789394595,0.02206569527115085
3.693043043043043,-0.147247825862565,-0.14881041378714913,0.02197805047696689
3.6935435435435435,-0.14647403681197196,-0.14804399096341095,0.021890880760283737
3.694044044044044,-0.1456971535641813,-0.14727436110816663,0.021804188621950722
3.6945445445445446,-0.1449172116205748,-0.1465015566614898,0.021717976407279183
3.695045045045045,-0.1441342472482133,-0.14572561080874588,0.021632246305400046
3.6955455455455457,-0.14334829746840752,-0.14494655747054616,0.021547000348797876
3.696046046046046,-0.1425594000445303,-0.14416443129202605,0.021462240413024396
3.6965465465465464,-0.141767593469095,-0.14337926763141745,0.02137796821659434
3.697047047047047,-0.14097291695007355,-0.142591102547934,0.02129418532106875
3.6975475475475474,-0.14017541039646622,-0.14179997278895223,0.021210893131324925
3.698048048048048,-0.13937511440312197,-0.14100591577650395,0.02112809289602311
3.6985485485485485,-0.138572070234814,-0.14020896959306264,0.02104578570826492
3.699049049049049,-0.13776631980955042,-0.13940917296663646,0.02096397250645079
3.6995495495495496,-0.13695790568116567,-0.13860656525517587,0.020882654075339378
3.70005005005005,-0.13614687102115375,-0.13780118643028585,0.020801831047308657
3.7005505505505507,-0.13533325959977421,-0.13699307706024982,0.020721503903821593
3.701051051051051,-0.13451711576643752,-0.13618227829239168,0.020641672977100973
3.7015515515515514,-0.13369848442936225,-0.13536883183474846,0.020562338452011556
3.702052052052052,-0.13287741103452622,-0.1345527799370886,0.02048350036815292
3.7025525525525524,-0.13205394154393715,-0.1337341653712864,0.020405158622166172
3.703053053053053,-0.1312281224131842,-0.1329130314110335,0.02032731297025129
3.7035535535535535,-0.1304000005683595,-0.13208942181094252,0.020249963030902422
3.704054054054054,-0.12956962338228098,-0.13126338078501892,0.02017310828785505
3.7045545545545546,-0.12873703865011063,-0.13043495298453456,0.020096748093252268
3.705055055055055,-0.1279022945643327,-0.12960418347532168,0.02002088167102699
3.7055555555555557,-0.1270654396891307,-0.1287711177144869,0.019945508120499608
3.706056056056056,-0.1262265229341868,-0.12793580152658449,0.019870626420196293
3.7065565565565564,-0.12538559352791584,-0.12709828107925544,0.019796235431882293
3.707057057057057,-0.1245427009901659,-0.12625860285835547,0.019722333904812796
3.7075575575575574,-0.12369789510441202,-0.1254168136426009,0.01964892048020049
3.708058058058058,-0.12285122588945205,-0.12457296047774825,0.019575993695900098
3.7085585585585585,-0.12200274357065687,-0.12372709065034038,0.019503551991307773
3.709059059059059,-0.12115249855079048,-0.12287925166103723,0.019431593712474216
3.7095595595595596,-0.1203005413804271,-0.12202949119756906,0.01936011711743167
3.71006006006006,-0.11944692272800796,-0.12117785710733411,0.019289120381732246
3.7105605605605607,-0.11859169334956633,-0.12032439736967113,0.019218601604196257
3.711061061061061,-0.11773490405815494,-0.11946916006784832,0.019148558812868515
3.7115615615615614,-0.11687660569300651,-0.11861219336078468,0.019078989971180047
3.712062062062062,-0.11601684908848028,-0.11775354545455617,0.019009892984313784
3.7125625625625625,-0.11515568504281715,-0.11689326457371266,0.018941265705770687
3.713063063063063,-0.11429316428675326,-0.11603139893243954,0.01887310594413365
3.7135635635635635,-0.11342933745202338,-0.11516799670561,0.018805411470024562
3.714064064064064,-0.11256425503980956,-0.11430310599976458,0.018738180023255113
3.7145645645645646,-0.11169796738916352,-0.11343677482404825,0.018671409320160294
3.715065065065065,-0.11083052464546687,-0.11256905106117096,0.018605097061119593
3.7155655655655657,-0.1099619767289431,-0.11169998243839536,0.018539240938251968
3.716066066066066,-0.10909237330330596,-0.11082961649863593,0.018473838643286125
3.7165665665665664,-0.10822176374455579,-0.10995800057167991,0.01840888787559916
3.717067067067067,-0.10735019710999548,-0.10908518174559445,0.01834438635041595
3.7175675675675675,-0.10647772210751177,-0.10821120683836259,0.018280331807166306
3.7180680680680682,-0.10560438706514542,-0.1073361223697775,0.01821672201799017
3.7185685685685685,-0.10473023990104988,-0.10645997453367327,0.01815355479638804
3.719069069069069,-0.1038553280938265,-0.10558280917049721,0.01809082800600288
3.7195695695695696,-0.10297969865334743,-0.1047046717403174,0.018028539569534197
3.72007007007007,-0.1021033980920715,-0.10382560729627298,0.017966687477767262
3.7205705705705707,-0.10122647239692723,-0.10294566045853808,0.01790526979871461
3.721071071071071,-0.10034896700181097,-0.10206487538884765,0.017844284686857823
3.7215715715715714,-0.09947092676074341,-0.10118329576561536,0.01778373039248053
3.722072072072072,-0.09859239592174275,-0.10030096475971115,0.017723605271080328
3.7225725725725725,-0.0977134181014755,-0.09941792501094553,0.017663907792852682
3.7230730730730732,-0.09683403626070135,-0.09853421860528917,0.01760463655222862
3.7235735735735735,-0.09595429268061281,-0.09764988705290208,0.017545790277461698
3.724074074074074,-0.09507422894006873,-0.09676497126699858,0.017487367840243007
3.7245745745745746,-0.09419388589381346,-0.09587951154360849,0.017429368265338113
3.725075075075075,-0.09331330365170541,-0.09499354754227773,0.017371790740227138
3.7255755755755757,-0.09243252155900399,-0.09410711826774275,0.017314634624732424
3.726076076076076,-0.09155157817777965,-0.09322026205264825,0.017257899460622953
3.7265765765765764,-0.0906705112694784,-0.09233301654132728,0.017201584981173728
3.727077077077077,-0.08978935777868385,-0.09144541867470005,0.017145691120666016
3.7275775775775775,-0.08890815381813712,-0.09055750467633697,0.017090218023809705
3.7280780780780782,-0.08802693465504212,-0.0896693100397138,0.01703516605507033
3.7285785785785786,-0.08714573469870267,-0.08878086951671393,0.016980535807879282
3.729079079079079,-0.08626458748953655,-0.08789221710740154,0.016926328113709255
3.7295795795795796,-0.08538352568949437,-0.08700338605111826,0.016872544050992838
3.73008008008008,-0.08450258107393764,-0.08611440881892861,0.01681918495386376
3.7305805805805807,-0.08362178452498804,-0.08522531710744655,0.01676625242069724
3.731081081081081,-0.08274116602640445,-0.08433614183408855,0.016713748322426874
3.7315815815815814,-0.08186075466000008,-0.08344691313376713,0.0166616748106163
3.732082082082082,-0.08098057860364631,-0.08255766035706791,0.01661003432525631
3.7325825825825825,-0.08010066513088082,-0.08166841206993002,0.016558829602268135
3.7330830830830832,-0.07922104061213732,-0.08077919605485127,0.016508063680681848
3.7335835835835836,-0.07834173051764748,-0.0798900393136534,0.01645773990946719
3.734084084084084,-0.07746275942200238,-0.07900096807181245,0.016407861953987028
3.7345845845845846,-0.07658415101042072,-0.07811200778438664,0.016358433802047004
3.735085085085085,-0.07570592808672044,-0.07722318314354909,0.016309459769513167
3.7355855855855857,-0.0748281125830132,-0.07633451808773938,0.016260944505467122
3.736086086086086,-0.07395072557114504,-0.07544603581245546,0.016212892996871425
3.7365865865865864,-0.07307378727586913,-0.07455775878267853,0.016165310572714166
3.737087087087087,-0.0721973170897755,-0.0736697087469525,0.01611820290760274
3.7375875875875875,-0.07132133358997551,-0.07278190675311613,0.016071576024776893
3.7380880880880882,-0.07044585455653848,-0.07189437316568317,0.01602543629851017
3.7385885885885886,-0.06957089699267914,-0.0710071276848846,0.015979790455867865
3.739089089089089,-0.06869647714670064,-0.07012018936735064,0.015934645577793484
3.7395895895895896,-0.06782261053566786,-0.06923357664844161,0.015890009099489833
3.74009009009009,-0.06694931197082549,-0.0683473073662147,0.015845888810065736
3.7405905905905907,-0.06607659558471587,-0.06746139878700222,0.015802292851418223
3.741091091091091,-0.06520447486001768,-0.06657586763261282,0.015759229716319198
3.7415915915915914,-0.06433296266005245,-0.06569073010910934,0.015716708245678574
3.742092092092092,-0.06346207126096128,-0.06480600193716506,0.015674737624953312
3.7425925925925925,-0.06259181238552611,-0.06392169838397314,0.01563332737967712
3.7430930930930932,-0.06172219723858229,-0.06303783429666525,0.015592487370079997
3.7435935935935936,-0.060853236544039305,-0.06215442413724363,0.015552227784776511
3.744094094094094,-0.05998494058342896,-0.06127148201896499,0.015512559133493855
3.7445945945945946,-0.059117319235983096,-0.060389021744164516,0.0154734922388202
3.745095095095095,-0.05825038202018454,-0.05950705684347759,0.015435038226949256
3.7455955955955957,-0.05738413813675244,-0.058625600616415786,0.015397208517404575
3.746096096096096,-0.05651859651303062,-0.057744666173268726,0.015360014811723104
3.7465965965965964,-0.055653765848713996,-0.05686426647827444,0.015323469081085252
3.747097097097097,-0.05478965466289001,-0.05598441439402741,0.01528758355287879
3.7475975975975975,-0.05392627134232493,-0.055105122727066774,0.015252370696184746
3.7480980980980982,-0.05306362419095021,-0.05422640427459496,0.015217843206182425
3.7485985985985986,-0.05220172148049634,-0.05334827187228351,0.015184013987465213
3.749099099099099,-0.05134057150221354,-0.05247073844309623,0.01515089613627039
3.7495995995995997,-0.050480182619620825,-0.051593817047090484,0.015118502921625351
3.7501001001001,-0.049620563322228146,-0.05071752093212805,0.015086847765417109
3.7506006006006007,-0.048761722280151056,-0.04984186358542757,0.01505594422139595
3.751101101101101,-0.04790366839958221,-0.048966858785919984,0.015025805953130052
3.7516016016016014,-0.04704641087901478,-0.04809252065731148,0.014996446710929704
3.752102102102102,-0.04618995926618615,-0.04721886372181294,0.014967880307765047
3.7526026026026025,-0.045334323515646716,-0.04634590295445957,0.014940120594209818
3.7531031031031032,-0.04447951404688465,-0.045473653837939707,0.014913181432439906
3.7536036036036036,-0.04362554180294682,-0.044602132417884126,0.014887076669330783
3.754104104104104,-0.04277241830945756,-0.04373135535851922,0.014861820108694615
3.7546046046046047,-0.04192015573398028,-0.04286133999862893,0.014837425482708229
3.755105105105105,-0.041068766945634494,-0.041992104407742314,0.014813906422585746
3.7556056056056057,-0.04021826557487679,-0.041123667442461605,0.014791276428555353
3.756106106106106,-0.03936866607339221,-0.040256048802874034,0.0147695488392063
3.7566066066066064,-0.03851998377398448,-0.03938926908894245,0.01474873680027381
3.757107107107107,-0.037672234950403546,-0.03852334985681737,0.01472885323294119
3.7576076076076075,-0.03682543687701929,-0.03765831367497784,0.014709910801734028
3.7581081081081082,-0.03597960788825,-0.03679418418011621,0.014691921882095477
3.7586086086086086,-0.03513476743767465,-0.035930986132699017,0.014674898527729617
3.759109109109109,-0.03429093615672683,-0.03506874547210059,0.014658852437806933
3.7596096096096097,-0.033448135912894986,-0.03420748937124376,0.014643794924130024
3.76011011011011,-0.03260638986734164,-0.03334724629065663,0.014629736878360286
3.7606106106106107,-0.03176572253183921,-0.0324880460318497,0.01461668873940894
3.761111111111111,-0.03092615982495834,-0.031629919789953574,0.014604660461102236
3.7616116116116114,-0.030087729127394713,-0.030772900205501014,0.014593661480227154
3.762112112112112,-0.029250459336367933,-0.029917021415294925,0.014583700685072545
3.7626126126126125,-0.028414380918988368,-0.02906231910226116,0.014574786384574927
3.7631131131131133,-0.02757952596451063,-0.028208830544201213,0.014566926278186362
3.7636136136136136,-0.026745928235383583,-0.02735659466136967,0.014560127426575621
3.764114114114114,-0.02591362321700666,-0.02650565206277529,0.01455439622327708
3.7646146146146147,-0.025082648166106183,-0.025656045091134155,0.01454973836740001
3.765115115115115,-0.02425304215764687,-0.024807817866387208,0.014546158837509857
3.7656156156156158,-0.023424846130177663,-0.023961016327685263,0.0145436618667886
3.766116116116116,-0.022598102929548138,-0.02311568827378038,0.014542250919581636
3.766616616616617,-0.021772857350878964,-0.022271883401713943,0.014541928669432774
3.767117117117117,-0.02094915617873386,-0.021429653343745098,0.0145426969787059
3.7676176176176175,-0.020127048225375543,-0.020589051702411557,0.014544556879886204
3.7681181181181183,-0.019306584367045007,-0.019750134083662708,0.014547508558650156
3.7686186186186186,-0.018487817578173853,-0.01891295812797523,0.014551551338785402
3.7691191191191193,-0.01767080296343572,-0.01807758353936583,0.014556683669037422
3.7696196196196197,-0.01685559778757848,-0.017244072112240626,0.01456290311195182
3.77012012012012,-0.016042261502931122,-0.016412487755980854,0.014570206334773185
3.7706206206206208,-0.015230855774528465,-0.015582896517210294,0.014578589102456367
3.771121121121121,-0.014421444502763912,-0.014755366599658789,0.01458804627283392
3.771621621621622,-0.013614093843492494,-0.013929968381543773,0.014598571793979605
3.772122122122122,-0.012808872225523469,-0.013106774430416112,0.014610158703795785
3.7726226226226225,-0.012005850365408601,-0.012285859515377353,0.014622799131845665
3.7731231231231233,-0.011205101279474855,-0.011467300616618548,0.014636484303441742
3.7736236236236236,-0.010406700293022425,-0.010651176932207752,0.01465120454599405
3.7741241241241243,-0.009610725046614426,-0.00983756988205259,0.014666949297610983
3.7746246246246247,-0.008817255499411158,-0.0090265631089942,0.014683707117938802
3.775125125125125,-0.00802637392946263,-0.008218242476950093,0.014701465701215928
3.7756256256256258,-0.007238164930917682,-0.007412696066065486,0.014720211891510338
3.776126126126126,-0.006452715408081907,-0.006610014164808723,0.014739931700099023
3.776626626626627,-0.00567011456626224,-0.005810289258950934,0.014760610324943226
3.777127127127127,-0.004890453899361492,-0.005013616017395915,0.014782232172201428
3.7776276276276275,-0.004113827174150149,-0.004220091274789235,0.01480478087971879
3.7781281281281283,-0.0033403304111845086,-0.003429814010879588,0.014828239342423449
3.7786286286286286,-0.0025700618623185844,-0.0026428853265798714,0.014852589739551154
3.7791291291291293,-0.0018031219847605238,-0.0018594084166825777,0.014877813563619837
3.7796296296296297,-0.0010396134116497295,-0.0010794885392075388,0.014903891651062937
3.78013013013013,-2.796409190995776e-4,-3.0323298132793424e-4,0.014930804214432127
3.7806306306306308,4.766886103125784e-4,4.692489781406265e-4,0.014958530876070391
3.781131131131131,0.0012292662276420772,0.0012378461097215861,0.014987050703155798
3.781631631631632,0.0019779809612964386,0.002002445277762077,0.015016342244012102
3.782132132132132,0.0027227198643810352,0.00276293148842411,0.015046383565578686
3.7826326326326325,0.003463368065710028,0.0035191879412204627,0.015077152291930651
3.7831331331331333,0.004199808824483857,0.004271096084092239,0.015108625643738523
3.7836336336336336,0.0049319235886458625,0.0050185356720441445,0.015140780478554555
3.7841341341341344,0.0056595920569379775,0.0057613848293517015,0.015173593331812736
3.7846346346346347,0.006382692244635939,0.006499520115323725,0.015207040458428722
3.785135135135135,0.007101100552985748,0.007232816593639525,0.01524109787488539
3.7856356356356358,0.007814691842319185,0.007961147905237255,0.015275741401691802
3.786136136136136,0.008523339508842456,0.00868438634474946,0.015310946706101601
3.786636636636637,0.009226915565091557,0.009402402940477029,0.015346689344980123
3.787137137137137,0.00992529072401863,0.010115067537866626,0.015382944807710231
3.7876376376376375,0.010618334486702168,0.010822248886485366,0.015419688559027355
3.7881381381381383,0.011305915233638882,0.011523814730449224,0.015456896081678568
3.7886386386386386,0.011987900319586771,0.012219631902277248,0.015494542918799833
3.7891391391391394,0.012664156171928849,0.012909566420139464,0.01553260471591097
3.7896396396396397,0.013334548392495779,0.013593483588440227,0.015571057262427709
3.79014014014014,0.01399894186281726,0.01427124810170579,0.01560987653259414
3.7906406406406408,0.014657200852734285,0.014942724151709413,0.015649038725742224
3.791141141141141,0.015309189132314204,0.015607775537780215,0.01568852030578687
3.791641641641642,0.015954770087012092,0.016266265780238508,0.015728298039868194
3.792142142142142,0.01659380683599578,0.016918058236875123,0.015768349036056818
3.7926426426426425,0.01722616235356832,0.01756301622241653,0.015808650780039686
3.7931431431431433,0.017851699593600216,0.01820100313088369,0.0158491811707078
3.7936436436436436,0.018470281616885825,0.01883188256076556,0.01588991855457084
3.7941441441441444,0.019081771721337768,0.019455518442923418,0.01593084175892653
3.7946446446446447,0.019686033574908824,0.02007177517111518,0.01597193012371451
3.795145145145145,0.02028293135115184,0.020680517735059512,0.016013163531990775
3.7956456456456458,0.020872329867301292,0.021281611855918113,0.016054522438959648
3.796146146146146,0.021454094724758888,0.021874924124090634,0.01609598789950292
3.796646646646647,0.022028092451877212,0.022460322139213434,0.01613754159415235
3.797147147147147,0.022594190648897835,0.02303767465222607,0.016179165853451014
3.7976476476476475,0.023152258134933,0.023606851709396588,0.016220843680655996
3.7981481481481483,0.023702165096840037,0.02416772479815955,0.016262558772734748
3.7986486486486486,0.02424378323985507,0.024720166994637225,0.01630429553961352
3.7991491491491494,0.02477698593984291,0.02526405311270739,0.01634603912163873
3.7996496496496497,0.025301648397002163,0.02579925985445762,0.016387775405214005
3.80015015015015,0.02581764779088607,0.02632566596189429,0.016429491036582863
3.8006506506506508,0.0263248634365622,0.02684315236973257,0.01647117343372504
3.801151151151151,0.026823176941756077,0.02735160235911921,0.016512810796343907
3.801651651651652,0.027312472364811338,0.027850901712123094,0.01655439211392084
3.802152152152152,0.027792636373281953,0.0283409388668174,0.016595907171820013
3.8026526526526525,0.028263558402991894,0.02882160507279177,0.01663734655542791
3.8031531531531533,0.02872513081737399,0.029292794546910784,0.01667870165231793
3.8036536536536536,0.02917724906689783,0.02975440462913819,0.016719964652432147
3.8041541541541544,0.029619811848411667,0.030206335938252858,0.016761128546278866
3.8046546546546547,0.030052721264190195,0.03064849252725644,0.01680218712114633
3.805155155155155,0.030475882980506342,0.031080782038294244,0.016843134955337916
3.8056556556556558,0.030889206385521586,0.03150311585689164,0.016883967410439796
3.806156156156156,0.03129260474628935,0.03191540926530743,0.016924680621633874
3.806656656656657,0.03168599536468636,0.03231758159481719,0.01696527148607489
3.807157157157157,0.03206929973204133,0.03270955637671334,0.01700573764935614
3.8076576576576575,0.03244244368227661,0.033091261491832884,0.017046077490089843
3.8081581581581583,0.03280535754333994,0.03346262931840026,0.01708629010263604
3.8086586586586586,0.03315797628672174,0.03382359687798437,0.017126375278016057
3.8091591591591594,0.03350023967484536,0.034174105979368506,0.017166333483055202
3.8096596596596597,0.03383209240612016,0.03451410336011646,0.017206165837798514
3.81016016016016,0.03415348425744376,0.034843540825640514,0.01724587409125452
3.810660660660661,0.034464370223942505,0.03516237538555499,0.017285460595522755
3.811161161161161,0.03476471065573694,0.03547056938711231,0.017324928278366916
3.811661661661662,0.035054471391525274,0.03576809064551894,0.01736428061430167
3.812162162162162,0.03533362388876584,0.03605491257091717,0.017403521594263623
3.8126626626626625,0.03560214535026443,0.03633101429184031,0.01744265569394457
3.8131631631631633,0.03586001884694096,0.03659638077492785,0.017481687840867774
3.8136636636636636,0.03610723343658795,0.036851002940707846,0.017520623380293778
3.8141641641641644,0.0363437842784048,0.037094877775244256,0.01755946804004606
3.8146646646646647,0.03656967274311512,0.03732800843745339,0.01759822789435183
3.815165165165165,0.03678490651846853,0.03755040436190011,0.017636909326798282
3.815665665665666,0.0369894997099339,0.037762081356879106,0.017675518992505326
3.816166166166166,0.037183472936386595,0.03796306169759664,0.01771406377962247
3.816666666666667,0.037366853420621314,0.03815337421427533,0.017752550770262446
3.817167167167167,0.03753967507448885,0.03833305437499477,0.017790987200980247
3.8176676676676675,0.03770197857849547,0.0385021443631044,0.01782938042291857
3.8181681681681683,0.0378538114556877,0.03866069314903266,0.017867737861734238
3.8186686686686686,0.03799522813965423,0.03880875655633325,0.017906066977429014
3.8191691691691694,0.03812629003649214,0.03894639732180973,0.017944375224204223
3.8196696696696697,0.03824706558057471,0.039073685149567376,0.017982670010464916
3.82017017017017,0.03835763028398394,0.03919069675884551,0.018020958659095632
3.820670670670671,0.03845806677945273,0.039297515925492216,0.018059248368131334
3.821171171171171,0.03854846485670248,0.039394233516951295,0.018097546171949648
3.821671671671672,0.03862892149202725,0.03948094752063086,0.018135858903104592
3.822172172172172,0.038699540871026145,0.03955776306554289,0.018174193154924242
3.822672672672673,0.03876043440436064,0.03962479243709893,0.01821255524499252
3.8231731731731733,0.03881172073643883,0.03968215508496062,0.01825095117963037
3.8236736736736736,0.03885352574692781,0.03972997762385297,0.0182893866194929
3.8241741741741744,0.038885982545021076,0.03976839382725435,0.018327866846391077
3.8246746746746747,0.03890923145636422,0.039797544613883,0.01836639673144472
3.8251751751751755,0.03892342000259046,0.039817578026917724,0.018404980704670698
3.825675675675676,0.03892870287339468,0.03982864920588789,0.018443622726100267
3.826176176176176,0.03892524189110405,0.039830920351187155,0.018482326258519435
3.826676676676677,0.03891320596769885,0.03982456068116742,0.018521094241916808
3.827177177177177,0.03889277105426202,0.03980974638178443,0.018559929069718074
3.827677677677678,0.038864120082831285,0.039786660548770475,0.01859883256687927
3.8281781781781783,0.0388274429006448,0.039755493122325125,0.01863780596990356
3.8286786786786786,0.0387829361967794,0.03971644081432143,0.01867684990884028
3.8291791791791794,0.03873080342119577,0.039669707028033956,0.018715964391314847
3.8296796796796797,0.038671254696208565,0.0396155017704106,0.018755148788631975
3.8301801801801805,0.038604506720404934,0.03955404155690945,0.018794401823984928
3.830680680680681,0.03853078266506602,0.039485549308946634,0.0188337215627976
3.831181181181181,0.03845031206312766,0.03941025424399739,0.018873105405215012
3.831681681681682,0.03836333069075245,0.03932839175841054,0.018912550080749796
3.832182182182182,0.03827008044157883,0.03924020330300618,0.018952051645086978
3.832682682682683,0.03817080919372569,0.039145936251530296,0.01899160547903531
3.8331831831831833,0.03806577066965743,0.0390458437620605,0.01903120628961025
3.8336836836836836,0.037955224288986796,0.03894018463145348,0.01907084811322176
3.8341841841841844,0.037839435014354265,0.038829223142949704,0.019110524320935202
3.8346846846846847,0.03771867319048527,0.03871322890704659,0.019150227625761965
3.8351851851851855,0.03759321437656204,0.038592476695768506,0.0191899500919334
3.835685685685686,0.037463339172049206,0.03846724627047067,0.019229683146099602
3.836186186186186,0.03732933303612764,0.038337822203322255,0.019269417590393544
3.836686686686687,0.03719148610088581,0.038204493692622014,0.019309143617287694
3.837187187187187,0.03705009297844152,0.03806755437210833,0.019348850826169644
3.837687687687688,0.03690545256216925,0.037927302114438385,0.019388528241557557
3.8381881881881883,0.03675786782221429,0.03778403882901324,0.019428164332863984
3.8386886886886886,0.03660764559548987,0.03763807025433818,0.01946774703562409
3.8391891891891894,0.0364550963703557,0.037489705745115696,0.01950726377408938
3.8396896896896897,0.03630053406618488,0.037339258054270574,0.01954670148508786
3.8401901901901905,0.03614427580803179,0.037187043110119986,0.01958604664305316
3.840690690690691,0.035986641696631405,0.03703337978890853,0.01962528528611391
3.841191191191191,0.035827954573949654,0.03687858968292715,0.019664403043142157
3.841691691691692,0.035668539784522106,0.03672299686445028,0.019703385161648972
3.842192192192192,0.03550872493282755,0.036566927645728414,0.01974221653642212
3.842692692692693,0.03534883963693248,0.03641071033527239,0.019780881738795962
3.8431931931931933,0.035189215278669875,0.03625467499068743,0.01981936504644519
3.8436936936936936,0.03503018475060102,0.036099153168295914,0.01985765047359393
3.8441941941941944,0.03487208220002335,0.03594447766981849,0.019895721801534906
3.8446946946946947,0.03471524277029355,0.035790982286367054,0.019933562609351925
3.8451951951951955,0.03456000233972798,0.03563900154001606,0.01997115630474347
3.845695695695696,0.03440669725836334,0.035488870423222504,0.020008486154845594
3.846196196196196,0.03425566408284046,0.03534092413636352,0.020045535316958275
3.846696696696697,0.03410723930969912,0.03519549782366723,0.02008228686907722
3.847197197197197,0.033961759107363404,0.035052926307813655,0.020118723840143085
3.847697697697698,0.03381955904709241,0.03491354382348097,0.020154829239919094
3.8481981981981983,0.03368097383318852,0.034777683750119984,0.02019058608841236
3.8486986986986986,0.03354633703274211,0.03464567834423582,0.020225977444763753
3.8491991991991994,0.033415980805201126,0.03451785847145773,0.020260986435527314
3.8496996996996997,0.03329023563204475,0.03439455333867964,0.02029559628227197
3.8502002002002005,0.03316943004685621,0.03427609022655192,0.020329790328441105
3.850700700700701,0.03305389036606807,0.03416279422260582,0.02036355206540791
3.851201201201201,0.0329439404206716,0.03405498795528929,0.020396865157673187
3.851701701701702,0.03283990128916349,0.03395299132919462,0.020429713467156385
3.852202202202202,0.03274209103202273,0.03385712126175251,0.020462081076532933
3.852702702702703,0.03265082442797957,0.03376769142166853,0.020493952311582075
3.8532032032032033,0.03256641271236356,0.03368501196937535,0.020525311762507843
3.8537037037037036,0.032489163317800045,0.033609389299767034,0.020556144304206346
3.8542042042042044,0.03241937961751976,0.03354112578748499,0.020586435115454594
3.8547047047047047,0.03235736067155406,0.033480519535017406,0.020616169697002043
3.8552052052052055,0.03230340097607065,0.03342786412386894,0.020645333888550943
3.855705705705706,0.032257790216109354,0.03338344836905917,0.020673913884616063
3.856206206206206,0.03222081302197307,0.03334755607719762,0.020701896249261043
3.856706706706707,0.03219274872951912,0.03332046580838143,0.02072926792970735
3.8572072072072072,0.03217387114458708,0.033302450642155375,0.02075601626882393
3.857707707707708,0.03216444831181534,0.03329377794777177,0.02078212901650493
3.8582082082082083,0.032164742288059885,0.03329470915897531,0.02080759433994514
3.8587087087087086,0.032175008920654016,0.03330549955354248,0.020832400832834747
3.8592092092092094,0.03219549763071881,0.03332639803778465,0.020856537523485683
3.8597097097097097,0.03222645120173952,0.03335764693623434,0.020879993881919672
3.8602102102102105,0.0322681055736153,0.0333994817867112,0.020902759825937735
3.860710710710711,0.032320689642377394,0.033452131140972625,0.02092482572620551
3.861211211211211,0.032384425065768566,0.033515816371131324,0.02094618241038007
3.861711711711712,0.032459526074865165,0.033590751482030196,0.02096682116631713
3.8622122122122122,0.03254619929192402,0.03367714292974522,0.020986733744390668
3.862712712712713,0.032644643554615084,0.03377518944638746,0.021005912358964787
3.8632132132132133,0.032755049746804585,0.03388508187136261,0.02102434968905721
3.8637137137137136,0.03287760063604495,0.03400700298924361,0.02104203887823381
3.8642142142142144,0.033012470717905605,0.03414112737439553,0.021058973533776927
3.8647147147147147,0.03315982606729373,0.03428762124249654,0.021075147725171387
3.8652152152152155,0.033319824196883084,0.03444664230907758,0.021090555981950466
3.865715715715716,0.03349261392277735,0.034618339655203174,0.02110519329094609
3.866216216216216,0.033678335237513346,0.034802853600406206,0.021119055092988955
3.866716716716717,0.03387711919051528,0.03500031558297816,0.021132137279100814
3.8672172172172172,0.03408908777608216,0.03521084804771031,0.021144436186226495
3.867717717717718,0.03431435382900942,0.03543456434117533,0.02115594859254586
3.8682182182182183,0.03455302092790726,0.035671568614623755,0.02116667171241301
3.8687187187187186,0.03480518330629399,0.03592195573456777,0.02117660319096275
3.8692192192192194,0.035070925771521516,0.03618581120111263,0.021185741098427538
3.8697197197197197,0.0353503236315826,0.036463211074087766,0.021194083924205662
3.8702202202202205,0.03564344262984791,0.036754221907027075,0.021201630570720914
3.870720720720721,0.035950338887758615,0.03705890068902523,0.021208380347110402
3.871221221221221,0.036271058855515764,0.03737729479451037,0.021214332962780594
3.871721721721722,0.036605639270765156,0.03770944194094136,0.021219488520863795
3.8722222222222222,0.03695410712530169,0.03805537015444759,0.02122384751161115
3.872722722722723,0.03731647963979265,0.03841509774341614,0.021227410805752415
3.8732232232232233,0.03769276424650663,0.03878863328001539,0.021230179647854567
3.8737237237237236,0.03808295858003863,0.03917597558964984,0.02123215564970484
3.8742242242242244,0.03848705047600989,0.039577113748322026,0.021233340783747223
3.8747247247247247,0.03890501797770798,0.03999202708787378,0.021233737376593724
3.8752252252252255,0.03933682935063295,0.04042068520907549,0.021233348102633866
3.875725725725726,0.03978244310490354,0.04086304800251474,0.02123217597776253
3.876226226226226,0.04024180802546952,0.04131906567724169,0.021230224353242476
3.876726726726727,0.04071486321007134,0.041788678797107126,0.021227496909716568
3.8772272272272272,0.041201538114878845,0.04227181832473275,0.021223997651385412
3.877727727727728,0.04170175260774282,0.04276840567304735,0.021219730900358374
3.8782282282282283,0.04221541702896274,0.043278352764300365,0.021214701291187917
3.8787287287287286,0.04274243225950606,0.04380156209648216,0.02120891376559404
3.8792292292292294,0.043282689796562836,0.04433792681705112,0.021202373567382825
3.8797297297297297,0.043836071836354,0.04488733080387474,0.021195086237561115
3.8802302302302305,0.04440245136408372,0.045449648753287754,0.021187057609648393
3.880730730730731,0.04498169225091125,0.04602474627514593,0.021178293805181415
3.881231231231231,0.04557364935785062,0.04661247999478154,0.021168801229412438
3.881731731731732,0.04617816864645232,0.04721269766172225,0.021158586567190413
3.8822322322322322,0.04679508729615104,0.04782523826506096,0.021147656779019978
3.882732732732733,0.04742423382814984,0.04844993215535034,0.02113601909729052
3.8832332332332333,0.04806542823569278,0.04908660117287171,0.021123681022659883
3.8837337337337337,0.04871848212059706,0.049735058782164526,0.021110650320585254
3.8842342342342344,0.04938319883588397,0.05039511021264846,0.021096935017983112
3.8847347347347347,0.05005937363437356,0.051066552605209405,0.021082543400006894
3.8852352352352355,0.05074679382307899,0.05174917516459248,0.021067484006921516
3.885735735735736,0.051445238923238525,0.05244275931744135,0.02105176563106083
3.886236236236236,0.0521544808358389,0.05314707887583615,0.02103539731384661
3.886736736736737,0.05287428401244689,0.053861900206159954,0.02101838834285108
3.8872372372372372,0.05360440563119138,0.05458698240312873,0.02100074824888202
3.887737737737738,0.054344595777723506,0.05532207746882602,0.020982486803068537
3.8882382382382383,0.055094597630973005,0.05606693049655429,0.020963614013926657
3.8887387387387387,0.055854147653536024,0.056821279859349295,0.020944140124382966
3.8892392392392394,0.056622975786502786,0.0575848574029629,0.02092407560873262
3.8897397397397397,0.057400805648548485,0.05835738864314521,0.020903431169509587
3.8902402402402405,0.05818735473910985,0.05913859296704973,0.02088221773424834
3.890740740740741,0.058982334645445264,0.059928183838560016,0.020860446452109188
3.891241241241241,0.05978545125341267,0.060725869007381084,0.020838128690352287
3.891741741741742,0.06059640496175732,0.06153135072168345,0.020815276030631085
3.8922422422422422,0.06141489089972445,0.06234432594412352,0.02079190026508814
3.892742742742743,0.06224059914782028,0.06316448657106015,0.02076801339222985
3.8932432432432433,0.06307321496149935,0.0639915196547542,0.020743627612560787
3.8937437437437437,0.06391241899761758,0.06482510762838753,0.020718755323956707
3.8942442442442444,0.06475788754343127,0.06566492853368795,0.020693409116759254
3.8947447447447447,0.06560929274795711,0.06651065625097508,0.02066760176857232
3.8952452452452455,0.06646630285550686,0.06736196073144382,0.020641346238744748
3.895745745745746,0.06732858244118486,0.06821850823147185,0.020614655662524035
3.896246246246246,0.0681957926481705,0.0690799615487806,0.020587543344865216
3.896746746746747,0.0690675914265727,0.06994598026023459,0.020560022753883547
3.8972472472472472,0.06994363377367488,0.0708162209611019,0.020532107513940565
3.897747747747748,0.07082357197537542,0.07169033750557635,0.020503811398348656
3.8982482482482483,0.07170705584861876,0.07256798124836335,0.020475148321694316
3.8987487487487487,0.07259373298463548,0.07344880128714842,0.02044613233176516
3.8992492492492494,0.07348324899279798,0.07433244470574842,0.020416777601081394
3.8997497497497497,0.07437524774487862,0.07521855681774571,0.020387098418027404
3.9002502502502505,0.07526937161956211,0.07610678141044477,0.0203571091775808
3.900750750750751,0.07616526174697547,0.07699676098891964,0.02032682437164355
3.901251251251251,0.07706255825308193,0.07788813702000315,0.02029625857897311
3.901751751751752,0.07796090050372884,0.07878055017600259,0.02026542645472451
3.9022522522522523,0.07885992734817833,0.07967364057796691,0.020234342719603476
3.902752752752753,0.07975927736193283,0.08056704803832798,0.020203022148645958
3.9032532532532533,0.08065858908866318,0.08146041230271238,0.02017147955963106
3.9037537537537537,0.08155750128107457,0.08235337329076345,0.020139729801140892
3.9042542542542544,0.08245565314051426,0.08324557133577717,0.020107787740284797
3.9047547547547548,0.08335268455516008,0.0841366474229825,0.020075668250102697
3.9052552552552555,0.0842482363366007,0.08502624342628867,0.020043386196666495
3.905755755755756,0.08514195045464128,0.08591400234331523,0.020010956425903833
3.906256256256256,0.08603347027016163,0.08679956852854968,0.019978393750163297
3.906756756756757,0.08692244076586143,0.0876825879244444,0.019945712934548734
3.9072572572572573,0.08780850877471566,0.08856270829028878,0.019912928683048326
3.907757757757758,0.0886913232059946,0.08943957942870653,0.01988005562448768
3.9082582582582583,0.08957053526865513,0.09031285340958027,0.019847108298336
3.9087587587587587,0.09044579869199597,0.09118218479128273,0.01981410114039919
3.9092592592592594,0.09131676994335396,0.09204723083901913,0.01978104846843087
3.9097597597597598,0.09218310844274027,0.09290765174014468,0.019747964467698602
3.9102602602602605,0.09304447677425397,0.09376311081630455,0.01971486317653826
3.910760760760761,0.09390054089409522,0.09461327473222565,0.01968175847193932
3.911261261261261,0.09475097033507823,0.09545781370103917,0.019648664055191917
3.911761761761762,0.09559543840746818,0.09629640168596547,0.019615593437642118
3.9122622622622623,0.09643362239600137,0.09712871659822642,0.019582559926591053
3.912762762762763,0.09726520375299906,0.09795444049105773,0.019549576611381226
3.9132632632632633,0.09808986828736319,0.09877325974966004,0.019516656349709987
3.9137637637637637,0.0989073063494039,0.09958486527698376,0.01948381175421305
3.9142642642642644,0.09971721301131889,0.10038895267519352,0.019451055179357263
3.9147647647647648,0.10051928824322277,0.10118522242270067,0.01941839870869013
3.9152652652652655,0.10131323708460635,0.10197338004664046,0.019385854142481496
3.915765765765766,0.10209876981110426,0.1027531362906637,0.019353432985804022
3.916266266266266,0.10287560209646653,0.10352420727794108,0.01932114643708982
3.916766766766767,0.10364345516961469,0.10428631466925939,0.019289005377207305
3.9172672672672673,0.10440205596668885,0.10503918581610147,0.01925702035909504
3.917767767767768,0.1051511372779783,0.10578255390861506,0.01922520159799242
3.9182682682682684,0.10589043788963429,0.1065161581183536,0.01919355896230428
3.9187687687687687,0.10661970272009344,0.10723974373571651,0.01916210196513683
3.9192692692692694,0.107338682951091,0.10795306230196937,0.019130839756537264
3.9197697697697698,0.10804713615320385,0.10865587173578058,0.01909978111647217
3.9202702702702705,0.10874482640583527,0.10934793645417742,0.019068934448574583
3.920770770770771,0.10943152441156191,0.11002902748784471,0.01903830777468888
3.921271271271271,0.11010700760477897,0.11069892259070241,0.019007908730241066
3.921771771771772,0.11077106025457016,0.1113574063436732,0.018977744560458
3.9222722722722723,0.11142347356174215,0.11200427025258972,0.01894782211745935
3.922772772772773,0.11206404574996118,0.11263931284018293,0.01891814785823853
3.9232732732732734,0.11269258215095315,0.11326233973208225,0.01888872784355448
3.9237737737737737,0.11330889528369975,0.11387316373679325,0.018859567737742593
3.9242742742742744,0.11391280492760252,0.11447160491959583,0.01883067280946075
3.9247747747747748,0.11450413818956542,0.11505749067032936,0.018802047933374824
3.9252752752752755,0.11508272956497054,0.1156306557650306,0.01877369759279142
3.925775775775776,0.11564842099251489,0.11619094242138564,0.018745625883236625
3.926276276276276,0.11620106190288956,0.11673820034798929,0.01871783651698229
3.926776776776777,0.11674050926127261,0.11727228678736898,0.018690332828512093
3.9272772772772773,0.11726662760363671,0.11779306655278661,0.018663117780922688
3.927777777777778,0.11777928906685406,0.11830041205878707,0.0186361939732431
3.9282782782782784,0.11827837341260938,0.11879420334551283,0.018609563648665384
3.9287787787787787,0.118763768045104,0.11927432809676385,0.01858322870365919
3.9292792792792794,0.11923536802258275,0.11974068165183815,0.01855719069795705
3.9297797797797798,0.11969307606268875,0.12019316701114846,0.018531450865380196
3.9302802802802805,0.12013680254166317,0.12063169483565009,0.01850601012547934
3.930780780780781,0.12056646548742107,0.12105618344009031,0.018480869095958224
3.9312812812812816,0.12098199056653493,0.12146655878013037,0.01845602810584682
3.931781781781782,0.12138331106516054,0.12186275443336562,0.018431487209385686
3.9322822822822823,0.12177036786396662,0.12224471157429792,0.018407246200582785
3.932782782782783,0.12214310940707335,0.12261237894330057,0.018383304628398284
3.9332832832832834,0.1225014916651091,0.122965712809634,0.018359661812512335
3.933783783783784,0.1228454780924124,0.12330467692858989,0.01833631685962953
3.9342842842842844,0.12317503957844791,0.12362924249280616,0.018313268680265542
3.9347847847847848,0.1234901543935208,0.12393938807784938,0.018290516005968906
3.9352852852852855,0.12379080812886503,0.1242350995821294,0.018268057406916637
3.935785785785786,0.12407699363117274,0.12451637016123833,0.018245891309833475
3.9362862862862866,0.1243487109316804,0.12478320015680801,0.01822401601617204
3.936786786786787,0.12460596716987629,0.12503559701996994,0.018202429720496037
3.9372872872872873,0.12484877651196909,0.12527357522954205,0.01818113052900588
3.937787787787788,0.12507716006417277,0.12549715620502114,0.018160116478141954
3.9382882882882884,0.12529114578096864,0.12570636821452344,0.01813938555320723
3.938788788788789,0.1254907683684243,0.12590124627777166,0.018118935706940936
3.9392892892892895,0.12567606918270396,0.12608183206425766,0.018098764877980632
3.9397897897897898,0.12584709612391096,0.1262481737867151,0.01807887100915025
3.9402902902902905,0.12600390352536392,0.12640032609002988,0.018059252065507774
3.940790790790791,0.12614655203846273,0.1265383499357218,0.018039906052087887
3.9412912912912916,0.12627510851328896,0.1266623124821593,0.01802083103127875
3.941791791791792,0.1263896458750689,0.12677228696062734,0.0180020251397671
3.9422922922922923,0.1264902429966489,0.12686835254742232,0.01798348660499038
3.942792792792793,0.1265769845671718,0.12695059423212388,0.017965213761036804
3.9432932932932934,0.1266499609570521,0.12701910268219183,0.017947205063930802
3.943793793793794,0.1267092680794665,0.12707397410407206,0.017929459106248644
3.9442942942942945,0.12675500724849179,0.12711531010095692,0.017911974631005884
3.944794794794795,0.12678728503406927,0.12714321752738414,0.017894750544763628
3.9452952952952955,0.1268062131139649,0.1271578083408425,0.017877785929902544
3.945795795795796,0.12681190812289633,0.1271591994505543,0.017861080056012366
3.9462962962962966,0.1268044914990219,0.12714751256363266,0.017844632390353644
3.946796796796797,0.12678408932792354,0.1271228740287602,0.017828442607344876
3.9472972972972973,0.12675083218433178,0.1270854146776061,0.017812510597034554
3.947797797797798,0.12670485497171638,0.1270352696641411,0.017796836472523055
3.9482982982982984,0.12664629675995415,0.1269725783020552,0.017781420576295986
3.948798798798799,0.1265753006212642,0.12689748390044567,0.01776626348544059
3.9492992992992995,0.12649201346458308,0.12681013359797702,0.01775136601571833
3.9497997997998,0.1263965858685746,0.12671067819569665,0.017736729224468773
3.9503003003003005,0.12628917191346256,0.12659927198869664,0.01772235441232785
3.950800800800801,0.12616992901187124,0.12647607259680224,0.017708243123741432
3.9513013013013016,0.1260390177388701,0.12634124079449352,0.01769439714626974
3.951801801801802,0.12589660166139743,0.12619494034022674,0.01768081850866885
3.9523023023023023,0.12574284716726059,0.12603733780535667,0.01766750947775205
3.952802802802803,0.12557792329389675,0.12586860240284428,0.01765447255403189
3.9533033033033034,0.12540200155707604,0.12568890581593206,0.017641710466149735
3.953803803803804,0.1252152557797373,0.12549842202696457,0.017629226164104096
3.9543043043043045,0.12501786192112027,0.12529732714655248,0.017617022811294906
3.954804804804805,0.12480999790640453,0.12508579924323834,0.017605103775403856
3.9553053053053056,0.1245918434569991,0.12486401817385336,0.01759347261813497
3.955805805805806,0.12436357992167862,0.1246321654147391,0.017582133083848716
3.9563063063063066,0.12412539010873062,0.12439042389399524,0.017571089087120233
3.956806806806807,0.12387745811928394,0.12413897782493467,0.01756034469926465
3.9573073073073077,0.12361996918197547,0.12387801254089059,0.017549904133868085
3.957807807807808,0.12335310948912911,0.12360771433156097,0.01753977173137835
3.9583083083083084,0.12307706603458991,0.1233282702810207,0.01752995194280135
3.958808808808809,0.12279202645338265,0.12303986810756924,0.017520449312561935
3.9593093093093095,0.12249817886332687,0.1227426960055614,0.017511268460590864
3.9598098098098102,0.12219571170876276,0.122436942489349,0.01750241406369652
3.9603103103103106,0.12188481360652031,0.12212279623949025,0.017493890836292166
3.960810810810811,0.12156567319427267,0.12180044595134597,0.017485703510548407
3.9613113113113116,0.12123847898139935,0.12147008018619637,0.01747785681604335
3.961811811811812,0.1209034192024771,0.12113188722499975,0.01747035545898546
3.9623123123123127,0.12056068167352615,0.120786054924903,0.01746320410108948
3.962812812812813,0.12021045365111653,0.12043277057863068,0.017456407338184883
3.9633133133133134,0.11985292169444527,0.1200722207768389,0.017449969678639363
3.963813813813814,0.11948827153048704,0.11970459127354312,0.017443895521679964
3.9643143143143145,0.11911668792229167,0.11933006685471641,0.017438189135699236
3.9648148148148152,0.11873835454055998,0.11894883121013544,0.01743285463662953
3.9653153153153156,0.11835345383853768,0.11856106680856325,0.017427895966473136
3.965815815815816,0.11796216693031786,0.11816695477633847,0.01742331687207348
3.9663163163163166,0.11756467347263369,0.11776667477944172,0.0174191208842136
3.966816816816817,0.11716115155019001,0.11736040490910246,0.017415311297126583
3.9673173173173177,0.11675177756459526,0.1169483215710002,0.01741189114850148
3.967817817817818,0.1163367261269409,0.11653059937810709,0.017408863200067095
3.9683183183183184,0.11591616995408442,0.11610741104722647,0.017406229918835347
3.968818818818819,0.11549027976865558,0.11567892729924002,0.017403993459076943
3.9693193193193195,0.11505922420284227,0.11524531676313496,0.017402155645113812
3.9698198198198202,0.11462316970594578,0.11480674588378385,0.017400717954988904
3.9703203203203206,0.11418228045577371,0.11436337883354958,0.01739968150509259
3.970820820820821,0.11373671827382696,0.11391537742768038,0.017399047035803077
3.9713213213213217,0.11328664254433879,0.11346290104353629,0.01739881489820465
3.971821821821822,0.11283221013714219,0.11300610654363256,0.017398985041941005
3.9723223223223227,0.11237357533435342,0.11254514820248962,0.01739955700425092
3.972822822822823,0.11191088976089443,0.1120801776373041,0.01740052990023897
3.9733233233233234,0.11144430231879822,0.11161134374238917,0.01740190241441712
3.973823823823824,0.11097395912531106,0.11113879262739543,0.01740367279355653
3.9743243243243245,0.11050000345474495,0.11066266755926979,0.017405838840877406
3.9748248248248252,0.11002257568405281,0.11018310890792299,0.0174083979116048
3.9753253253253256,0.10954181324211304,0.10970025409557689,0.01741134690990634
3.975825825825826,0.10905785056263158,0.1092142375497429,0.017414682287224915
3.9763263263263267,0.10857081904068396,0.1087251906597899,0.017418400042015413
3.976826826826827,0.10808084699279541,0.10823324173705982,0.017422495720883596
3.9773273273273277,0.10758805962052767,0.10773851597846157,0.017426964421122796
3.977827827827828,0.10709257897752081,0.10724113543351285,0.017431800794640864
3.9783283283283284,0.10659452393991425,0.10674121897473543,0.017436999053252352
3.978828828828829,0.10609401018009874,0.1062388822713765,0.01744255297532323
3.9793293293293295,0.10559115014372704,0.10573423776636447,0.017448455913731054
3.9798298298298302,0.10508605302990799,0.10522739465644275,0.017454700805115016
3.9803303303303306,0.10457882477452153,0.10471845887539952,0.017461280180367963
3.980830830830831,0.10406956803657803,0.10420753308033621,0.017468186176336605
3.9813313313313317,0.10355838218753596,0.10369471664087798,0.01747541054867276
3.981831831831832,0.10304536330351849,0.10318010563126409,0.0174829446857877
3.9823323323323327,0.1025306041603242,0.10266379282523139,0.01749077962385141
3.982832832832833,0.10201419423118241,0.1021458676936141,0.017498906062775838
3.9833333333333334,0.10149621968713045,0.10162641640456621,0.01750731438311625
3.983833833833834,0.10097676339995917,0.10110552182633883,0.017515994663825443
3.9843343343343345,0.10045590494764996,0.10058326353252565,0.017524936700791
3.9848348348348352,0.09993372062217117,0.10005971780967564,0.017534130026079304
3.9853353353353356,0.09941028343960848,0.09953495766721117,0.01754356392781581
3.985835835835836,0.0988856631524953,0.0990090528495522,0.01755322747062323
3.9863363363363367,0.09835992626429146,0.09848206985036752,0.017563109516540536
3.986836836836837,0.09783313604590188,0.09795407192886584,0.017573198746343593
3.9873373373373378,0.09730535255417481,0.09742511912804684,0.017583483681190292
3.987837837837838,0.09677663265226755,0.09689526829483014,0.01759395270451009
3.9883383383383384,0.09624703003182945,0.09636457310197225,0.017604594084058445
3.988838838838839,0.09571659523688923,0.09583308407170174,0.017615395994059573
3.9893393393393395,0.09518537568939475,0.09530084860098628,0.017626346537359217
3.9898398398398403,0.09465341571631145,0.09476791098835838,0.017637433767511247
3.9903403403403406,0.09412075657820364,0.0942343124622193,0.017648645710725705
3.990840840840841,0.09358743649922892,0.09370009121055162,0.01765997038760379
3.9913413413413417,0.09305349069847527,0.09316528241196573,0.017671395834588967
3.991841841841842,0.0925189514225617,0.09262991826800988,0.017682910125068937
3.9923423423423428,0.09198384797943734,0.09209402803667996,0.017694501390062362
3.992842842842843,0.09144820677332391,0.09155763806705938,0.017706157838426627
3.9933433433433434,0.09091205134071813,0.09102077183502597,0.01771786777652929
3.993843843843844,0.0903754023874137,0.09048344997997135,0.017729619627327987
3.9943443443443445,0.0898382778264742,0.08994569034247303,0.017741401948806006
3.9948448448448453,0.08930069281709781,0.08940750800285466,0.017753203451712787
3.9953453453453456,0.08876265980433731,0.08886891532060404,0.01776501301657056
3.995845845845846,0.0882241885596063,0.08832992197457576,0.017776819709900027
3.9963463463463467,0.08768528622194376,0.08779053500395043,0.017788612799632942
3.996846846846847,0.08714595733997994,0.08725075884990074,0.017800381769676927
3.9973473473473478,0.08660620391456926,0.08671059539792411,0.017812116333605674
3.997847847847848,0.08606602544205495,0.08617004402080447,0.01782380644744772
3.9983483483483484,0.08552541895812552,0.08562910162217359,0.017835442321556923
3.998848848848849,0.08498437908223704,0.08508776268063771,0.01784701443154786
3.9993493493493495,0.08444289806256985,0.08454601929444458,0.01785851352828253
3.9998498498498503,0.08390096582150157,0.08400386122666179,0.017869930646905435
4.000350350350351,0.08335857000156459,0.08346127595085225,0.017881257114917712
4.000850850850851,0.08281569601187302,0.08291824869722084,0.017892484559297598
4.001351351351351,0.0822723270750101,0.0823747624992201,0.01790360491266654
4.001851851851852,0.08172844427435264,0.08183079824060718,0.017914610418512954
4.002352352352353,0.08118402660183958,0.08128633470293513,0.017925493635483895
4.002852852852853,0.08063905100614037,0.08074134861346903,0.01793624744076183
4.003353353353353,0.08009349244127027,0.08019581469353672,0.017946865032545452
4.003853853853854,0.07954732391561138,0.0796497057072999,0.01795733993165668
4.004354354354355,0.07900051654134832,0.07910299251094574,0.01796766598230117
4.004854854854855,0.07845303958434191,0.07855564410232095,0.017977837352010306
4.005355355355356,0.07790486051440618,0.07800762767097807,0.017987848530794714
4.005855855855856,0.07735594505604826,0.0774589086486841,0.01799769432954876
4.006356356356356,0.07680625723962456,0.07690945076037063,0.01800736987773622
4.006856856856857,0.07625575945297551,0.0763592160755477,0.01801687062040138
4.007357357357358,0.07570441249351627,0.0758081650602003,0.018026192314543447
4.007857857857858,0.07515217562081422,0.07525625662916832,0.018035331024899633
4.008358358358358,0.07459900660966999,0.07470344819904275,0.018044283119177745
4.008858858858859,0.07404486180371041,0.07414969574158586,0.018053045262788045
4.00935935935936,0.07348969616952604,0.073594953837698,0.018061614413118383
4.00985985985986,0.07293346335136276,0.07303917573195431,0.01806998781340096
4.010360360360361,0.07237611572638514,0.07248231338771886,0.018078162986220166
4.010860860860861,0.0718176044605516,0.07192431754288159,0.018086137726708598
4.011361361361361,0.0712578795650997,0.07136513776621634,0.01809391009548021
4.0118618618618624,0.0706968899536829,0.07080472251440044,0.018101478411352418
4.012362362362363,0.07013458350017375,0.07024301918970881,0.01810884124390056
4.012862862862863,0.06957090709714567,0.06967997419840316,0.01811599740589663
4.013363363363363,0.0690058067150843,0.06911553300985453,0.01812294594567893
4.013863863863864,0.0684392274623182,0.06854964021640089,0.0181296861394968
4.014364364364365,0.0678711136457076,0.06798223959397573,0.018136217483877337
4.014864864864865,0.06730140883211706,0.06741327416352708,0.018142539688057298
4.015365365365366,0.06673005591066905,0.0668426862532326,0.018148652666520736
4.015865865865866,0.06615699715582637,0.06627041756155437,0.018154556531684816
4.016366366366366,0.06558217429129735,0.06569640922112996,0.018160251586769868
4.0168668668668674,0.06500552855478904,0.06512060186352181,0.018165738318889395
4.017367367367368,0.06442700076363195,0.06454293568485008,0.01817101739239554
4.017867867867868,0.06384653138126127,0.063963350512298,0.018176089642509528
4.018368368368368,0.06326406058460113,0.06338178587152744,0.018180956069264655
4.018868868868869,0.06267952833232862,0.06279818105499226,0.018185617831788653
4.01936936936937,0.06209287443404534,0.06221247519116806,0.018190076242948813
4.01986986986987,0.06150403862035108,0.06162460731469677,0.018194332764376098
4.020370370370371,0.06091296061380863,0.06103451643744188,0.018198389001888873
4.020870870870871,0.06031958020083108,0.06044214162046665,0.018202246701327068
4.021371371371371,0.059723837304447254,0.05984742204691607,0.018205907744807234
4.0218718718718725,0.0591256720579668,0.05925029709580215,0.01820937414740666
4.022372372372373,0.058525024879523144,0.05865070641668443,0.01821264805427832
4.022872872872873,0.05792183654746799,0.05804859000521753,0.01821573173819974
4.023373373373373,0.05731604827662791,0.05744388827956499,0.01821862759754934
4.023873873873874,0.0567076017953746,0.056836542157649,0.01822133815470843
4.024374374374375,0.05609643942349673,0.05622649313520912,0.01822386605487591
4.024874874874875,0.055482504150848246,0.05561368336465172,0.018226214065286763
4.025375375375376,0.05486573971672347,0.054998055734639076,0.018228385074816063
4.025875875875876,0.054246090689943974,0.05437955395040337,0.018230382093952696
4.026376376376376,0.05362350254960184,0.053758122614730286,0.01823220825512125
4.0268768768768775,0.05299792176642372,0.053133707309572134,0.018233866813328184
4.027377377377378,0.052369295884702315,0.052506254678247766,0.018235361147107193
4.027877877877878,0.051737573604740676,0.05187571250816127,0.01823669475973404
4.028378378378378,0.05110270486576292,0.05124202981400259,0.018237871280682584
4.028878878878879,0.05046464092922088,0.050605156921357176,0.01823889446728799
4.02937937937938,0.04982333446243702,0.04996504555066096,0.0182397682065839
4.02987987987988,0.049178739622514143,0.049321648901439655,0.01824049651727747
4.030380380380381,0.04853081214043688,0.04867492173674421,0.018241083551826243
4.030880880880881,0.047879509405292724,0.04802482046772598,0.018241533598578802
4.031381381381381,0.047224790548528406,0.04737130323825384,0.01824185108393932
4.0318818818818825,0.04656661652815966,0.04671433000949804,0.018242040574518795
4.032382382382383,0.04590495021284544,0.04605386264439248,0.01824210677923161
4.032882882882883,0.04523975646573093,0.04538986499187288,0.018242054551298993
4.033383383383383,0.044571002227970516,0.04472230297081238,0.018241888890119656
4.033883883883884,0.043898656601828574,0.04405114465354232,0.01824161494296818
4.034384384384385,0.043222690933254294,0.04337636034886007,0.018241238006483633
4.034884884884885,0.0425430788938302,0.042697922684425564,0.018240763527911343
4.035385385385386,0.041859796561976075,0.04201580668841699,0.018240197106060403
4.035885885885886,0.041172822503309406,0.041329989870364896,0.018239544491944832
4.036386386386386,0.040482137850039845,0.04064045230102317,0.01823881158907261
4.0368868868868875,0.03978772637928322,0.03994717669117662,0.018238004453354606
4.037387387387388,0.03908957459018252,0.03925014846926611,0.018237129292603092
4.037887887887888,0.03838767177969656,0.038549355857692265,0.01823619246559299
4.038388388388388,0.03768201011696108,0.037844789947703836,0.018235200480664508
4.038888888888889,0.03697258471607421,0.037136444772724105,0.01823415999384316
4.03938938938939,0.036259393707194325,0.036424317379998475,0.01823307780646194
4.03988988988989,0.03554243830582012,0.035708407900440865,0.018231960862268987
4.040390390390391,0.03482172288011844,0.03498871961653462,0.018230816244008807
4.040890890890891,0.03409725501618581,0.03426525902818397,0.01822965116947068
4.041391391391391,0.033369045581104276,0.033538035916370605,0.018228472986996848
4.0418918918918925,0.03263710878366547,0.03280706340449036,0.018227289170451036
4.042392392392393,0.0319014622326437,0.03207235801725242,0.01822610731364795
4.042892892892893,0.031162126992470902,0.03133393973699186,0.018224935124250746
4.043393393393393,0.030419127636212455,0.030591832057297253,0.018223780417145674
4.043893893893894,0.029672492295698828,0.029846062033806887,0.01822265110730593
4.044394394394395,0.028922252708700358,0.029096660332058037,0.018221555202162315
4.044894894894895,0.02816844426302367,0.028343661272275406,0.01822050079350136
4.045395395395396,0.027411106037396254,0.02758710287095746,0.01821949604891293
4.045895895895896,0.026650280839047122,0.02682702687917237,0.0182185492028159
4.046396396396396,0.025886015237849738,0.026063478817429105,0.018217668547091295
4.0468968968968975,0.025118359596922345,0.02529650800702026,0.018216862421356457
4.047397397397398,0.024347368099588904,0.024526167597736324,0.018216139202916714
4.047897897897898,0.023573098772574314,0.023752514591827846,0.01821550729643382
4.048398398398398,0.02279561350536226,0.022975609864143206,0.018214975123351403
4.048898898898899,0.022014978065603732,0.022195518178328304,0.01821455111112353
4.0493993993994,0.021231262110490777,0.02141230819900446,0.01821424368229039
4.0498998998999,0.020444539194019312,0.020626052499847756,0.01821406124345062
4.050400400400401,0.019654886770040868,0.019836827567467345,0.01821401217417756
4.050900900900901,0.0188623861910598,0.019044713801041585,0.018214104815932667
4.051401401401401,0.018067122702684263,0.01824979550761875,0.01821434746102533
4.0519019019019025,0.017269185433680705,0.017452160893030488,0.018214748341672245
4.052402402402403,0.01646866738158364,0.01665190204837158,0.01821531561921018
4.052902902902903,0.01566566539378938,0.01584911493197187,0.018216057373511726
4.053403403403403,0.014860280144126293,0.015043899346853188,0.018216981592659477
4.053903903903904,0.014052616104842637,0.014236358913612064,0.018218096162928365
4.054404404404405,0.013242781513995586,0.013426601038709735,0.018219408859126887
4.054904904904905,0.012430888338229525,0.012614736878157883,0.01822092733534782
4.055405405405406,0.011617052230912061,0.011800881296566916,0.01822265911617464
4.055905905905906,0.010801392485652865,0.010985152821581239,0.018224611588390307
4.056406406406406,0.009984031985191216,0.01016767359368504,0.018226791993232076
4.0569069069069075,0.009165097145670618,0.00934856931139854,0.01822920741923315
4.057407407407408,0.008344717856331937,0.008527969171890974,0.018231864795688713
4.057907907907908,0.007523027414631417,0.00770600580701964,0.018234770886783522
4.058408408408408,0.006700162456853409,0.006882815214859715,0.018237932286410786
4.058908908908909,0.005876262884241329,0.006058536686748718,0.018241355413712128
4.05940940940941,0.005051471784709982,0.005233312729907775,0.0182450465093629
4.05990990990991,0.004225935350210929,0.004407288985707724,0.018249011632623553
4.060410410410411,0.0033998027898005383,0.0035806141436301986,0.018253256659173787
4.060910910910911,0.002573226238520777,0.0027534398510302752,0.018257787279742414
4.061411411411411,0.0017463606621598573,0.0019259206187667978,0.018262608999541036
4.0619119119119125,9.193637579949053e-4,0.0010982137228017627,0.01826772713850498
4.062412412412413,9.239585163215522e-5,2.7047910187976733e-4,0.018273146832342085
4.062912912912913,-7.343802099671351e-4,-5.571207486243585e-4,0.018278873034383636
4.0634134134134134,-0.001560799169126054,-0.0013844208865418303,0.018284910518228593
4.063913913913914,-0.002386693471647925,-0.002211254036326337,0.018291263881167585
4.064414414414415,-0.0032118933844298096,-0.003037450705910434,0.01829793754836866
4.064914914914915,-0.0040362271163413175,-0.0038628393068544428,0.018304935777802466
4.065415415415416,-0.0048595209422447536,-0.0046872462776634495,0.018312262665881835
4.065915915915916,-0.005681599329969748,-0.005510496210089488,0.01831992215378418
4.066416416416416,-0.006502285070103655,-0.006332411978281995,0.01832791803442425
4.0669169169169175,-0.007321399408425074,-0.007152814870613545,0.018336253960039316
4.067417417417418,-0.008138762180796453,-0.007971524724003256,0.01834493345034632
4.067917917917918,-0.008954191950362974,-0.008788360060583453,0.018353959901227172
4.0684184184184184,-0.009767506146845802,-0.009603138226499783,0.01836333659389574
4.06891891891892,-0.01057852120776337,-0.010415675532682458,0.01837306670449752
4.06941941941942,-0.011387052721372654,-0.011225787397382513,0.018383153314090177
4.06991991991992,-0.012192915571162487,-0.012033288490302236,0.018393599418952283
4.070420420420421,-0.012995924081665517,-0.012837992878095079,0.01840440794116441
4.070920920920921,-0.013795892165414159,-0.013639714171057445,0.01841558173940711
4.071421421421421,-0.014592633470828866,-0.014438265670801451,0.018427123619917135
4.0719219219219225,-0.015385961530830085,-0.01523346051870842,0.018439036347545488
4.072422422422423,-0.0161756899119695,-0.0160251118449488,0.018451322656856756
4.072922922922923,-0.016961632363882668,-0.016813032917883622,0.01846398526321316
4.0734234234234235,-0.017743602968834205,-0.01759703729361164,0.018477026873783515
4.073923923923925,-0.01852141629116572,-0.01837693896547787,0.01849045019842039
4.074424424424425,-0.019294887526423592,-0.019152552513318464,0.018504257960347305
4.074924924924925,-0.02006383264998003,-0.019923693252259202,0.018518452906602575
4.075425425425426,-0.020828068564914634,-0.02069017738083295,0.018533037818183107
4.075925925925926,-0.021587413248970122,-0.021451822128233114,0.018548015519837386
4.076426426426426,-0.022341685900377033,-0.022208445900493513,0.018563388889456817
4.0769269269269275,-0.023090707082342454,-0.0229598684253968,0.018579160867016702
4.077427427427428,-0.023834298866004855,-0.023705910895907154,0.01859533446302205
4.077927927927928,-0.024572284971677478,-0.024446396111954257,0.01861191276641526
4.0784284284284285,-0.025304490908164525,-0.025181148620349134,0.018628898951904106
4.07892892892893,-0.026030744109985942,-0.02590999485267135,0.018646296286675315
4.07942942942943,-0.026750874072316248,-0.02663276326092691,0.01866410813645821
4.07992992992993,-0.027464712483474644,-0.027349284450821024,0.018682337970908947
4.080430430430431,-0.028172093354779888,-0.028059391312450197,0.018700989368287697
4.080930930930931,-0.02887285314761411,-0.028762919148264232,0.018720066019406834
4.081431431431431,-0.029566830897536426,-0.029459705798130533,0.01873957173082799
4.0819319319319325,-0.030253868335286004,-0.03014959176134936,0.018759510427295085
4.082432432432433,-0.030933810004532845,-0.030832420315463748,0.018779886153388332
4.082932932932933,-0.03160650337624147,-0.031508037631739906,0.018800703074392834
4.0834334334334335,-0.032271798959498596,-0.03217629288715971,0.018821965476374557
4.083933933933935,-0.032929550408693206,-0.03283703837281736,0.018843677765466228
4.084434434434435,-0.033579614626920114,-0.03349012959858334,0.01886584446636147
4.084934934934935,-0.034221851865511854,-0.03413542539394299,0.01888847022002765
4.085435435435436,-0.03485612581956962,-0.0347727880048794,0.018911559780643704
4.085935935935936,-0.035482303719420766,-0.035402083186720126,0.018935118011777812
4.086436436436436,-0.03610025641790404,-0.03602318029285251,0.018959149881822006
4.0869369369369375,-0.03670985847340609,-0.03663595235922378,0.018983660458701326
4.087437437437438,-0.03731098822857038,-0.03724027618454968,0.019008654903882732
4.087937937937938,-0.03790352788463111,-0.037836032406177916,0.019034138465707427
4.0884384384384385,-0.03848736357129697,-0.03842310557152823,0.019060116472075637
4.08893893893894,-0.03906238541215326,-0.0390013842050764,0.01908659432251576
4.08943943943944,-0.03962848758552912,-0.039570760870827434,0.01911357747966901
4.08993993993994,-0.04018556838081547,-0.04013113223025943,0.0191410714602277
4.090440440440441,-0.040733530250196014,-0.040682399095692684,0.019169081825362377
4.090940940940941,-0.0412722798557807,-0.04122446647908139,0.019197614170678213
4.091441441441441,-0.041801728112139246,-0.04175724363621198,0.019226674115742047
4.0919419419419425,-0.04232179022422929,-0.042280644106304034,0.01925626729322016
4.092442442442443,-0.042832385720723364,-0.0427945857470196,0.01928639933767341
4.092942942942943,-0.0433334384827706,-0.0432989907649012,0.01931707587405029
4.0934434434434435,-0.04382487676818601,-0.043793785741244165,0.019348302505926757
4.093943943943945,-0.0443066332311229,-0.04427890165344277,0.01938008480353503
4.094444444444445,-0.044778644937244795,-0.044754273891834256,0.01941242829162959
4.094944944944945,-0.04524085337446459,-0.04521984227209432,0.019445338437234814
4.095445445445446,-0.045693204459277596,-0.045675551043217175,0.019478820637321908
4.095945945945946,-0.046135648538754445,-0.04612134889114223,0.019512880206457712
4.096446446446446,-0.046568140388260584,-0.0465571889380849,0.01954752236447351
4.0969469469469475,-0.04699063920496323,-0.046983028737638335,0.019582752224196354
4.097447447447448,-0.047403108597202266,-0.04739883026571217,0.01961857477928643
4.097947947947948,-0.04780551656980751,-0.04780455990739453,0.019654994892223537
4.0984484484484485,-0.048197835505439844,-0.0482001884398095,0.019692017282484202
4.09894894894895,-0.04858004214204872,-0.04858569101105934,0.01972964651494721
4.09944944944945,-0.048952117546535195,-0.048961047115341785,0.019767886988567632
4.09994994994995,-0.04931404708473168,-0.049326240564345196,0.01980674292535696
4.100450450450451,-0.04966582038777608,-0.04968125945500578,0.019846218359701122
4.100950950950951,-0.050007431315005325,-0.05002609613374275,0.019886317128052458
4.101451451451451,-0.050338877913465356,-0.05036074715727097,0.019927042859024698
4.1019519519519525,-0.050660162374155125,-0.05068521325010386,0.019968398963921517
4.102452452452453,-0.05097129098511052,-0.05099949925885321,0.020010388627724234
4.102952952952953,-0.05127227408145195,-0.05130361410344915,0.020053014800564175
4.1034534534534535,-0.05156312599251474,-0.05159757072538923,0.020096280189702297
4.103953953953955,-0.05184386498616495,-0.05188138603313765,0.020140187252034265
4.104454454454455,-0.05211451321044965,-0.05215508084479685,0.02018473818714199
4.104954954954955,-0.052375096632685664,-0.05241867982817549,0.02022993493090529
4.105455455455456,-0.05262564497610843,-0.05267221143836656,0.02027577914968522
4.105955955955956,-0.0528661916542279,-0.052915707852972026,0.020322272235094276
4.106456456456456,-0.05309677370298608,-0.053149204905089016,0.020369415299357187
4.1069569569569575,-0.05331743171086726,-0.053372742014187624,0.02041720917127207
4.107457457457458,-0.053528209747070864,-0.05358636211500097,0.020465654392773387
4.107957957957958,-0.05372915528788321,-0.053790111584561456,0.02051475121610082
4.1084584584584585,-0.053920319141363096,-0.0539840401674963,0.020564499601572032
4.10895895895896,-0.05410175537047092,-0.05416820089971471,0.020614899215956748
4.10945945945946,-0.0542735212147636,-0.05434265003060542,0.020665949431448786
4.10995995995996,-0.05443567701077954,-0.05450744694387333,0.020717649325229244
4.110460460460461,-0.05458828611123233,-0.054662654077128045,0.020769997679612188
4.110960960960961,-0.054731414803127355,-0.054808336840350635,0.020822992982763036
4.111461461461461,-0.05486513222493443,-0.05494456353335239,0.020876633429977257
4.1119619619619625,-0.05498951028291454,-0.0550714052623499,0.020930916925508976
4.112462462462463,-0.055104623566728565,-0.05518893585575899,0.02098584108492983
4.112962962962963,-0.05521054926443331,-0.055297231779333905,0.02104140323800742
4.1134634634634635,-0.05530736707697331,-0.05539637205075034,0.02109760043208101
4.113963963963965,-0.055395159132284974,-0.055486438153751816,0.021154429435921343
4.114464464464465,-0.0554740098991057,-0.055567513951954764,0.021211886744049144
4.114964964964965,-0.055544006100601555,-0.05563968560242367,0.02126996858149733
4.115465465465466,-0.05560523662790522,-0.055703041469115845,0.02132867090899279
4.115965965965966,-0.05565779245366568,-0.055757672036288106,0.02138798942853558
4.116466466466467,-0.05570176654570387,-0.05580366982196995,0.021447919589355564
4.1169669669669675,-0.05573725378086048,-0.05584112929158899,0.02150845659422027
4.117467467467468,-0.05576435085913547,-0.05587014677184022,0.021569595406073824
4.117967967967968,-0.05578315621818866,-0.0558908203648878,0.02163133075498112
4.1184684684684685,-0.055793769948297836,-0.05590324986297903,0.02169365714535408
4.11896896896897,-0.05579629370784905,-0.05590753666355551,0.021756568863437
4.11946946946947,-0.05579083063942623,-0.05590378368493471,0.021820059985025366
4.11996996996997,-0.055777485286594576,-0.05589209528264101,0.021884124383397353
4.120470470470471,-0.055756363511417696,-0.05587257716645126,0.02194875573743012
4.120970970970971,-0.05572757241280416,-0.05584533631823054,0.0220139475398824
4.121471471471472,-0.05569122024572755,-0.05581048091061481,0.022079693105816683
4.1219719719719725,-0.055647416341385904,-0.05576812022661074,0.022145985581140174
4.122472472472473,-0.055596271028363314,-0.0557183645801617,0.022212817951242417
4.122972972972973,-0.05553789555483711,-0.055661325237746785,0.022280183049708226
4.1234734734734735,-0.05547240201189039,-0.05559711434105265,0.02234807356708232
4.123973973973975,-0.05539990325797073,-0.055525844830778805,0.02241648205966964
4.124474474474475,-0.0553205128445484,-0.055447630371616236,0.022485400958348216
4.124974974974975,-0.0552343449430073,-0.055362585278441935,0.02255482257737715
4.125475475475476,-0.055141514272809625,-0.05527082444377453,0.022624739123179964
4.125975975975976,-0.05504213603097169,-0.055172463266524134,0.022695142703088544
4.126476476476477,-0.0549363258228913,-0.05506761758207178,0.022766025334027103
4.1269769769769775,-0.05482419959453404,-0.05495640359371202,0.022837378951123973
4.127477477477478,-0.054705873566035124,-0.05483893780548352,0.02290919541623344
4.127977977977978,-0.05458146416671888,-0.05471533695641888,0.02298146652635567
4.1284784784784785,-0.05445108797156868,-0.05458571795623221,0.023054184021937672
4.12897897897898,-0.05431486163916687,-0.05445019782246851,0.023127339595047407
4.12947947947948,-0.05417290185111856,-0.05430889361913409,0.02320092489740525
4.12997997997998,-0.05402532525296984,-0.054161922396817955,0.023274931548264696
4.130480480480481,-0.05387224839664598,-0.0540094011343255,0.02334935114212997
4.130980980980981,-0.05371378768440602,-0.05385144668183082,0.023424175256303168
4.131481481481482,-0.05355005931433063,-0.05368817570555756,0.02349939545825133
4.1319819819819825,-0.053381179227339454,-0.053519704633995455,0.023575003312785392
4.132482482482483,-0.053207263055754864,-0.05334614960565809,0.02365099038904736
4.132982982982983,-0.05302842607340078,-0.05316762641838159,0.023727348267293537
4.1334834834834835,-0.0528447831472451,-0.05298425048016895,0.023804068545475236
4.133983983983985,-0.0526564486905782,-0.05279613676157501,0.02388114284560682
4.134484484484485,-0.05246353661772763,-0.052603399749634246,0.023958562819920592
4.134984984984985,-0.052266160300298924,-0.052406153403318396,0.024036320156803993
4.135485485485486,-0.05206443252494263,-0.05220451111052717,0.024114406586516247
4.135985985985986,-0.0518584654526307,-0.051998585646598025,0.024192813886682516
4.136486486486487,-0.051648370579437115,-0.05178848913432591,0.02427153388756494
4.1369869869869875,-0.051434258698809764,-0.05157433300548683,0.024350558477108465
4.137487487487488,-0.05121623986532396,-0.05135622796384591,0.02442987960576274
4.137987987987988,-0.05099442335989213,-0.05113428394964326,0.024509489291078514
4.1384884884884885,-0.050768917656436874,-0.05090861010553908,0.024589379622080413
4.13898898898899,-0.05053983038998108,-0.05067931474400291,0.02466954276341719
4.13948948948949,-0.05030726832617052,-0.05044650531613398,0.024749970959289887
4.13998998998999,-0.05007133733217694,-0.05021028838188376,0.024830656537162037
4.140490490490491,-0.04983214234899351,-0.049970769581678856,0.02491159191125194
4.140990990990991,-0.04958978736508234,-0.049728053609409635,0.02499276958581115
4.141491491491492,-0.04934437539135981,-0.04948224418677121,0.025074182158192352
4.1419919919919925,-0.049096008437498534,-0.04923344403893535,0.02515582232170759
4.142492492492493,-0.04884478748952291,-0.04898175487152925,0.025237682868285406
4.142992992992993,-0.04859081248867634,-0.04872727734889902,0.025319756690924327
4.1434934934934935,-0.04833418231153692,-0.04847011107363891,0.025402036785952722
4.143993993993995,-0.048074994751353434,-0.04821035456735474,0.025484516255094788
4.144494494494495,-0.04781334650058793,-0.04794810525264769,0.025567188307350202
4.144994994994995,-0.04754933313462566,-0.04768345943628189,0.025650046260690784
4.145495495495496,-0.04728304909664162,-0.04741651229352263,0.025733083543578512
4.145995995995996,-0.04701458768358788,-0.047147357853613237,0.025816293696310846
4.146496496496497,-0.046744041033282974,-0.04687608898636579,0.025899670372197578
4.1469969969969975,-0.04647150011257701,-0.04660279738984394,0.025983207338574458
4.147497497497498,-0.04619705470655626,-0.046327573579105635,0.026066898477659736
4.147997997997998,-0.04592079340878328,-0.0460505068759857,0.02615073778725684
4.1484984984984985,-0.04564280361251981,-0.045771685399889614,0.026234719381309807
4.148998998999,-0.04536317150292909,-0.04549119605957243,0.026318837490317534
4.1494994994995,-0.04508198205022093,-0.04520912454587791,0.026403086461608678
4.15,-0.04479931900370638,-0.0449255553254073,0.026487460759488032
