interval,roll_off,rating,rating_se,rating_boot_mean,rating_boot_se
0,12,0.9936710213757409,0,0.992652562412534,0.06664247550379351
0.015015015015015015,12,0.9878562098477435,0,0.9867945389311711,0.06568066389487714
0.03003003003003003,12,0.9814268845655308,0,0.9803150101123579,0.0647748857023539
0.04504504504504504,12,0.9743481065100512,0,0.9731785993243335,0.06393239084085542
0.06006006006006006,12,0.9665848887224441,0,0.9653499388391196,0.06316058884979928
0.07507507507507508,12,0.9581025563869967,0,0.9567940478673194,0.06246692969206223
0.09009009009009009,12,0.9488671624298393,0,0.9474767673236162,0.06185875174588613
0.10510510510510511,12,0.9388459591599021,0,0.9373652512863071,0.06134309485767838
0.12012012012012012,12,0.9280079245984388,0,0.9264285130362278,0.06092647850186097
0.13513513513513514,12,0.9163243398645634,0,0.9146380210803269,0.060614648140939725
0.15015015015015015,12,0.9037694113447735,0,0.9019683377391077,0.06041229667668364
0.16516516516516516,12,0.8903209284523794,0,0.8883977898070164,0.06032277211311444
0.18018018018018017,12,0.875960944703086,0,0.8739091576334865,0.060347786689055126
0.19519519519519518,12,0.8606764667697178,0,0.8584903659225966,0.06048714610604963
0.21021021021021022,12,0.8444601333506218,0,0.8421351568577305,0.06073851937000924
0.22522522522522523,12,0.8273108633481181,0,0.8248437240993047,0.06109726961069384
0.24024024024024024,12,0.8092344512781083,0,0.806623285059924,0.06155636376963656
0.2552552552552553,12,0.7902440872849924,0,0.7874885688880991,0.062106374382992616
0.2702702702702703,12,0.7703607798452125,0,0.767462198985799,0.0627355803588667
0.2852852852852853,12,0.7496136613602656,0,0.7465749517455734,0.06343016647368131
0.3003003003003003,12,0.7280401604112285,0,0.7248658774909206,0.06417451420653457
0.3153153153153153,12,0.7056860293797597,0,0.7023822751596603,0.06495157032249532
0.3303303303303303,12,0.6826052221900261,0,0.6791795187481161,0.06574327490524132
0.34534534534534533,12,0.6588596236952482,0,0.6553207404570337,0.0665310276419414
0.36036036036036034,12,0.6345186391928208,0,0.6308763822632824,0.06729617013123068
0.37537537537537535,12,0.6096586590849883,0,0.6059236336478065,0.06802046267465912
0.39039039039039036,12,0.5843624191598485,0,0.5805457778169959,0.0686865361597982
0.40540540540540543,12,0.5587182807430418,0,0.5548314714265447,0.06927830292815351
0.42042042042042044,12,0.5328194565736943,0,0.5288739831745671,0.06978131460273762
0.43543543543543545,12,0.5067632073822038,0,0.5027704145064039,0.07018305938698435
0.45045045045045046,12,0.4806500307239325,0,0.4766209211472038,0.07047319600271237
0.46546546546546547,12,0.45458285784991204,0,0.4505279475883635,0.07064372588100881
0.4804804804804805,12,0.4286662667446361,0,0.42459547858436847,0.07068910913364627
0.4954954954954955,12,0.40300571065238366,0,0.3989283029595609,0.07060633289651255
0.5105105105105106,12,0.37770675237127,0,0.3736312765226052,0.070394942538294
0.5255255255255256,12,0.35287428637659257,0,0.3488085636593895,0.07005704666745603
0.5405405405405406,12,0.3286117245487155,0,0.32456283223235455,0.06959730558409209
0.5555555555555556,12,0.30502011797938805,0,0.30099437465894296,0.06902290963002754
0.5705705705705706,12,0.28219718790233217,0,0.27820013016903605,0.06834354877223044
0.5855855855855856,12,0.26023624384097804,0,0.25627258963539995,0.06757136795622042
0.6006006006006006,12,0.23922497678441798,0,0.23529857501233858,0.0667208949018936
0.6156156156156156,12,0.21924412927562423,0,0.21535789980850517,0.06580891914397832
0.6306306306306306,12,0.20036606182349662,0,0.19652193414978503,0.0648542947590564
0.6456456456456456,12,0.18265325453449957,0,0.17885211635404344,0.06387763624623942
0.6606606606606606,12,0.16615680227745158,0,0.16239847063699064,0.06290087943786227
0.6756756756756757,12,0.15091497867019413,0,0.14719820546365167,0.061946688827682894
0.6906906906906907,12,0.1369519562561913,0,0.13327447703542444,0.06103771017507694
0.7057057057057057,12,0.12427677524447703,0,0.1206354056529173,0.06019569196945708
0.7207207207207207,12,0.11288264959291217,0,0.10927342802953993,0.05944052839459606
0.7357357357357357,12,0.10274668648127956,0,0.09916505573006444,0.05878930440832263
0.7507507507507507,12,0.09383007399176577,0,0.090271089468746,0.05825544314775372
0.7657657657657657,12,0.08607876393180376,0,0.08253731272943728,0.05784805967008461
0.7807807807807807,12,0.07942464502948568,0,0.07589565860096378,0.05757160826986992
0.7957957957957957,12,0.07378716962405353,0,0.07026581388370447,0.05742587383704396
0.8108108108108109,12,0.06907536794619167,0,0.06555719750485532,0.05740630792292882
0.8258258258258259,12,0.06519016114316907,0,0.061671228772288963,0.057504659145083424
0.8408408408408409,12,0.0620268694439314,0,0.05850378691619712,0.0577098078289681
0.8558558558558559,12,0.05947780619642887,0,0.05594775761641922,0.058008695102457375
0.8708708708708709,12,0.05743485165278507,0,0.05389556462756555,0.058387239196525546
0.8858858858858859,12,0.055791911003612984,0,0.0522415940893427,0.05883115224015266
0.9009009009009009,12,0.054447177239616056,0,0.050884433865110025,0.05932660135905033
0.9159159159159159,12,0.05330513860004498,0,0.04972886816634299,0.05986068993394873
0.9309309309309309,12,0.05227829036617005,0,0.04868758666879106,0.06042176203485127
0.9459459459459459,12,0.05128852963816011,0,0.04768258545534562,0.0609995519672207
0.960960960960961,12,0.0502682280891639,0,0.046646253034456304,0.06158521096813925
0.975975975975976,12,0.04916099070143322,0,0.04552214751812942,0.06217124565797306
0.990990990990991,12,0.047922117882495216,0,0.044265480454487124,0.06275140003824825
1.006006006006006,12,0.046518794300364825,0,0.042843328885622846,0.06332050690366858
1.021021021021021,12,0.04493003073334552,0,0.04123460034623223,0.06387432746756415
1.0360360360360361,12,0.043146385834405714,0,0.03942977632367197,0.06440939125226934
1.0510510510510511,12,0.041169493642615344,0,0.03743045882952396,0.06492284281338413
1.0660660660660661,12,0.0390114205771779,0,0.03524874283296098,0.06541229812219745
1.0810810810810811,12,0.036693873076131395,0,0.032906434946801386,0.06587571150583339
1.0960960960960962,12,0.0342472744328304,0,0.030434136399112917,0.06631125372112061
1.1111111111111112,12,0.03170972706797304,0,0.027870206310101668,0.06671720258650439
1.1261261261261262,12,0.029125874684192036,0,0.025259619858811505,0.06709184906704983
1.1411411411411412,12,0.026545677636742208,0,0.02265273520470401,0.0674334232192733
1.1561561561561562,12,0.02402311451077215,0,0.02010398308648028,0.06774004542570232
1.1711711711711712,12,0.021614823370410156,0,0.017670493854959526,0.06800970847894815
1.1861861861861862,12,0.019378697444367696,0,0.015410678260153231,0.06824029508559318
1.2012012012012012,12,0.01737245210048037,0,0.013382780513825515,0.06842963323123444
1.2162162162162162,12,0.015652182747293814,0,0.011643424854468067,0.06857558876112566
1.2312312312312312,12,0.014270936626131107,0,0.010246179872413478,0.06867619083444838
1.2462462462462462,12,0.013277325081658705,0,0.009240167978155715,0.06872978206153997
1.2612612612612613,12,0.012714206492508626,0,0.00866875033146359,0.06873518162944096
1.2762762762762763,12,0.012617473189328446,0,0.008568319954527214,0.06869184703278548
1.2912912912912913,12,0.013014977902561292,0,0.008967237250056739,0.06860001854737857
1.3063063063063063,12,0.013925636055568078,0,0.009884942338721194,0.06846083059524782
1.3213213213213213,12,0.015358739069156703,0,0.011331277143766727,0.0682763758082507
1.3363363363363363,12,0.017313510390192778,0,0.013306046678368594,0.0680497109231495
1.3513513513513513,12,0.019778929993527178,0,0.015798843354348037,0.06778479850969114
1.3663663663663663,12,0.02273384466755738,0,0.018789150332812813,0.06748638465590051
1.3813813813813813,12,0.026147370796876193,0,0.022246730207077244,0.0671598196350388
1.3963963963963963,12,0.029979584206901003,0,0.026132294119421414,0.06681083557819138
1.4114114114114114,12,0.03418247879096513,0,0.030398434468532437,0.06644530141439974
1.4264264264264264,12,0.0387011631211627,0,0.03499079254096904,0.06606897985002706
1.4414414414414414,12,0.043475253116542704,0,0.03984942165761093,0.06568731301417927
1.4564564564564564,12,0.04844041007942464,0,0.04491029768992476,0.06530526191155087
1.4714714714714714,12,0.05352996776074879,0,0.05010692283631506,0.06492721976166839
1.4864864864864864,12,0.05867658999872428,0,0.0553719658515607,0.06455701102703519
1.5015015015015014,12,0.06381390193016878,0,0.060638882645427925,0.06419797742760357
1.5165165165165164,12,0.06887804246273542,0,0.06584346509932157,0.06385314097655405
1.5315315315315314,12,0.07380909296523468,0,0.07092527255363375,0.06352542373335972
1.5465465465465464,12,0.0785523461189386,0,0.07582890891240514,0.06321789610321342
1.5615615615615615,12,0.08305938862974396,0,0.0805051177917516,0.06293402122819611
1.5765765765765765,12,0.0872889811311788,0,0.0849116777059986,0.06267786280568337
1.5915915915915915,12,0.09120772736843025,0,0.08901408816530333,0.06245422738190692
1.6066066066066067,12,0.09479053212983882,0,0.09278604518458951,0.06226871912845539
1.6216216216216217,12,0.09802085313156388,0,0.09620971076391366,0.062127694314423484
1.6366366366366367,12,0.10089075616302158,0,0.09927578533902322,0.06203811300630383
1.6516516516516517,12,0.10340078547656895,0,0.10198339518286025,0.06200729585188011
1.6666666666666667,12,0.10555966301353065,0,0.10433980858824479,0.0620426031278908
1.6816816816816818,12,0.10738383103145875,0,0.106359995786847,0.06215106068913057
1.6966966966966968,12,0.10889685346317311,0,0.10806604837486235,0.06233896235163263
1.7117117117117118,12,0.11012869225586354,0,0.10948647487615923,0.06261148009542052
1.7267267267267268,12,0.11111487624677531,0,0.11065539022200985,0.06297231210221017
1.7417417417417418,12,0.11189558191663716,0,0.11161161846379981,0.06342339425156884
1.7567567567567568,12,0.11251464754742226,0,0.11239772991234773,0.0639646939048649
1.7717717717717718,12,0.11301854467337547,0,0.11305903592950578,0.06459409658963951
1.7867867867867868,12,0.11345533291633236,0,0.11364256649587849,0.06530738773176158
1.8018018018018018,12,0.11387362593919097,0,0.11419605709689191,0.0660983239984417
1.8168168168168168,12,0.11432159693643437,0,0.114766972059307,0.06695878296141476
1.8318318318318318,12,0.11484605147405362,0,0.11540159093419214,0.06787897608402155
1.8468468468468469,12,0.11549159338099718,0,0.11614418266211309,0.0688477084444114
1.8618618618618619,12,0.11629990573052823,0,0.11703628900670279,0.06985266874966338
1.8768768768768769,12,0.11730916386251082,0,0.11811613418810714,0.07088073452532034
1.8918918918918919,12,0.11855359118736974,0,0.11941817201778679,0.0719182793474963
1.906906906906907,12,0.12006316161679863,0,0.12097277548281113,0.0729514712225771
1.921921921921922,12,0.12186344540629417,0,0.12280606708684598,0.07396655349289612
1.936936936936937,12,0.12397558851140734,0,0.1249398817973524,0.07495010188483073
1.951951951951952,12,0.1264164097506396,0,0.12739184862907288,0.07588925352677596
1.966966966966967,12,0.12919859553380864,0,0.13017557210526876,0.07677190596169939
1.981981981981982,12,0.13233096892240184,0,0.13330089137480736,0.07758688632816994
1.996996996996997,12,0.13581880845556968,0,0.13677419280013517,0.07832409288336205
2.012012012012012,12,0.1396641924745759,0,0.14059875141899913,0.07897461273316925
2.027027027027027,12,0.14386634645761517,0,0.1447750777566811,0.07953082083253402
2.042042042042042,12,0.14842197389006329,0,0.1493012488656853,0.07998646584658556
2.057057057057057,12,0.15332555513774357,0,0.15417320596721695,0.08033674818461263
2.0720720720720722,12,0.15856960333197462,0,0.15938500539230224,0.08057839436423907
2.0870870870870872,12,0.16414487108581768,0,0.1649290143799745,0.08070972984293028
2.1021021021021022,12,0.17004050663294312,0,0.17079604839402518,0.08073074966822007
2.1171171171171173,12,0.17624416243892765,0,0.17697545168553452,0.08064318294198147
2.1321321321321323,12,0.1827420632441491,0,0.183455127586349,0.08045054346220154
2.1471471471471473,12,0.18951904366421116,0,0.1902215292144737,0.08015815539357818
2.1621621621621623,12,0.19655856774865946,0,0.19725962466883112,0.07977313991747981
2.1771771771771773,12,0.2038427441781392,0,0.20455285317381647,0.07930434709081118
2.1921921921921923,12,0.21135235101206676,0,0.21208308982443358,0.0787622172046161
2.2072072072072073,12,0.2190668830870781,0,0.21983063645434828,0.07815855833734846
2.2222222222222223,12,0.2269646333772903,0,0.2277742546518364,0.0775062319497065
2.2372372372372373,12,0.23502281699140537,0,0.2358912541301961,0.07681874637046449
2.2522522522522523,12,0.24321774319244768,0,0.24415764568234744,0.0761097685182998
2.2672672672672673,12,0.251525037129875,0,0.25254836309458983,0.07539257624868734
2.2822822822822824,12,0.25991990915384555,0,0.26103755304655796,0.07467948574282585
2.2972972972972974,12,0.26837746593175327,0,0.26959892663866514,0.0739812983091284
2.3123123123123124,12,0.27687305438614374,0,0.27820616124134423,0.0733068166238645
2.3273273273273274,12,0.2853826269534717,0,0.286833337291469,0.07266247991540598
2.3423423423423424,12,0.2938831149884901,0,0.29545539181596947,0.0720521599325788
2.3573573573573574,12,0.3023527963871741,0,0.3040485690486694,0.07147714513385184
2.3723723723723724,12,0.3107716436601553,0,0.31259084857142205,0.07093632127541372
2.3873873873873874,12,0.31912163966375273,0,0.32106233284568597,0.07042653549914221
2.4024024024024024,12,0.3273870498280502,0,0.32944557856629597,0.06994311159200736
2.4174174174174174,12,0.33555464181268485,0,0.3377258596398137,0.06948046932373679
2.4324324324324325,12,0.3436138458630053,0,0.34589135340556537,0.0690327925201386
2.4474474474474475,12,0.35155685153954724,0,0.35393324563265177,0.06859468916872442
2.4624624624624625,12,0.3593786387978016,0,0.3618457535492809,0.06816179144060229
2.4774774774774775,12,0.3670769434975226,0,0.3696260694763161,0.06773125230296503
2.4924924924924925,12,0.3746521592688663,0,0.37727423041351243,0.06730210646227204
2.5075075075075075,12,0.3821071792497716,0,0.38479292110894686,0.06687547511918132
2.5225225225225225,12,0.3894471825616012,0,0.39218721973260995,0.0664546054270592
2.5375375375375375,12,0.3966793715502426,0,0.3994642963145325,0.0660447462224644
2.5525525525525525,12,0.4038126668266579,0,0.406633074653125,0.06565287154412307
2.5675675675675675,12,0.4108573680152145,0,0.41370386850873403,0.06528727280153854
2.5825825825825826,12,0.41782478885264096,0,0.42068800262198885,0.06495704914953179
2.5975975975975976,12,0.42472687583656754,0,0.4275974284785794,0.06467153325013715
2.6126126126126126,12,0.4315758199363318,0,0.43444434382031527,0.06443969531151751
2.6276276276276276,12,0.438383670873712,0,0.4412408237187633,0.0642695709487175
2.6426426426426426,12,0.4451619630868136,0,0.44799846963541806,0.06416775690420326
2.6576576576576576,12,0.4519213616614268,0,0.45472808136054044,0.06413901233795662
2.6726726726726726,12,0.45867133524919557,0,0.46143935513681367,0.06418599242697572
2.6876876876876876,12,0.4654198613432882,0,0.4681406097311109,0.06430912661201056
2.7027027027027026,12,0.4721731673589542,0,0.4748385408182782,0.06450663810622706
2.7177177177177176,12,0.4789355089243364,0,0.4815380028772594,0.06477468679644091
2.7327327327327327,12,0.4857089848126439,0,0.4882418169458184,0.06510760679247515
2.7477477477477477,12,0.4924933862319618,0,0.4949506020823568,0.06549820419333631
2.7627627627627627,12,0.49928607690573534,0,0.5016626282581649,0.06593808057800922
2.7777777777777777,12,0.5060818996554806,0,0.5083736886378908,0.06641795258835671
2.7927927927927927,12,0.5128731051093804,0,0.5150769897634571,0.06692794620584935
2.8078078078078077,12,0.519649298713974,0,0.5217630589851767,0.06745785400907198
2.8228228228228227,12,0.5263974033669239,0,0.5284196695249384,0.067997352991791
2.8378378378378377,12,0.5331016366112575,0,0.5350317847513385,0.0685361879942627
2.8528528528528527,12,0.5397435032921654,0,0.5415815245406601,0.0690643306084364
2.8678678678678677,12,0.5463018067124916,0,0.5480481579378249,0.06957212531097587
2.8828828828828827,12,0.5527526834601743,0,0.5544081276639478,0.0700504338054167
2.8978978978978978,12,0.5590696690517358,0,0.5606351132785964,0.07049078570912733
2.9129129129129128,12,0.5652238031807802,0,0.5667001409164697,0.07088553956972427
2.9279279279279278,12,0.5711837845314737,0,0.5725717483781766,0.0712280535295344
2.942942942942943,12,0.5769161856784144,0,0.5782162148363306,0.07151286047288893
2.957957957957958,12,0.582385738422606,0,0.583597864370689,0.07173583872456339
2.972972972972973,12,0.5875556988989087,0,0.5886794518047617,0.07189436666844568
2.987987987987988,12,0.5923882998451416,0,0.59342263771642,0.07198744820344308
3.003003003003003,12,0.5968452944899305,0,0.5977885568962618,0.07201579579837021
3.018018018018018,12,0.6008885925871684,0,0.6017384808420674,0.07198185901553468
3.033033033033033,12,0.6044809842601484,0,0.6052345701031744,0.07188978866608614
3.048048048048048,12,0.607586941668203,0,0.6082407065403689,0.0717453301354932
3.063063063063063,12,0.6101734823323461,0,0.61072338910263535,0.07155564373886608
3.078078078078078,12,0.6122110716299697,0,0.6126526699538769,0.07132905503467551
3.093093093093093,12,0.613674535980215,0,0.6140031012684144,0.07107474353829055
3.108108108108108,12,0.6145439531656132,0,0.6147546574208298,0.07080238378931962
3.123123123123123,12,0.6148054826841373,0,0.61489359333843,0.07052175764770682
3.138138138138138,12,0.6144520975793075,0,0.6144131981364048,0.07024236032966771
3.153153153153153,12,0.6134841803203612,0,0.613314404347483,0.06997302435788023
3.168168168168168,12,0.6119099492628933,0,0.611606217375722,0.06972158476740183
3.183183183183183,12,0.6097456890010706,0,0.6093059372115482,0.06949460539635319
3.198198198198198,12,0.6070157671965445,0,0.6064391545417351,0.06929718018986684
3.2132132132132134,12,0.6037524315898838,0,0.6030395154249364,0.06913281595433299
3.2282282282282284,12,0.5999953929586347,0,0.5991482616540434,0.06900339510762496
3.2432432432432434,12,0.5957912117084458,0,0.5948135666109493,0.06890921001650364
3.2582582582582584,12,0.5911925164699776,0,0.5900896976553882,0.06884905565460532
3.2732732732732734,12,0.5862570915404591,0,0.5850360448522398,0.06882036523865774
3.2882882882882885,12,0.5810468755213134,0,0.5797160613963717,0.06881937424594553
3.3033033033033035,12,0.5756269156682698,0,0.5741961630804532,0.0688413011883719
3.3183183183183185,12,0.5700643212727504,0,0.5685446326096042,0.06888053768281334
3.3333333333333335,12,0.5644272551735435,0,0.5628305699007268,0.0689308445411217
3.3483483483483485,12,0.5587839958799637,0,0.557122922394849,0.06898555380833588
3.3633633633633635,12,0.5532020945726708,0,0.5514896207024804,0.06903777830789207
3.3783783783783785,12,0.5477476422966061,0,0.5459968354812554,0.06908063019606464
3.3933933933933935,12,0.5424846537825123,0,0.5407083621345831,0.06910744859431313
3.4084084084084085,12,0.5374745662090387,0,0.5356851314001398,0.06911203412181044
3.4234234234234235,12,0.5327758443438757,0,0.5309848366619913,0.06908888570576636
3.4384384384384385,12,0.5284436781837981,0,0.5266616631689461,0.06903343289463462
3.4534534534534536,12,0.5245297555712407,0,0.5227661003938393,0.06894225530437255
3.4684684684684686,12,0.52108209027595,0,0.5193448164998812,0.06881327981797986
3.4834834834834836,12,0.5181448855653935,0,0.5164405731651336,0.0686459455838783
3.4984984984984986,12,0.5157584141591137,0,0.5140921596703127,0.06844132649799685
3.5135135135135136,12,0.5139588974550783,0,0.5123343269706774,0.06820220053148203
3.5285285285285286,12,0.512778369815231,0,0.5111977052434157,0.06793305494994864
3.5435435435435436,12,0.5122445172968594,0,0.5107086919359083,0.06764001634150321
3.5585585585585586,12,0.5123804843212447,0,0.5108893014607419,0.06733069483977479
3.5735735735735736,12,0.5132046461885713,0,0.5117569722206916,0.06701393359848859
3.5885885885885886,12,0.5147303498763799,0,0.5133243314243544,0.0666994581399622
3.6036036036036037,12,0.5169656299760663,0,0.5155989229714268,0.06639742627192068
3.6186186186186187,12,0.5199129106808477,0,0.5185829083135312,0.06611788813270202
3.6336336336336337,12,0.5235687081718109,0,0.5222727543627572,0.06587017728000817
3.6486486486486487,12,0.5279233502838562,0,0.5266589259307688,0.06566226646833048
3.6636636636636637,12,0.5329607317231568,0,0.5317256025373177,0.06550013388722399
3.6786786786786787,12,0.5386581231647467,0,0.5374504404623417,0.06538719454637465
3.6936936936936937,12,0.5449860511968402,0,0.5438044004405813,0.06532385451313226
3.7087087087087087,12,0.5519082633450272,0,0.5507516593426068,0.06530724088234335
3.7237237237237237,12,0.5593817885067205,0,0.5582496206386526,0.0653311472426919
3.7387387387387387,12,0.5673570984070251,0,0.5662490336624746,0.0653862144753833
3.7537537537537538,12,0.5757783706272395,0,0.5746942261077388,0.06546034317251043
3.7687687687687688,12,0.5845838489010726,0,0.5835234483536432,0.06553931087763898
3.7837837837837838,12,0.593706292262694,0,0.5926693227485229,0.0656075485593144
3.798798798798799,12,0.6030735017269484,0,0.602059386482681,0.06564901879220629
3.813813813813814,12,0.6126089117967082,0,0.6116167136545242,0.06564813383295516
3.828828828828829,12,0.6222322343395859,0,0.6212606008984668,0.06559065427629739
3.843843843843844,12,0.6318601441526214,0,0.6309073015897655,0.06546451631863716
3.858858858858859,12,0.6414069985342352,0,0.6404707960127599,0.06526054554511114
3.873873873873874,12,0.6507855869425366,0,0.6498635885863654,0.06497302555509511
3.888888888888889,12,0.6599079107766714,0,0.6589975277162787,0.064600099226923835
3.903903903903904,12,0.6686859968862349,0,0.6677846484142931,0.06414398828817677
3.918918918918919,12,0.6770327510475628,0,0.6761380417966252,0.06361102304231743
3.933933933933934,12,0.6848628588988896,0,0.6839727583122498,0.06301147904720487
3.948948948948949,12,0.6920937413907098,0,0.6912067525552419,0.06235922203537744
3.963963963963964,12,0.6986465695362252,0,0.6977618764595847,0.061671167401388415
3.978978978978979,12,0.7044473391610779,0,0.7035649244479806,0.06096656718933152
3.993993993993994,12,0.7094280006375389,0,0.7085487288162837,0.06026614654372017
4.009009009009009,12,0.7135276315835847,0,0.7126532966035445,0.0595911233905212
4.024024024024024,12,0.7166936326821083,0,0.7158269709389005,0.058962159153309254
4.039039039039039,12,0.718882918709607,0,0.7180275910449878,0.058398302801556744
4.054054054054054,12,0.7200630692142903,0,0.7192236165024415,0.057916002367237325
4.069069069069069,12,0.7202133967485502,0,0.71939517388943,0.0575282632670557
4.084084084084084,12,0.7193258858314078,0,0.7185349783445123,0.057244027579058485
4.099099099099099,12,0.7174059535228408,0,0.7166490797163537,0.05706783088563925
4.114114114114114,12,0.7144729831416232,0,0.7137573833547994,0.05699976461539107
4.129129129129129,12,0.7105605865768565,0,0.7098938996212063,0.05703573672414781
4.1441441441441444,12,0.7057165579195718,0,0.705106683912335,0.05716798917811087
4.1591591591591595,12,0.7000024915877489,0,0.699457440128757,0.057385804254019325
4.1741741741741745,12,0.6934930512614774,0,0.6930207744694462,0.05767631801328601
4.1891891891891895,12,0.6862748910361522,0,0.6858831022958252,0.05802535953965087
4.2042042042042045,12,0.6784452462707542,0,0.6781412274581011,0.05841824618399961
4.2192192192192195,12,0.6701102275417745,0,0.6699006296790007,0.05884048354716965
4.2342342342342345,12,0.6613828657598219,0,0.6612735101244819,0.059278339373021564
4.2492492492492495,12,0.6523809687882931,0,0.6523766570794348,0.05971927913082181
4.2642642642642645,12,0.6432248589303928,0,0.6433292018642902,0.06015226570533043
4.2792792792792795,12,0.6340350658056211,0,0.6342503392832194,0.06056793566687542
4.2942942942942945,12,0.6249300501369892,0,0.6252570868614664,0.060958670452205786
4.3093093093093096,12,0.6160240308834442,0,0.616462153140278,0.061318583304258344
4.324324324324325,12,0.6074249813753628,0,0.6079719778910462,0.06164344291911071
4.33933933933934,12,0.5992328503088357,0,0.5998849970453531,0.061930553222401104
4.354354354354355,12,0.5915380514758692,0,0.5922901732973097,0.06217860615040783
4.36936936936937,12,0.5844202528851089,0,0.5852658206221909,0.062387521189059256
4.384384384384385,12,0.577947482383226,0,0.5788787382050491,0.06255828206726233
4.3993993993994,12,0.5721755538481414,0,0.573183657183301,0.06269277768710613
4.414414414414415,12,0.5671478061630157,0,0.5682229927010825,0.06279365134282636
4.42942942942943,12,0.5628951369782573,0,0.5640268843887292,0.06286415973833061
4.444444444444445,12,0.5594363050133982,0,0.5606135006856449,0.06290804141776563
4.45945945945946,12,0.556778468447078,0,0.5579895764498547,0.06292939306620983
4.474474474474475,12,0.5549179227461795,0,0.5561511489781746,0.06293255172480854
4.48948948948949,12,0.5538409989399494,0,0.5550844547800189,0.062921981212827785
4.504504504504505,12,0.5535250826289729,0,0.5547669480701664,0.06290216179554291
4.51951951951952,12,0.5539397146805353,0,0.5551684018414678,0.06287748316880408
4.534534534534535,12,0.5550477363489379,0,0.556252053432214,0.06285214192528188
4.54954954954955,12,0.5568064442405765,0,0.5579757586112398,0.06283004562950349
4.564564564564565,12,0.5591687239162146,0,0.5602931212643016,0.06281472632164853
4.57957957957958,12,0.5620841348160168,0,0.5631545696611338,0.06280926662376478
4.594594594594595,12,0.5654999234602786,0,0.5665083548703591,0.06281624162573371
4.60960960960961,12,0.5693619463921435,0,0.5703014519917695,0.06283767940978796
4.624624624624625,12,0.5736154889681985,0,0.574480350281751,0.06287504247435186
4.63963963963964,12,0.578205970752015,0,0.5789917237247654,0.0629292314792979
4.654654654654655,12,0.5830795328057731,0,0.5837829789118687,0.06300061168192303
4.66966966966967,12,0.5881835064875992,0,0.5888026820001525,0.06308906118371731
4.684684684684685,12,0.5934667673306206,0,0.5940008708519507,0.06319403868407475
4.6996996996997,12,0.5988799810953519,0,0.5993292620451366,0.06331466688286985
4.714714714714715,12,0.6043757520556121,0,0.6047413652185494,0.0634498260743056
4.72972972972973,12,0.6099086859242621,0,0.6101925191394373,0.06359825096697826
4.744744744744745,12,0.6154353814981961,0,0.6156398649735556,0.06375862253940423
4.75975975975976,12,0.6209143660767362,0,0.621042272563148,0.06392964602366219
4.774774774774775,12,0.6263059899867098,0,0.6263602351585751,0.06411010613753058
4.78978978978979,12,0.6315722951592686,0,0.6315557471029755,0.06429889165897591
4.804804804804805,12,0.6366768717019997,0,0.6365921775357075,0.06449498347611624
4.81981981981982,12,0.6415847148718545,0,0.6414341513558011,0.06469740334394385
4.834834834834835,12,0.6462620928788035,0,0.6460474465640204,0.06490512456798697
4.84984984984985,12,0.6506764336551962,0,0.6503989147739478,0.06511695037182982
4.864864864864865,12,0.6547962362479322,0,0.6544564292469182,0.06533137028831437
4.87987987987988,12,0.6585910099803113,0,0.6581888623710169,0.06554640893389067
4.894894894894895,12,0.6620312421465028,0,0.6615660921936459,0.06575948435075615
4.90990990990991,12,0.6650883929051974,0,0.6645590355656688,0.06596729418990015
4.924924924924925,12,0.6677349143804329,0,0.6671397038048903,0.06616574702262845
4.93993993993994,12,0.6699442898865952,0,0.6692812756738681,0.06634995296809487
4.954954954954955,12,0.6716910887641696,0,0.6709581820069255,0.06651428290614923
4.96996996996997,12,0.6729510325887549,0,0.6721461965887225,0.066652499410344
4.984984984984985,12,0.67370106948321,0,0.6728225288997288,0.06675795599084314
5,12,0.6739194548441426,0,0.6729659160497135,0.06682385514046164
5.015015015015015,12,0.6735858388447739,0,0.6725567134892745,0.06684355078057107
5.03003003003003,12,0.6726813633959668,0,0.6715769867172656,0.06681087751965976
5.045045045045045,12,0.6711887735890014,0,0.6700106089223811,0.06672048786688846
5.06006006006006,12,0.6690925507334391,0,0.6678433720015454,0.06656817907181209
5.075075075075075,12,0.6663790756607791,0,0.6650631203621151,0.06635119321518679
5.09009009009009,12,0.6630368317235851,0,0.6616599180286431,0.06606847701110219
5.105105105105105,12,0.659056656650934,0,0.6576262595693911,0.06572089088778628
5.12012012012012,12,0.654432050950392,0,0.6529573340327086,0.06531135971242497
5.135135135135135,12,0.64915954777311,0,0.6476513483274217,0.06484495954157868
5.15015015015015,12,0.6432391450700743,0,0.6417099122904955,0.06432893571375292
5.165165165165165,12,0.6366747955561407,0,0.6351384821758519,0.06377264738410014
5.18018018018018,12,0.6294749436739892,0,0.6279468527171925,0.06318743244479108
5.195195195195195,12,0.6216530917514089,0,0.6201496806494879,0.0625863852179084
5.21021021021021,12,0.613228370344832,0,0.6117670151382523,0.06198403824012768
5.225225225225225,12,0.6042260809603041,0,0.6028248036082637,0.061395940079208615
5.24024024024024,12,0.5946781736450836,0,0.5933553357232817,0.06083812478673083
5.255255255255255,12,0.5846236181123244,0,0.5833975845289854,0.060326476491619554
5.27027027027027,12,0.5741086258480438,0,0.5729974027812145,0.05987600530841926
5.285285285285285,12,0.5631866826936462,0,0.5622075348537726,0.05950006746042004
5.3003003003003,12,0.5519183571173008,0,0.5510874107192527,0.05920958088318223
5.315315315315315,12,0.5403708588675953,0,0.5397026983293088,0.059012303458391126
5.33033033033033,12,0.5286173356059198,0,0.5281246038570453,0.05891224937172998
5.345345345345345,12,0.5167359106391509,0,0.5164289248108526,0.05890931544214495
5.36036036036036,12,0.5048084817858733,0,0.504694877677617,0.05899917167540595
5.375375375375375,12,0.4929193181456972,0,0.49300373791027635,0.05917344063236905
5.39039039039039,12,0.481153506395247,0,0.4814373440569963,0.05942015415603193
5.405405405405405,12,0.46959530958854706,0,0.47007652810385603,0.059724441408101604
5.42042042042042,12,0.45832650800670804,0,0.4589995395177308,0.060069376400489365
5.435435435435435,12,0.44742479263347057,0,0.44828053044508354,0.06043690082575472
5.45045045045045,12,0.43696227724378234,0,0.43798816411735286,0.060808739664129856
5.465465465465465,12,0.4270041854776479,0,0.42818439844920547,0.06116724005063942
5.48048048048048,12,0.41760775581249654,0,0.41892348332988577,0.0614960836264123
5.495495495495495,12,0.408821391622711,0,0.41025119476261285,0.06178084429237763
5.51051051051051,12,0.4006840672593809,0,0.40220431345580493,0.062009383169067275
5.525525525525525,12,0.39322498594103933,0,0.3948103412319714,0.06217208838714225
5.54054054054054,12,0.38646347256259317,0,0.3880874369008659,0.062261978243269366
5.555555555555555,12,0.38040907521564155,0,0.38204454482701794,0.06227469241958766
5.57057057057057,12,0.3750618436885266,0,0.376681684635394,0.062208398104168935
5.585585585585585,12,0.37041275143097163,0,0.37199036924745316,0.062063636882191256
5.6006006006006,12,0.3664442289896066,0,0.36795412028356744,0.06184313508113862
5.615615615615615,12,0.3631307810341617,0,0.36454905412715355,0.061551595605391
5.63063063063063,12,0.3604396649319881,0,0.3617445178081045,0.06119548379785107
5.645645645645645,12,0.35833161547583986,0,0.3595037604781518,0.060782814020263976
5.66066066066066,12,0.3567616069538261,0,0.35778463280652195,0.06032293789754583
5.675675675675675,12,0.3556796495018254,0,0.35654031240105655,0.059826329976111536
5.6906906906906904,12,0.35503162097485785,0,0.3557200577665685,0.059304362398545175
5.7057057057057055,12,0.3547601379632729,0,0.3552699959097963,0.05876905765084792
5.7207207207207205,12,0.3548054698014957,0,0.3551339492194162,0.058232808071139
5.7357357357357355,12,0.3551064974135998,0,0.35525430560563825,0.05770805312749835
5.7507507507507505,12,0.35560171476931746,0,0.3555729321903435,0.05720691075780053
5.7657657657657655,12,0.35623026496381527,0,0.3560321274157554,0.05674076716481649
5.7807807807807805,12,0.35693299607534457,0,0.35657559981210796,0.05631983959397693
5.7957957957957955,12,0.3576535147705071,0,0.3571494545407835,0.055952737274347575
5.8108108108108105,12,0.3583392090182923,0,0.35770316205286035,0.0556460547304767
5.8258258258258255,12,0.3589422061797561,0,0.3581904776756477,0.05540403668471046
5.8408408408408405,12,0.3594202300229979,0,0.3585702775171201,0.05522835277767483
5.8558558558558556,12,0.3597373205312344,0,0.3588072754486129,0.0551180124789981
5.870870870870871,12,0.35986438406064386,0,0.35887258849460624,0.05506943662616441
5.885885885885886,12,0.35977954839090664,0,0.3587441237555658,0.05507668446276605
5.900900900900901,12,0.3594683069842898,0,0.3584067686325322,0.05513181736365367
5.915915915915916,12,0.3589234484243482,0,0.35785237683850807,0.0552253661950481
5.930930930930931,12,0.35814477935775485,0,0.3570795544042034,0.05534686101851184
5.945945945945946,12,0.35713866101607344,0,0.3560932613999556,0.0554853804995977
5.960960960960961,12,0.3559173893315087,0,0.35490425521696506,0.0556300831046874
5.975975975975976,12,0.3544984558239213,0,0.35352840899645843,0.05577069093003825
5.990990990990991,12,0.3529037302558479,0,0.3519859435173364,0.05589790732375303
6.006006006006006,12,0.3511586064059554,0,0.3503006123105029,0.05600375911628371
6.021021021021021,12,0.34929114950698076,0,0.34849887812890507,0.05608186176408538
6.036036036036036,12,0.347331278582094,0,0.3466091146778641,0.05612761037862924
6.051051051051051,12,0.34531000995939476,0,0.3446608614472154,0.056138301540218226
6.066066066066066,12,0.34325878058172515,0,0.34268415243654027,0.05611319056083783
6.081081081081081,12,0.3412088622293486,0,0.34070893235765987,0.05605348728020059
6.096096096096096,12,0.33919087114225155,0,0.33876456724177634,0.055962291406158805
6.111111111111111,12,0.3372343722474717,0,0.33687945078947773,0.05584446660305786
6.126126126126126,12,0.33536757350178453,0,0.33508070357808656,0.05570645159505735
6.141141141141141,12,0.3336171037592217,0,0.3333939594662995,0.0555560069232101
6.156156156156156,12,0.33200786688569855,0,0.3318432321093948,0.05540189793978754
6.171171171171171,12,0.33056296525291345,0,0.3304508541800421,0.05525351821604019
6.186186186186186,12,0.3293036868556685,0,0.32923748235312805,0.05512046262468878
6.201201201201201,12,0.32824955169071696,0,0.328222161996232,0.05501206549374327
6.216216216216216,12,0.32741841431490093,0,0.32742244645845026,0.0549369256449612
6.231231231231231,12,0.32682662032997306,0,0.3268545665639431,0.05490244575543904
6.246246246246246,12,0.3264892146766284,0,0.32653364616077296,0.05491441706639101
6.261261261261261,12,0.32642019892434704,0,0.3264739592077438,0.05497668083629567
6.276276276276276,12,0.32663283319707614,0,0.3266892228552378,0.055090894328951874
6.291291291291291,12,0.3271399760707739,0,0.32719291933649824,0.05525642148719294
6.306306306306306,12,0.3279544529106457,0,0.32799863736200596,0.055470357585376835
6.321321321321321,12,0.3290894399530555,0,0.32912042129528396,0.05572768466453801
6.336336336336336,12,0.330558848295814,0,0.3305731139213964,0.05602154243655459
6.351351351351351,12,0.3323776891696119,0,0.332372676358261,0.05634358951793557
6.366366366366366,12,0.3345623997301053,0,0.334536466860523,0.05668442368920532
6.381381381381381,12,0.33713110739178476,0,0.3370834591574872,0.057034027918293276
6.396396396396396,12,0.3401038106055016,0,0.34003438073834397,0.057382210850536776
6.411411411411412,12,0.34350245506241395,0,0.34341175228308185,0.05771901545267683
6.426426426426427,12,0.3473508866033153,0,0.34723981130524645,0.05803507631033833
6.441441441441442,12,0.35167466556185584,0,0.35154430602658787,0.05832191354104342
6.456456456456457,12,0.35650073174749736,0,0.3563521494824132,0.05857215844829726
6.471471471471472,12,0.36185691460758856,0,0.3616909287402978,0.058779712273931826
6.486486486486487,12,0.36777128909643503,0,0.3675882697331454,0.05893984437728714
6.501501501501502,12,0.37427138420540906,0,0.3740710643493761,0.05904923978335921
6.516516516516517,12,0.3813832577477203,0,0.38116457284683725,0.059106008335716644
6.531531531531532,12,0.3891304576156602,0,0.388891421100719,0.059109668748908495
6.546546546546547,12,0.3975328961051776,0,0.39727051838582034,0.05906112074606092
6.561561561561562,12,0.40660566979288576,0,0.40631592705215075,0.05896261720316879
6.576576576576577,12,0.41635786260535634,0,0.4160357203059601,0.058817745756320254
6.591591591591592,12,0.4267913738813758,0,0.42643086809247077,0.05863142558346232
6.606606606606607,12,0.4378998161304147,0,0.4374941935476334,0.058409919993424805
6.621621621621622,12,0.449667528574777,0,0.44920944342939767,0.05816085909357048
6.636636636636637,12,0.46206875218861704,0,0.4615505151803187,0.05789325942848181
6.651651651651652,12,0.4750670096151665,0,0.47448088069328265,0.05761751968223066
6.666666666666667,12,0.48861472892139857,0,0.4879532423992183,0.05734536435354429
6.681681681681682,12,0.5026531435978902,0,0.5019094509999423,0.0570897022838053
6.696696696696697,12,0.5171124926096013,0,0.5162807061538355,0.056864366021506046
6.711711711711712,12,0.5319125338686331,0,0.530988051910748,0.05668370340375288
6.726726726726727,12,0.5469633725996749,0,0.5459431680131934,0.05656200622189189
6.741741741741742,12,0.5621665932181132,0,0.5610494467608287,0.0565127830086747
6.756756756756757,12,0.5774166701859705,0,0.5762033334900338,0.056547912263073
6.771771771771772,12,0.592602620596361,0,0.5912958974325672,0.056676744376297425
6.786786786786787,12,0.6076098497561827,0,0.606214589406731,0.056905248002643995
6.801801801801802,12,0.6223221315687293,0,0.6208451340795914,0.05723531130321979
6.816816816816817,12,0.6366236587592284,0,0.6350734979920295,0.0576643036055915
6.831831831831832,12,0.6504010944797499,0,0.6487878706367941,0.058184976368210316
6.846846846846847,12,0.6635455569028502,0,0.6618805949598433,0.05878573801799638
6.861861861861862,12,0.6759544721338181,0,0.6742499858719841,0.05945128485391536
6.876876876876877,12,0.6875332379269803,0,0.6858019806587401,0.06016352166128479
6.891891891891892,12,0.6981966508000264,0,0.6964515732925203,0.060902670976524506
6.906906906906907,12,0.7078700614873685,0,0.7061239951081986,0.061648454233373964
6.921921921921922,12,0.7164902373789891,0,0.7147556164533153,0.062381230966959605
6.936936936936937,12,0.7240059246933355,0,0.7222945569956465,0.06308299951702556
6.951951951951952,12,0.7303781166794402,0,0.7287010055306499,0.06373818834365114
6.966966966966967,12,0.73558004628167994,0,0.7339472625535247,0.064334195712459
6.981981981981982,12,0.739596931749079,0,0.7380175297949592,0.06486166321208081
6.996996996996997,12,0.742425511169926,0,0.7409074797523457,0.06531449303867377
7.012012012012012,12,0.7440734066456246,0,0.7426236445492981,0.06568963908496842
7.027027027027027,12,0.7445583608045583,0,0.7431826670092149,0.06598671707423301
7.042042042042042,12,0.7439073878217436,0,0.7426104576382951,0.0662074889754658
7.057057057057057,12,0.7421558784329653,0,0.740941299491901,0.06635528151298035
7.072072072072072,12,0.7393466940896475,0,0.7382169390299408,0.06643439769968665
7.087087087087087,12,0.7355292799083215,0,0.7344856955587831,0.06644957427387
7.102102102102102,12,0.7307588199281865,0,0.7298016152770248,0.06640552747568579
7.117117117117117,12,0.7250954518509735,0,0.7242236888610012,0.06630661603834133
7.132132132132132,12,0.7186035522692437,0,0.7178151444626618,0.06615663525243748
7.147147147147147,12,0.7113510976738429,0,0.71064282137749335,0.06595874129435043
7.162162162162162,12,0.7034091014605797,0,0.7027766237929827,0.06571549233408301
7.177177177177177,12,0.694851122845507,0,0.6942890491525184,0.06542898346283851
7.192192192192192,12,0.6857528400994519,0,0.6852547818642042,0.06510104680949948
7.207207207207207,12,0.6761916778341327,0,0.6757503403612966,0.0647334863223721
7.222222222222222,12,0.6662464761927896,0,0.6658537638302576,0.06432831803221992
7.237237237237237,12,0.6559971886825872,0,0.655644324173905,0.06388799031728365
7.252252252252252,12,0.645524594989958,0,0.6452022488588648,0.06341556379537944
7.267267267267267,12,0.6349100153988672,0,0.6346084410904106,0.06291483610168773
7.282282282282282,12,0.6242350143347328,0,0.6239441851440509,0.06239040232460995
7.297297297297297,12,0.6135810820279011,0,0.613290826546315,0.06184764688951221
7.312312312312312,12,0.6030292852603601,0,0.6027294190231453,0.06129266707998431
7.327327327327327,12,0.592659880540127,0,0.5923403326099068,0.06073213223591927
7.342342342342342,12,0.5825518857300731,0,0.5822028199281873,0.060173086127883676
7.357357357357357,12,0.5727826090084399,0,0.5723945402653581,0.05962270322706105
7.372372372372372,12,0.5634271369027817,0,0.5629910436267388,0.059088012612309504
7.387387387387387,12,0.5545577858525808,0,0.5540652192551553,0.05857560595215909
7.402402402402402,12,0.5462435241501795,0,0.5456867151236544,0.05809134805447799
7.4174174174174174,12,0.5385493730350198,0,0.5379213365161486,0.05764010943698556
7.4324324324324325,12,0.5315357970525518,0,0.530830432951338,0.05722553976247188
7.4474474474474475,12,0.525258094467081,0,0.5244702833411078,0.05684989846878944
7.4624624624624625,12,0.5197657985280695,0,0.5188914894052332,0.05651395447656248
7.4774774774774775,12,0.5151020997914703,0,0.5141383870287904,0.05621696086233048
7.4924924924924925,12,0.5113032986173057,0,0.5102484845280796,0.055956703637305955
7.5075075075075075,12,0.5083982955843306,0,0.5072519358051968,0.05572961734104521
7.5225225225225225,12,0.5064081261027997,0,0.5051710552733306,0.055530955142551595
7.5375375375375375,12,0.5053455442019135,0,0.5040198803983769,0.05535499838511863
7.5525525525525525,12,0.5052146595392742,0,0.5038037869058667,0.05519529038717696
7.5675675675675675,12,0.506010631304154,0,0.5045191613080999,0.055044881621168475
7.5825825825825826,12,0.5077194229754891,0,0.5061531355383879,0.054896577426635194
7.597597597597598,12,0.5103176228757406,0,0.5086833892013412,0.054743184138470416
7.612612612612613,12,0.513772337064427,0,0.512078026244898,0.054577753818358665
7.627627627627628,12,0.5180411631770281,0,0.5162955346273529,0.05439383072445656
7.642642642642643,12,0.5230722560871364,0,0.5212848395959038,0.054185703636949446
7.657657657657658,12,0.528804498436098,0,0.5269854632354943,0.05394866698294861
7.672672672672673,12,0.5351677907776956,0,0.5333278046504693,0.053679290569838244
7.687687687687688,12,0.5420834769578593,0,0.5402335561376352,0.053375693130068444
7.702702702702703,12,0.5494649200495785,0,0.5476162706352548,0.05303780945069736
7.717717717717718,12,0.5572182424113363,0,0.5553820942733073,0.05266763528863349
7.732732732732733,12,0.5652432400525402,0,0.5634306747806094,0.05226942918571765
7.747747747747748,12,0.57343447642138,0,0.5716562517253448,0.051849846250085506
7.762762762762763,12,0.5816825540818789,0,0.5799489281336856,0.051417976486422025
7.777777777777778,12,0.5898755547887959,0,0.5881961151745191,0.050985259928312904
7.792792792792793,12,0.597900629634365,0,0.5962841327156899,0.050565253403157026
7.807807807807808,12,0.605645711805432,0,0.6040999392005258,0.050173230180276515
7.822822822822823,12,0.6130013157307205,0,0.6115329551309971,0.04982560498811545
7.837837837837838,12,0.6198623787360505,0,0.618476936206426,0.04953919354437807
7.852852852852853,12,0.6261300954529135,0,0.624831845581412,0.049330337412667416
7.867867867867868,12,0.631713691732491,0,0.6305056704239882,0.04921394951836122
7.882882882882883,12,0.6365320841162603,0,0.6354161264752675,0.04920255870214653
7.897897897897898,12,0.6405153731898162,0,0.6394921959238469,0.04930544722364284
7.912912912912913,12,0.6436061243197578,0,0.6426754486441699,0.049527977028115504
7.927927927927928,12,0.6457603970057546,0,0.6449211044676568,0.04987118516439202
7.942942942942943,12,0.6469484938041882,0,0.6461988041585548,0.0503316970093334
7.957957957957958,12,0.6471554107634594,0,0.6464930684398055,0.0509019642386849
7.972972972972973,12,0.6463809827392815,0,0.6458034369035616,0.05157079256575724
7.987987987987988,12,0.6446397280228512,0,0.6441442910423769,0.05232409176802212
8.003003003003004,12,0.6419604067025404,0,0.6415443770933306,0.053145763386893766
8.018018018018019,12,0.6383853155400573,0,0.6380460541773051,0.05401864038305105
8.033033033033034,12,0.6339693485310154,0,0.6337043008219472,0.054925404151372176
8.048048048048049,12,0.62877885661538,0,0.6285855181066823,0.05584942172677355
8.063063063063064,12,0.6228903422889582,0,0.6227661703389851,0.05677546417861854
8.078078078078079,12,0.6163890253960831,0,0.6163313045671683,0.057690282414329844
8.093093093093094,12,0.6093673155220795,0,0.6093729887369896,0.05858302745418844
8.108108108108109,12,0.601923224572686,0,0.601988705399491,0.05944550904760779
8.123123123123124,12,0.5941587507403441,0,0.5942797341087536,0.06027229064609565
8.138138138138139,12,0.5861782624729805,0,0.586349551517442,0.0610606219152877
8.153153153153154,12,0.5780869085480439,0,0.5783022741134439,0.06181021366470385
8.168168168168169,12,0.5699890780709111,0,0.5702411648543331,0.06252286533625179
8.183183183183184,12,0.5619869322101999,0,0.5622672218271035,0.06320196243521058
8.198198198198199,12,0.5541790277028409,0,0.5544778645364954,0.06385187023447526
8.213213213213214,12,0.5466590504866385,0,0.5469657314394967,0.06447725977482416
8.228228228228229,12,0.5395146760862001,0,0.5398176007443478,0.06508241108854762
8.243243243243244,12,0.5328265714234116,0,0.5331134450778299,0.06567054483625243
8.258258258258259,12,0.5266675504089208,0,0.526925629181208,0.06624323538638731
8.273273273273274,12,0.5211018929135927,0,0.5213182581332432,0.06679995455702795
8.288288288288289,12,0.5161848335071143,0,0.5163466815812722,0.06733778553538973
8.303303303303304,12,0.5119622227490656,0,0.512057157024021,0.06785133184373289
8.318318318318319,12,0.5084703599595487,0,0.5084866723486079,0.06833282865599535
8.333333333333334,12,0.5057359924664571,0,0.5056629246709833,0.06877244592922227
8.348348348348349,12,0.5037764725375224,0,0.5036044492167786,0.06915875730213707
8.363363363363364,12,0.5026000597676848,0,0.5023208886968246,0.06947933747211664
8.378378378378379,12,0.5022063537883193,0,0.5018133905753885,0.06972144468215892
8.393393393393394,12,0.5025868399238295,0,0.5020751169748039,0.06987274381788124
8.408408408408409,12,0.5037255289052209,0,0.5030918498382279,0.06992202836007788
8.423423423423424,12,0.5055996709490232,0,0.5048426724541357,0.06985990454428989
8.438438438438439,12,0.5081805243450166,0,0.5073007075406573,0.06967940700610999
8.453453453453454,12,0.5114341590381641,0,0.5104338917504403,0.06937652069986507
8.468468468468469,12,0.5153222763796979,0,0.5142057666088953,0.06895058820639419
8.483483483483484,12,0.5198030271012327,0,0.5185762664533292,0.06840458445621476
8.498498498498499,12,0.5248318105032815,0,0.5235024848280803,0.06774524264101364
8.513513513513514,12,0.5303620387716197,0,0.5289394019801292,0.06698301633743005
8.528528528528529,12,0.5363458512391835,0,0.5348405576070543,0.06613186461538025
8.543543543543544,12,0.5427347643761403,0,0.5411586548933494,0.06520885035986868
8.558558558558559,12,0.5494802444647087,0,0.5478460842114066,0.06423354847905176
8.573573573573574,12,0.5565341914917112,0,0.5548553577269798,0.06322727121049189
8.588588588588589,12,0.5638493249688474,0,0.5621394495519629,0.06221213294611863
8.603603603603604,12,0.5713794653207893,0,0.5696520399610583,0.061209996432388995
8.618618618618619,12,0.5790797082191469,0,0.5773476663617045,0.0602413639105046
8.633633633633634,12,0.58690649370254,0,0.5851817879080085,0.059324297000316384
8.64864864864865,12,0.5948175768677688,0,0.593110774540188,0.058473462660774196
8.663663663663664,12,0.6027719119547928,0,0.601091834454802,0.0576994037752468
8.67867867867868,12,0.6107294662889073,0,0.6090828962559297,0.057008117769974304
8.693693693693694,12,0.6186509842688084,0,0.6170424630951682,0.05640099480848299
8.70870870870871,12,0.6264977239440823,0,0.6249294559137525,0.05587512303770419
8.723723723723724,12,0.6342311894039927,0,0.6327030615468547,0.05542392087275192
8.73873873873874,12,0.641812881109132,0,0.6403225991728543,0.055038015813400634
8.753753753753754,12,0.6492040835824979,0,0.6477474157239809,0.05470626428821228
8.76876876876877,12,0.6563657059000207,0,0.6549368177975442,0.05441680132851384
8.783783783783784,12,0.6632581857009934,0,0.6618500446817337,0.05415802086640578
8.7987987987988,12,0.6698414625658817,0,0.6684462846333118,0.05391941149669909
8.813813813813814,12,0.6760750221475378,0,0.6746847347164211,0.05369220153473129
8.82882882882883,12,0.6819180088520473,0,0.6805247034223753,0.053469794913451156
8.843843843843844,12,0.687329402444366,0,0.685925754927907,0.05324800187749976
8.85885885885886,12,0.6922682528137378,0,0.6908478941186901,0.053025083936451375
8.873873873873874,12,0.6966939672045411,0,0.6952517922511733,0.052801641369595656
8.88888888888889,12,0.7005666452798985,0,0.6990990541565468,0.052580375013893114
8.903903903903904,12,0.7038474591067836,0,0.7023525289938151,0.052365753752171715
8.91891891891892,12,0.7064990771374446,0,0.7049766675131144,0.05216361659572779
8.933933933933934,12,0.7084861330947168,0,0.7069379293717059,0.05198073476747083
8.94894894894895,12,0.7097757419420071,0,0.7082052440333497,0.05182435562633737
8.963963963963964,12,0.7103380654665102,0,0.7087505279672299,0.051701747187229724
8.97897897897898,12,0.7101469291228374,0,0.7085492590591083,0.05161975965615124
8.993993993993994,12,0.7091804894554521,0,0.7075811062109698,0.05158441885333428
9.00900900900901,12,0.7074219475306904,0,0.7058306079605343,0.05160056547850483
9.024024024024024,12,0.7048602983863684,0,0.7032878886229984,0.051671553570137266
9.03903903903904,12,0.7014910997363706,0,0.6999493941017699,0.05179902081470885
9.054054054054054,12,0.697317235426642,0,0.6958186224554034,0.05198274213229936
9.06906906906907,12,0.6923496410152078,0,0.6909068170505526,0.05222057580884767
9.084084084084084,12,0.6866079511366473,0,0.6852335833681623,0.05250850809384913
9.0990990990991,12,0.6801210219836457,0,0.6788273851117377,0.05284079754956323
9.114114114114114,12,0.6729272783719819,0,0.6717258721359342,0.05321021465497703
9.12912912912913,12,0.6650748345211769,0,0.6639759928055297,0.05360836558681035
9.144144144144144,12,0.6566213417865929,0,0.6556338474981521,0.0540260822711764
9.15915915915916,12,0.6476335256877284,0,0.6467642485665167,0.05445385442995109
9.174174174174174,12,0.6381863887461627,0,0.637439965214301,0.05488227423847826
9.18918918918919,12,0.6283620742904883,0,0.6277406488870999,0.05530246118434522
9.204204204204204,12,0.618248408233488,0,0.617751454806729,0.055706434498696805
9.21921921921922,12,0.6079371589898243,0,0.6075613965086116,0.05608740362896185
9.234234234234235,12,0.5975220778661231,0,0.5972614906237658,0.056439953779450054
9.24924924924925,12,0.5870968009781176,0,0.5869427665032722,0.056760113222274325
9.264264264264265,12,0.5767527068254868,0,0.5766942276291094,0.05704530098452943
9.27927927927928,12,0.5665768294647382,0,0.5666008576061533,0.05729416624753181
9.294294294294295,12,0.5566499250047627,0,0.5567417621421346,0.057506342607602685
9.30930930930931,12,0.5470447791394317,0,0.5471885299192367,0.05768214945069389
9.324324324324325,12,0.5378248268056873,0,0.5380038806098525,0.057822277598870535
9.33933933933934,12,0.5290431337391189,0,0.5292406491409076,0.057927496260678356
9.354354354354355,12,0.5207417660431803,0,0.520941133733328,0.057998413200878333
9.36936936936937,12,0.5129515503051579,0,0.5131368134054846,0.058035310880550674
9.384384384384385,12,0.5056922054178362,0,0.5058484205034869,0.05803806975401145
9.3993993993994,12,0.49897280970868874,0,0.4990863369470474,0.058006177928545684
9.414414414414415,12,0.49279255418878903,0,0.49285127022961506,0.057938815882301854
9.42942942942943,12,0.48714172499482084,0,0.4871351571615102,0.05783499730777861
9.444444444444445,12,0.4820028551197468,0,0.4819222397364743,0.057693743126436964
9.45945945945946,12,0.4773519866026552,0,0.47719025776863366,0.05751426531441282
9.474474474474475,12,0.4731599885302948,0,0.4729117062680256,0.05729613982654063
9.48948948948949,12,0.46939388247550967,0,0.4690551109771813,0.057039452697462724
9.504504504504505,12,0.46601813440968826,0,0.4655862821840264,0.05674490931737272
9.51951951951952,12,0.46299587987719587,0,0.46246951407977516,0.05641390298418936
9.534534534534535,12,0.4602900567059801,0,0.45966870393367776,0.056048544362795084
9.54954954954955,12,0.4578644263469655,0,0.45714837178126877,0.05565165788893932
9.564564564564565,12,0.4556844708633328,0,0.45487456691216266,0.05522675409397406
9.57957957957958,12,0.4537181575509326,0,0.45281565208555724,0.05477798811736789
9.594594594594595,12,0.4519365671879664,0,0.45094296009576773,0.05431011427598028
9.60960960960961,12,0.45031438507664484,0,0.4492313201349432,0.05382844455686973
9.624624624624625,12,0.4488302564755834,0,0.44765945348529174,0.05333881550816857
9.63963963963964,12,0.4474670098665136,0,0.4462102395788467,0.0528475635772932
9.654654654654655,12,0.44621175288809767,0,0.44487085456567294,0.052361503998395384
9.66966966966967,12,0.44505584683339305,0,0.4436327854144156,0.05188790352193976
9.684684684684685,12,0.44399476646942104,0,0.4424917234145582,0.05143443338738169
9.6996996996997,12,0.44302785271594197,0,0.44144734193055357,0.051009086795018796
9.714714714714715,12,0.4421579665298795,0,0.44050296452687,0.05062004550665712
9.72972972972973,12,0.4413910532878453,0,0.43966513125625273,0.05027548365779405
9.744744744744745,12,0.4407356281305705,0,0.43894307304222435,0.04998330356399016
9.75975975975976,12,0.4402021941874304,0,0.4383481066763856,0.04975080784234336
9.774774774774775,12,0.4398026073440577,0,0.4378929658829683,0.049584323438452045
9.78978978978979,12,0.43954940319055913,0,0.43759108696758253,0.04948880436457681
9.804804804804805,12,0.43945510384849495,0,0.4374558704593673,0.04946744889045766
9.81981981981982,12,0.4395315242935477,0,0.43749994250216245,0.04952137139546519
9.834834834834835,12,0.4397890992689935,0,0.43773444115470383,0.049649367562273644
9.84984984984985,12,0.44023625258740384,0,0.43816835286568884,0.04984780376897447
9.864864864864865,12,0.4408788302257853,0,0.4388079229471091,0.050110648599493594
9.87987987987988,12,0.44171961689306366,0,0.439656160796115,0.05042964876981895
9.894894894894895,12,0.4427579525919209,0,0.44071245603373516,0.050794636457515974
9.90990990990991,12,0.44398946120142924,0,0.4419723159676065,0.05119394272533789
9.924924924924925,12,0.4454058975692649,0,0.4434272283488524,0.05161488414938609
9.93993993993994,12,0.4469951135001267,0,0.4450646468879697,0.052044287319014226
9.954954954954955,12,0.4487411369569973,0,0.44686809104459335,0.05246901787617252
9.96996996996997,12,0.4506243533791631,0,0.44881734675719315,0.05287648585150414
9.984984984984985,12,0.4526217738192109,0,0.4508887514240464,0.05325510571472687
10,12,0.45470737200533023,0,0.4530555447790949,0.0535946964657608
10.015015015015015,12,0.45685247162384823,0,0.45528826730970623,0.05388681328916117
10.03003003003003,12,0.45902616603633456,0,0.4575551893385344,0.054125007183811295
10.045045045045045,12,0.4611957550357219,0,0.45982275650556204,0.054305012268670703
10.06006006006006,12,0.4633271866952418,0,0.46205604073422896,0.054424862085944777
10.075075075075075,12,0.46538549638453475,0,0.46421918942917145,0.05448493628789257
10.09009009009009,12,0.4673352391239899,0,0.46627586924920217,0.0544879378806535
10.105105105105105,12,0.46914091518103646,0,0.46818970400844434,0.05443879915419438
10.12012012012012,12,0.4707673918312028,0,0.46992470883984516,0.0543445121696838
10.135135135135135,12,0.4721803262708494,0,0.4714457245441739,0.0542138779812976
10.15015015015015,12,0.47334659564343257,0,0.47271885694836324,0.05405716852974953
10.165165165165165,12,0.4742347399837545,0,0.4737119260693784,0.05388569726752717
10.18018018018018,12,0.47481542262919346,0,0.47439492892887575,0.053711299816830406
10.195195195195195,12,0.4750619103838789,0,0.47474051803191486,0.0535457346780539
10.21021021021021,12,0.4749505725908529,0,0.47472449488817164,0.053400025862921
10.225225225225225,12,0.4744613944495906,0,0.4743263146335924,0.05328378303282312
10.24024024024024,12,0.47357849563713605,0,0.47352959396688327,0.053204547958569666
10.255255255255255,12,0.4722906408231793,0,0.4723226104666013,0.05316722578981862
10.27027027027027,12,0.47059172433591945,0,0.47069877717889774,0.053173662542500715
10.285285285285285,12,0.4684812074074863,0,0.46865707250458855,0.05322242407879445
10.3003003003003,12,0.46596448351216413,0,0.4662024022612532,0.053308816204017014
10.315315315315315,12,0.4630531457246032,0,0.46334586877868095,0.053425162187786944
10.33033033033033,12,0.4597651301573723,0,0.46010492142664683,0.05356132687037141
10.345345345345345,12,0.45612471169629426,0,0.4565033644411929,0.05370545028578273
10.36036036036036,12,0.452162332608192,0,0.45257120156190106,0.0538448326796494
10.375375375375375,12,0.4479142511265939,0,0.44834430289262506,0.05396689957596345
10.39039039039039,12,0.4434220055678709,0,0.44386388739380883,0.054060170787626365
10.405405405405405,12,0.4387316993846726,0,0.4391758240832411,0.05411515991709011
10.42042042042042,12,0.4338931230856587,0,0.43432976568038406,0.054125138990501816
10.435435435435435,12,0.4289587392324803,0,0.42937813917805784,0.05408671436009021
10.45045045045045,12,0.423982565787398,0,0.42437502764021273,0.054000173331953984
10.465465465465465,12,0.41901900000334547,0,0.41937498538266,0.05386957528422597
10.48048048048048,12,0.4141216290805433,0,0.41443183371531916,0.0537025761419182
10.495495495495495,12,0.4093420745147627,0,0.4095974860098693,0.053509991181722706
10.51051051051051,12,0.4047289143525563,0,0.40492084878473217,0.053305118514979113
10.525525525525525,12,0.4003267217546272,0,0.4004468399734977,0.05310286414222102
10.54054054054054,12,0.39617524999417125,0,0.39621555716597706,0.05291872831267483
10.555555555555555,12,0.39230878417354914,0,0.39226161829758166,0.05276773009125333
10.57057057057057,12,0.38875566953455765,0,0.3886136861025033,0.052663359467506304
10.585585585585585,12,0.38553801624819123,0,0.38529417674738664,0.05261665037748467
10.6006006006006,12,0.38267157183642647,0,0.3823191434029806,0.05263546050128206
10.615615615615615,12,0.3801657455057133,0,0.3796983178253317,0.05272402344038687
10.63063063063063,12,0.3780237639872666,0,0.3774352877306393,0.05288280775349146
10.645645645645645,12,0.3762429360366213,0,0.37552778496552686,0.05310868044280112
10.66066066066066,12,0.37481500236296295,0,0.3739680590227566,0.053395336933441694
10.675675675675675,12,0.37372654908433806,0,0.3727433119458529,0.05373393225704174
10.69069069069069,12,0.37295946538768787,0,0.37183617359411175,0.05411383350081429
10.705705705705705,12,0.3724914294328281,0,0.3712252000499455,0.05452341249128897
10.72072072072072,12,0.372296410227498,0,0.3708853821212303,0.05495080771301975
10.735735735735735,12,0.37234517683414375,0,0.37078865497897484,0.05538460124735619
10.75075075075075,12,0.372605809556518,0,0.37090440363875193,0.05581437542574729
10.765765765765765,12,0.37304421049755476,0,0.3711999620200737,0.05623113130454496
10.78078078078078,12,0.3736246129685286,0,0.3716411055837564,0.05662756491697714
10.795795795795796,12,0.3743100906235957,0,0.3721925390222519,0.056998206946505196
10.81081081081081,12,0.3750630679064922,0,0.3728183811950557,0.05733943743625944
10.825825825825826,12,0.3758458334741837,0,0.3734826495336897,0.05764939037800117
10.84084084084084,12,0.3766210577711431,0,0.3741497455826398,0.05792776461061341
10.855855855855856,12,0.3773523149397487,0,0.37478494229324794,0.058175558358989736
10.87087087087087,12,0.37800460784143136,0,0.3753548722440153,0.05839474563344295
10.885885885885886,12,0.3785448932047808,0,0.3758280142147187,0.058587913925673724
10.9009009009009,12,0.3789426018925358,0,0.37617517358434543,0.05875788418243492
10.915915915915916,12,0.37917014708485625,0,0.37636994995176065,0.05890733561586973
10.93093093093093,12,0.37920341093194226,0,0.37638918330931526,0.05903845899908297
10.945945945945946,12,0.3790221980882908,0,0.3762133681767085,0.05915266206424337
10.96096096096096,12,0.37861064269676803,0,0.37582702350320235,0.05925034887282118
10.975975975975976,12,0.3779575540730904,0,0.37521900508139283,0.05933079116701173
10.99099099099099,12,0.3770566858063771,0,0.3743827469169418,0.059392103680682894
11.006006006006006,12,0.37590691349742367,0,0.3733164186944623,0.05943132754485486
11.02102102102102,12,0.37451230812846636,0,0.37202298835956027,0.05944461701921263
11.036036036036036,12,0.3728820952433094,0,0.370510182006663,0.0594275158446515
11.05105105105105,12,0.3710304947368257,0,0.36879033769974595,0.05937530165087508
11.066066066066066,12,0.3689764419612233,0,0.3668801553720438,0.05928337104245897
11.08108108108108,12,0.3667431977155633,0,0.36480035118603055,0.05914763488805129
11.096096096096096,12,0.36435786196731557,0,0.3625752311560827,0.05896489319799668
11.11111111111111,12,0.3618508131819429,0,0.3602322047962541,0.0587331616230766
11.126126126126126,12,0.35925510115248016,0,0.3578012643711799,0.05845192652726328
11.14114114114114,12,0.35660582549192066,0,0.35531445837877274,0.05812231205616386
11.156156156156156,12,0.35393953387776106,0,0.352805388724043,0.057747149852619736
11.17117117117117,12,0.35129367335700606,0,0.35030875944582396,0.05733094933723033
11.186186186186186,12,0.34870612447322086,0,0.34786000091527797,0.056879773196571295
11.2012012012012,12,0.34621484193271346,0,0.34549498750351343,0.056401028505317356
11.216216216216216,12,0.34385761754368926,0,0.34324985941021535,0.05590318851288889
11.23123123123123,12,0.34167197200647553,0,0.34116095138283337,0.055395463432344076
11.246246246246246,12,0.3396951726633983,0,0.33926482318361945,0.05488744053089923
11.26126126126126,12,0.33796436536017516,0,0.33759837953862465,0.054388714425397944
11.276276276276276,12,0.33651680081383073,0,0.33619906141741185,0.053908527748892425
11.29129129129129,12,0.3353901297989752,0,0.33510508612069423,0.053455440342471815
11.306306306306306,12,0.3346227372842806,0,0.3343557108547565,0.053037041992459046
11.32132132132132,12,0.334254083372714,0,0.33399149312363363,0.05265971975052155
11.336336336336336,12,0.33432501833414413,0,0.3340545211232573,0.052328486446825834
11.35135135135135,12,0.3348780398598618,0,0.3345885880670342,0.05204687263752961
11.366366366366366,12,0.33595746255817915,0,0.335639285704633,0.05181688044739086
11.381381381381381,12,0.3376094723093711,0,0.33725399396654754,0.051638995027665245
11.396396396396396,12,0.33988204113595727,0,0.33948174552117194,0.05151224791420717
11.411411411411411,12,0.3428246815531819,0,0.34237294602649415,0.05143432644005262
11.426426426426426,12,0.34648802289729624,0,0.3459789330703197,0.05140172424024419
11.441441441441441,12,0.3509231959590121,0,0.3503513594050859,0.051409929248137164
11.456456456456456,12,0.35618101655736,0,0.3555413893680618,0.051453646745077436
11.471471471471471,12,0.36231096373867266,0,0.3615987016662426,0.05152705531341155
11.486486486486486,12,0.36935995438589947,0,0.36857029734701346,0.051624092427993
11.501501501501501,12,0.3773709234823255,0,0.37649911908797096,0.05173876364591508
11.516516516516516,12,0.38638122833626887,0,0.3854224971456141,0.0518654650104485
11.531531531531531,12,0.3964209058521715,0,0.3953704484615968,0.05199930284603031
11.546546546546546,12,0.40751082433013863,0,0.40636386835541105,0.05213638942182007
11.561561561561561,12,0.4196607849036093,0,0.41841266844157765,0.05227408813603634
11.576576576576576,12,0.4328676418418191,0,0.4315139290424552,0.05241117924366241
11.591591591591591,12,0.4471135244202552,0,0.44565014819129045,0.05254791805553852
11.606606606606606,12,0.46236425439543966,0,0.4607876807614176,0.05268596309266789
11.621621621621621,12,0.47856806052439677,0,0.476875468517346,0.052828162462472156
11.636636636636636,12,0.49565469314782623,0,0.4938441631249025,0.05297820241784501
11.651651651651651,12,0.5135350358648466,0,0.5116057377689822,0.05314014115517067
11.666666666666666,12,0.5321012964968712,0,0.5300536679278559,0.05331787060113365
11.681681681681681,12,0.5512278354193305,0,0.5490637377953962,0.05351456541074326
11.696696696696696,12,0.5707726565969382,0,0.568495496652577,0.053732187564778634
11.711711711711711,12,0.5905795472356209,0,0.5881943511710958,0.05397111359899919
11.726726726726726,12,0.6104808090486258,0,0.6079942382882936,0.05422993846317548
11.741741741741741,12,0.6303004818777369,0,0.6277207828385439,0.05450548692833656
11.756756756756756,12,0.649857923414987,0,0.6471948088101622,0.05479303459938198
11.771771771771771,12,0.6689715814146392,0,0.6662360469030153,0.05508671171002224
11.786786786786786,12,0.6874627805102098,0,0.6846668670963926,0.05538003952774363
11.801801801801801,12,0.705159346457733,0,0.7023158649205647,0.05566653512671954
11.816816816816816,12,0.7218989063205395,0,0.7190211441008035,0.05594031661577939
11.831831831831831,12,0.7375317318856652,0,0.7346331645564561,0.056196646300304694
11.846846846846846,12,0.7519230319573166,0,0.7490170603079942,0.05643236085913091
11.861861861861861,12,0.7649546426060821,0,0.7620543726521123,0.05664615225796492
11.876876876876876,12,0.7765261081806069,0,0.773644185664077,0.056838678264852484
11.891891891891891,12,0.7865551855569034,0,0.7837036896225869,0.05701249563855592
11.906906906906906,12,0.7949778363323957,0,0.7921682300614099,0.057171821924328695
11.921921921921921,12,0.8017477943918274,0,0.7989909236826208,0.057322143556991854
11.936936936936936,12,0.8068358087623777,0,0.8041419363816439,0.05746969901250517
11.951951951951951,12,0.8102286644251747,0,0.8076075233243982,0.05762087611542652
11.966966966966966,12,0.8119280781496754,0,0.8093889274635974,0.05778157175302361
11.981981981981981,12,0.8119495543960892,0,0.8095012227486486,0.057956569002329386
11.996996996996996,12,0.8103212700094768,0,0.8079721735017297,0.058148989507446625
12.012012012012011,12,0.8070830378367191,0,0.8048411639218521,0.0583598764039957
12.027027027027026,12,0.8022853802856413,0,0.8001582331549097,0.058587954364705215
12.042042042042041,12,0.7959887255921033,0,0.7939832332277437,0.0588295986961117
12.057057057057056,12,0.7882627231598519,0,0.786385110436214,0.05907902631769613
12.072072072072071,12,0.7791856604387136,0,0.7774412962249923,0.059328700309454765
12.087087087087086,12,0.7688439527905336,0,0.7672371816658552,0.05956991928130515
12.102102102102101,12,0.7573316698498316,0,0.7558656406140013,0.05979354551759943
12.117117117117116,12,0.7447500570911948,0,0.743426560668177,0.05999081323684071
12.132132132132131,12,0.7312070096732066,0,0.7300263382860469,0.06015415089322955
12.147147147147146,12,0.7168164570988157,0,0.7157772948720676,0.06027794889810148
12.162162162162161,12,0.7016976217274566,0,0.7007969743670386,0.06035920571339103
12.177177177177176,12,0.6859741215326948,0,0.6852072897402108,0.06039799031399503
12.192192192192191,12,0.6697728974474934,0,0.6691334955869336,0.06039766735508331
12.207207207207206,12,0.6532229577497377,0,0.652702976342881,0.06036484347328901
12.222222222222221,12,0.6364539456004239,0,0.6360438537829752,0.060309009965290754
12.237237237237236,12,0.6195945502503432,0,0.6192834325851815,0.060241879658496304
12.252252252252251,12,0.6027707966006519,0,0.6025465177091675,0.060176444476879525
12.267267267267266,12,0.5861042606533783,0,0.5859536509487213,0.06012581377593164
12.282282282282281,12,0.5697102688175423,0,0.56961932504288,0.06010192834434502
12.297297297297296,12,0.553696146049874,0,0.5536502410924964,0.06011427483835428
12.312312312312311,12,0.538159580640069,0,0.5381436779288074,0.0601687424969817
12.327327327327327,12,0.5231871716767825,0,0.5231860401236382,0.06026676109858675
12.342342342342342,12,0.5088532188483003,0,0.5088516445945592,0.06040483272989815
12.357357357357357,12,0.4952188036781215,0,0.49520179479731374,0.060574522558759794
12.372372372372372,12,0.4823311974119494,0,0.48228417727983164,0.06076291424653555
12.387387387387387,12,0.4702236147073795,0,0.4701325991552487,0.06095347655039863
12.402402402402402,12,0.45891531535264374,0,0.45876706822310404,0.06112724124905837
12.417417417417417,12,0.4484120397906003,0,0.44819420137452687,0.06126416652005432
12.432432432432432,12,0.43870674944997695,0,0.4384079327136178,0.06134455571554177
12.447447447447447,12,0.4297806307322187,0,0.42939048136588626,0.061350415017455355
12.462462462462462,12,0.4216043125867447,0,0.42111353072406343,0.06126665764714694
12.477477477477477,12,0.41413924219719933,0,0.4135395660463406,0.06108208997824321
12.492492492492492,12,0.4073391613427287,0,0.4066233157139606,0.06079014065931963
12.507507507507507,12,0.40115162718010583,0,0.40031324269214386,0.060389314744459584
12.522522522522522,12,0.39551952502971066,0,0.3945530363074376,0.05988337006127434
12.537537537537537,12,0.3903825266680197,0,0.3892830597981593,0.05928122327643383
12.552552552552552,12,0.3856784550433867,0,0.38444171567836005,0.058596599767115766
12.567567567567567,12,0.38134452468975594,0,0.3799666983119184,0.057847446172148743
12.582582582582582,12,0.3773184359268421,0,0.3757961108376154,0.05705512909584857
12.597597597597597,12,0.37353930978701266,0,0.3718694314117037,0.05624344944730179
12.612612612612612,12,0.3699484591402436,0,0.3681283213934028,0.05543751055462198
12.627627627627627,12,0.36648999938538346,0,0.36451727537573214,0.05466249003606235
12.642642642642642,12,0.3631113090596415,0,0.3609841196551352,0.05394237976006965
12.657657657657657,12,0.35976335654042785,0,0.3574803716331628,0.05329877268864454
12.672672672672672,12,0.3564009134667211,0,0.35396147754614576,0.052749785755687756
12.687687687687687,12,0.35298267844009007,0,0.35038694963134,0.05230920889031692
12.702702702702702,12,0.3494713359043177,0,0.3467204262019353,0.0519859572640853
12.717717717717717,12,0.34583357486647115,0,0.3429296790202281,0.05178387529979647
12.732732732732732,12,0.34204009042825995,0,0.33898659181059715,0.05170190026557774
12.747747747747747,12,0.3380655881520611,0,0.3348671318165484,0.051734548487125186
12.762762762762762,12,0.33388880736631077,0,0.3305513331444813,0.0518726487334435
12.777777777777777,12,0.32949257493071366,0,0.3260233064914562,0.05210422400507699
12.792792792792792,12,0.32486389604387667,0,0.32127128501402435,0.052415418821831594
12.807807807807807,12,0.3199940836621362,0,0.3162877108651685,0.05279138242824597
12.822822822822824,12,0.314878923230178,0,0.3110693615956567,0.05321704307947059
12.837837837837839,12,0.30951886485726693,0,0.3056175104330604,0.05367773724152948
12.852852852852854,12,0.30391923090058937,0,0.2999381096102156,0.054159683765792464
12.867867867867869,12,0.2980904231891206,0,0.29404198155500927,0.05465031300801932
12.882882882882884,12,0.2920481108678733,0,0.28794499897407955,0.055138473174149015
12.897897897897899,12,0.28581337710795807,0,0.2816682317466027,0.055614541478603854
12.912912912912914,12,0.27941280080002434,0,0.27523803618465176,0.05607046754467439
12.927927927927929,12,0.27287844798259236,0,0.2686860607471017,0.05649977263561165
12.942942942942944,12,0.26624774738820983,0,0.2620491419079062,0.05689752236456895
12.957957957957959,12,0.2595632254316261,0,0.2553690648359685,0.057260283744457754
12.972972972972974,12,0.25287207857972654,0,0.2486921661538992,0.057586070752110474
12.987987987987989,12,0.2462255657026139,0,0.242068760632938,0.057874276728720524
13.003003003003004,12,0.239678210012216,0,0.23555238053001173,0.05812558752819052
13.018018018018019,12,0.23328680969756788,0,0.22919882552815365,0.05834186687893879
13.033033033033034,12,0.22710926825860148,0,0.22306503282434217,0.05852600535706876
13.048048048048049,12,0.22120326937392534,0,0.21720779042110122,0.05868172690472822
13.063063063063064,12,0.21562483606038563,0,0.21168233133640438,0.0588133518847513
13.078078078078079,12,0.21042682863485784,0,0.20654086106672176,0.05892552273533895
13.093093093093094,12,0.20565744898104138,0,0.20183108369625968,0.05902290638532137
13.108108108108109,12,0.2013588280955403,0,0.19759480182437486,0.05910989528327835
13.123123123123124,12,0.197565778150468,0,0.19386667030313426,0.05919033451358486
13.138138138138139,12,0.19430478804106127,0,0.19067318228066032,0.05926730444780497
13.153153153153154,12,0.191593331915199,0,0.18803195748650892,0.05934298564912459
13.168168168168169,12,0.18943954370626215,0,0.1859513871636005,0.059418625123371045
13.183183183183184,12,0.18784228836626252,0,0.1844306685776735,0.05949461135514174
13.198198198198199,12,0.1867916343473134,0,0.18346023652514384,0.05957065168501371
13.213213213213214,12,0.18626970454253627,0,0.18302257225698704,0.05964603182780048
13.228228228228229,12,0.1862518572299229,0,0.18309334454933004,0.05971992605104755
13.243243243243244,12,0.1867081272014008,0,0.18364281592504464,0.05979171953384024
13.258258258258259,12,0.18760484221975673,0,0.18463743134195837,0.059861302625767956
13.273273273273274,12,0.18890632234602311,0,0.18604149823594296,0.05992930008214387
13.288288288288289,12,0.19057656964129616,0,0.18781886589152158,0.05999720604073969
13.303303303303304,12,0.1925808624792499,0,0.189934518045312,0.06006740623936125
13.318318318318319,12,0.19488718073743275,0,0.19235600403848135,0.060143081322122545
13.333333333333334,12,0.19746740362690182,0,0.1950546489426922,0.06022799770033337
13.348348348348349,12,0.20029823898525237,0,0.19800650001328268,0.0603262041628672
13.363363363363364,12,0.20336185983516292,0,0.2011929838746902,0.06044166229882823
13.378378378378379,12,0.206646239637022,0,0.20460126468462195,0.060577845981251106
13.393393393393394,12,0.21014519115233407,0,0.20822430728251312,0.06073734898780668
13.408408408408409,12,0.21385812485181604,0,0.21206066059059084,0.06092153983127524
13.423423423423424,12,0.217789551385525,0,0.2161139852774762,0.06113029889094254
13.438438438438439,12,0.2219483590674352,0,0.22039235616788375,0.06136186527741344
13.453453453453454,12,0.2263469020187024,0,0.22490737449358797,0.06161281033566083
13.468468468468469,12,0.2309999379741206,0,0.22967312827366318,0.0618781425419029
13.483483483483484,12,0.23592345711853904,0,0.2347050412734216,0.062151536264675615
13.498498498498499,12,0.24113344488980615,0,0.24001865239225176,0.06242566588075581
13.513513513513514,12,0.24664462252423608,0,0.24562836809622332,0.06269261818750564
13.528528528528529,12,0.25246920916286514,0,0.2515462306254875,0.0629443505708089
13.543543543543544,12,0.25861574842384916,0,0.2577807440381506,0.06317316009134183
13.558558558558559,12,0.2650880402812325,0,0.26433579850344413,0.06337212924951648
13.573573573573574,12,0.271884215694972,0,0.27120973041874324,0.06353551715841053
13.588588588588589,12,0.2789959866075247,0,0.2783945517361994,0.0636590696245867
13.603603603603604,12,0.2864080976720975,0,0.285875376283227,0.06374022772206508
13.618618618618619,12,0.29409799856459623,0,0.2936300639195915,0.0637782214908739
13.633633633633634,12,0.30203574726141474,0,0.3016290953164197,0.0637740431512038
13.64864864864865,12,0.3101841456744988,0,0.30983568133692213,0.06373030247792075
13.663663663663664,12,0.3184991000504663,0,0.3182061019283874,0.06365097543813053
13.67867867867868,12,0.32693019012473384,0,0.32669026065066537,0.06354106541170608
13.693693693693694,12,0.335421423711316,0,0.33523243302860417,0.06340620365151194
13.70870870870871,12,0.3439121476543561,0,0.3437721803328859,0.06325222129158292
13.723723723723724,12,0.3523380821814404,0,0.35224539556594453,0.06308472831800051
13.73873873873874,12,0.36063244382491616,0,0.3605854456064593,0.06290873474558134
13.753753753753754,12,0.3687271221785095,0,0.36872437272093533,0.06272834540318722
13.76876876876877,12,0.3765538776262716,0,0.3765941198780819,0.06254655235994248
13.783783783783784,12,0.3840455304745272,0,0.38412774723272153,0.062365138876517255
13.7987987987988,12,0.3911371161975244,0,0.39126061138407364,0.06218469713653077
13.813813813813814,12,0.3977669862958034,0,0.3979314840816993,0.062004750513339285
13.82882882882883,12,0.40387783909608127,0,0.40408359244712944,0.061823961345527895
13.843843843843844,12,0.4094176692842226,0,0.4096655680221083,0.061640398357379916
13.85885885885886,12,0.4143406287418536,0,0.41463229663960294,0.06145183459557844
13.873873873873874,12,0.4186077941494417,0,0.4189456649409936,0.061256047018464196
13.88888888888889,12,0.4221878387414153,0,0.4225752021577216,0.06105109206262159
13.903903903903904,12,0.42505760658325714,0,0.425498617492653,0.06083553667577848
13.91891891891892,12,0.42720258791374155,0,0.42770223414840136,0.06060863041676629
13.933933933933934,12,0.42861729365744555,0,0.42918132092589456,0.060370410394280455
13.94894894894895,12,0.42930552640442865,0,0.42994032159077994,0.06012173643105496
13.963963963963964,12,0.42928054422865575,0,0.42999298114340523,0.05986425859371993
13.97897897897898,12,0.4285651129103913,0,0.42936236699321445,0.05960032308367074
13.993993993993994,12,0.4271914416340848,0,0.42808078206142003,0.059332825581105045
14.00900900900901,12,0.4252009971878652,0,0.42618956619449233,0.059065023683619246
14.024024024024024,12,0.4226441921607843,0,0.4237387820768676,0.05880032226262804
14.03903903903904,12,0.4195799436193835,0,0.4207867821291895,0.058542047447218776
14.054054054054054,12,0.4160751001894472,0,0.41739965365444676,0.05829322645328983
14.06906906906907,12,0.41220373727579385,0,0.41365054069444257,0.05805639136211222
14.084084084084084,12,0.40804632221299975,0,0.40961884261114234,0.05783342484739597
14.0990990990991,12,0.4036887533539726,0,0.40538929124667505,0.05762546433654902
14.114114114114114,12,0.39922127940820157,0,0.4010509106059652,0.05743287781573082
14.12912912912913,12,0.3947373077247366,0,0.396695865352623,0.057255319280007384
14.144144144144144,12,0.39033211271945323,0,0.3924182070603129,0.057091864809421376
14.15915915915916,12,0.3861014583596976,0,0.3883125301964733,0.056941221886699395
14.174174174174174,12,0.3821401516473554,0,0.38447255331145164,0.05680199566913192
14.18918918918919,12,0.3785405474689738,0,0.38098964490394216,0.05667298755482721
14.204204204204204,12,0.37539102902514343,0,0.37795131788936404,0.05655349474282273
14.21921921921922,12,0.3727744922142906,0,0.37543972134490095,0.056443575749156934
14.234234234234235,12,0.3707668665840641,0,0.3735301629302762,0.05634424697851262
14.24924924924925,12,0.36943570937438375,0,0.37228969962843045,0.05625758006526492
14.264264264264265,12,0.36883891222056947,0,0.3717758376450075,0.05618667886125393
14.27927927927928,12,0.3690235616434739,0,0.37203538383274554,0.056135528067140915
14.294294294294295,12,0.37002499391541077,0,0.37310349029311835,0.056108721242394556
14.30930930930931,12,0.37186608176471425,0,0.37500293042562877,0.05611109223779055
14.324324324324325,12,0.37455678440840584,0,0.3777436384609257,0.05614728842525899
14.33933933933934,12,0.3780939836430741,0,0.3813225355564482,0.0562213338235515
14.354354354354355,12,0.38246161760790687,0,0.3857236543222781,0.056336233215356656
14.36936936936937,12,0.38763111114041265,0,0.3909185609626751,0.05649366363361884
14.384384384384385,12,0.3935620884237862,0,0.3968670610782084,0.05669378773165149
14.3993993993994,12,0.4002033410556722,0,0.4035181626917844,0.05693520668986425
14.414414414414415,12,0.4074940138950686,0,0.41081125931153206,0.05721505169625928
14.42942942942943,12,0.4153649630056152,0,0.41867748770704627,0.057529196154868914
14.444444444444445,12,0.42374023530949284,0,0.42704121013002316,0.05787255842432833
14.45945945945946,12,0.43253861838349444,0,0.43582156916298465,0.05823945852048015
14.474474474474475,12,0.4416752109396976,0,0.44493406506152655,0.058623991773620834
14.48948948948949,12,0.4510629693604135,0,0.45429210987321483,0.05902038666240958
14.504504504504505,12,0.4606141923903387,0,0.46380851904682135,0.059423321114302194
14.51951951951952,12,0.4702419138231649,0,0.47339690885515856,0.05982817965806573
14.534534534534535,12,0.47986118089288415,0,0.48297297591795496,0.060231241581060156
14.54954954954955,12,0.48939020337913036,0,0.49245564271294273,0.060629796928808065
14.564564564564565,12,0.49875136466761644,0,0.5017680596695581,0.06102219255661108
14.57957957957958,12,0.5078720909201979,0,0.5108384599308917,0.06140781459523071
14.594594594594595,12,0.516685578077915,0,0.5196008670380214,0.06178701682669341
14.60960960960961,12,0.5251313787985302,0,0.5279956587106687,0.0621610067406296
14.624624624624625,12,0.533155852887573,0,0.535969991773754,0.06253170250632517
14.63963963963964,12,0.5407124856399665,0,0.5434780943892367,0.0629015747051517
14.654654654654655,12,0.547762079081216,0,0.5504814323918659,0.06327348634103279
14.66966966966967,12,0.5542728216424265,0,0.5569487569624008,0.06365054334025641
14.684684684684685,12,0.5602202425011882,0,0.5628560413068832,0.06403596552090095
14.6996996996997,12,0.5655870577573229,0,0.5681863145718303,0.06443298503637664
14.714714714714715,12,0.5703629167886084,0,0.5729294019583805,0.06484477587294508
14.72972972972973,12,0.5745440584753838,0,0.5770815808790165,0.06527441447853673
14.744744744744745,12,0.5781328883749736,0,0.5806451639518135,0.06572486840558679
14.75975975975976,12,0.5811374892244852,0,0.5836280205424064,0.06619900730120708
14.774774774774775,12,0.5835710782130948,0,0.58604304932843,0.06669962891026947
14.78978978978979,12,0.5854514251729896,0,0.58790761487084775,0.0672294920766925
14.804804804804805,12,0.5868002461079437,0,0.5892429613531786,0.06779134900626671
14.81981981981982,12,0.5876425862692407,0,0.5900736164472958,0.06838797014600133
14.834834834834835,12,0.5880062063035926,0,0.5904267976741926,0.06902215671531475
14.84984984984985,12,0.5879209838792122,0,0.5903318326741108,0.06969673793004848
14.864864864864865,12,0.5874183417183074,0,0.5898196035349791,0.07041455202957735
14.87987987987988,12,0.5865307112216464,0,0.5889220238232874,0.07117841212184677
14.894894894894895,12,0.5852910389679667,0,0.5876715553006407,0.07199105942688759
14.90990990990991,12,0.5837323414124973,0,0.5861007695781693,0.07285510761599603
14.924924924924925,12,0.581887311190259,0,0.5842419582412307,0.0737729825653141
14.93993993993994,12,0.5797879766322867,0,0.5821267933398055,0.07474686198041582
14.954954954954955,12,0.5774654144893455,0,0.5797860386434476,0.0757786190604291
14.96996996996997,12,0.5749495144707799,0,0.5772493107459732,0.07686977374651086
14.984984984984985,12,0.5722687930701557,0,0.5745448880008565,0.07802145424864217
15,12,0.5694502532705448,0,0.5716995643855853,0.07923437057959229
