interval,rating,rating_boot_mean,rating_boot_se
0,-0.06038927152159464,-0.06433510331875109,0.09273642456361586
0.015015015015015015,-0.06939713971463288,-0.07336018359506075,0.09141545542095074
0.03003003003003003,-0.07880986613576979,-0.08279037435881512,0.09010272971803455
0.04504504504504504,-0.08865443352838204,-0.0926520798686978,0.08880303476821548
0.06006006006006006,-0.0989575516465982,-0.10297137064309042,0.08752163450679157
0.07507507507507508,-0.10974522467738031,-0.11377355241886557,0.08626421156030176
0.09009009009009009,-0.12104225296189827,-0.12508267144620835,0.08503677231851327
0.10510510510510511,-0.13287166903372274,-0.1369209564396762,0.08384550941974014
0.12012012012012012,-0.14525411037929756,-0.14930819983271776,0.08269661779347982
0.13513513513513514,-0.158207134208339,-0.16226108377001044,0.08159606326027405
0.15015015015015015,-0.1717444828637657,-0.17579245948380892,0.08054930674741928
0.16516516516516516,-0.18587531222397125,-0.18991059226091206,0.07956099234297732
0.18018018018018017,-0.20060339942484726,-0.20461838799329976,0.07863461333601499
0.19519519519519518,-0.21592635027012186,-0.21991262114519775,0.07777217645269188
0.21021021021021022,-0.2318348305678905,-0.23578318764116596,0.07697388981413204
0.22522522522522523,-0.24831184904385775,-0.25221240942023493,0.07623790368570775
0.24024024024024024,-0.26533212212241897,-0.2691744199182382,0.07556013388096994
0.2552552552552553,-0.2828615524119901,-0.28663466123379594,0.07493419504473882
0.2702702702702703,-0.3008568528799477,-0.3045495239204981,0.07435146480828816
0.2852852852852853,-0.3192653472111684,-0.32286615899506027,0.07380129047090032
0.3003003003003003,-0.33802497356064765,-0.3415224887056914,0.07327133850858514
0.3153153153153153,-0.3570645138069736,-0.3604474378236132,0.07274807532881186
0.3303303303303303,-0.3763040636068659,-0.3795614007919165,0.07221735683367274
0.34534534534534533,-0.3956557503116713,-0.3987769522192811,0.07166509580723229
0.36036036036036034,-0.4150246965470275,-0.4179997993060938,0.07107797067794704
0.37537537537537535,-0.4343102175018313,-0.43712996531477133,0.07044413699870695
0.39039039039039036,-0.4534072303140163,-0.45606318369649396,0.06975390368604498
0.40540540540540543,-0.47220784497923524,-0.4746924735396056,0.06900033897333588
0.42042042042042044,-0.4906030984935128,-0.49290985915519664,0.06817977533949868
0.43543543543543545,-0.5084847879142227,-0.5106081903225901,0.06729218761667019
0.45045045045045046,-0.5257473539782086,-0.5276830153116416,0.06634142349592481
0.46546546546546547,-0.5422897649746409,-0.5440344564536805,0.06533527044908027
0.4804804804804805,-0.5580173506875368,-0.5595690377586994,0.06428534767903367
0.4954954954954955,-0.572843538207911,-0.5742014157341658,0.06320681641944342
0.5105105105105106,-0.5866914449721391,-0.5878559678944968,0.0621179073315026
0.5255255255255256,-0.5994952891587019,-0.600468198130889,0.061039270714854287
0.5405405405405406,-0.6112015832109435,-0.6119859237847557,0.05999316464419828
0.5555555555555556,-0.6217700824251398,-0.6223702155989042,0.05900250859538105
0.5705705705705706,-0.6311744669920334,-0.6315960684254937,0.05808984553958609
0.5855855855855856,-0.6394027424253996,-0.6396527874347931,0.05727627247649381
0.6006006006006006,-0.6464573498477768,-0.646544081452963,0.056580414875124274
0.6156156156156156,-0.6523549840866647,-0.6522878618799833,0.05601752989758014
0.6306306306306306,-0.6571261239564186,-0.65691575236038,0.0555988215475641
0.6456456456456456,-0.6608142854635906,-0.6604723209736112,0.055331034471709555
0.6606606606606606,-0.663475014963602,-0.6630140531422799,0.055216362177807704
0.6756756756756757,-0.6651746454655258,-0.6646080896603489,0.05525266487784139
0.6906906906906907,-0.6659888452331442,-0.6653307601159271,0.0554339509095442
0.7057057057057057,-0.6660009934171468,-0.6652659473781894,0.055751043630543805
0.7207207207207207,-0.6653004224814973,-0.6645033235539782,0.05619234003891485
0.7357357357357357,-0.6639805714284053,-0.6631365016923898,0.05674457020025285
0.7507507507507507,-0.6621370970362416,-0.661261150314539,0.057393484557054904
0.7657657657657657,-0.6598659922613697,-0.6589731193721404,0.058124422671435326
0.7807807807807807,-0.6572617614038818,-0.6563666263238117,0.05892274460563802
0.7957957957957957,-0.6544157004317482,-0.6535325495397987,0.05977412930839573
0.8108108108108109,-0.6514143279010196,-0.6505568731419092,0.060664760030233536
0.8258258258258259,-0.6483380071898815,-0.6475193226655348,0.06158142444063143
0.8408408408408409,-0.6452597943679084,-0.644492224683675,0.06251155801954714
0.8558558558558559,-0.6422445381388038,-0.6415396159324266,0.06344325554792032
0.8708708708708709,-0.6393482492157627,-0.6387166187802685,0.06436526934739502
0.8858858858858859,-0.6366177465945071,-0.6360690904245356,0.06526700620163435
0.9009009009009009,-0.6340905779318022,-0.6336335433772212,0.06613852896565062
0.9159159159159159,-0.6317952011115201,-0.6314373250625344,0.0669705644882905
0.9309309309309309,-0.6297514045915326,-0.629499035152706,0.06775451687722195
0.9459459459459459,-0.627970935750348,-0.6278291510649417,0.0684824841780242
0.960960960960961,-0.6264582996080755,-0.6264308252329231,0.06914727682456946
0.975975975975976,-0.625211685302102,-0.6253008126751987,0.0697424372393707
0.990990990990991,-0.6242239747563244,-0.6244304842312418,0.07026226121248622
1.006006006006006,-0.6234837871654164,-0.6238068797261429,0.070701822740786
1.021021021021021,-0.6229765141636687,-0.6234137562356901,0.07105700457179744
1.0360360360360361,-0.622685303685226,-0.6232325894181892,0.07132453662124569
1.0510510510510511,-0.6225919552779144,-0.623243490323023,0.07150204371085794
1.0660660660660661,-0.6226776956716797,-0.6234260058728891,0.07158810280001329
1.0810810810810811,-0.6229238103596916,-0.6237597779998406,0.07158230822581917
1.0960960960960962,-0.6233121144615205,-0.6242250438366181,0.07148534161390264
1.1111111111111112,-0.6238252538675102,-0.6248029670817394,0.07129904126609864
1.1261261261261262,-0.6244468353202829,-0.6254757983604501,0.07102646413973827
1.1411411411411412,-0.6251613914347801,-0.6262268698296305,0.07067193214973111
1.1561561561561562,-0.6259541935021967,-0.627040436203569,0.0702410535752485
1.1711711711711712,-0.6268109311143041,-0.6279013806290207,0.06974070995971463
1.1861861861861862,-0.6277172830524105,-0.6287948092600287,0.06917899918593809
1.2012012012012012,-0.6286584083840655,-0.6297055628391288,0.06856512652740034
1.2162162162162162,-0.6296183901669631,-0.6306176769531128,0.06790923755927944
1.2312312312312312,-0.6305796664260963,-0.6315138247725304,0.06722218996252734
1.2462462462462462,-0.6315224839933523,-0.6323747768877637,0.06651526549437076
1.2612612612612613,-0.6324244102351658,-0.6331789122258134,0.06579982861326511
1.2762762762762763,-0.6332599355391653,-0.6339018119165857,0.06508694412524844
1.2912912912912913,-0.6340001956525683,-0.6345159643866487,0.06438697222165651
1.3063063063063063,-0.6346128376351421,-0.6349906049877405,0.06370916464411651
1.3213213213213213,-0.63506204650724,-0.6352917073117903,0.06306128953356262
1.3363363363363363,-0.6353087419723187,-0.6353821362998289,0.062449313889454
1.3513513513513513,-0.6353109463270428,-0.6352219657019448,0.0618771707871695
1.3663663663663663,-0.6350243163772541,-0.634768954832261,0.061346633310585486
1.3813813813813813,-0.6344028244185558,-0.6339791723481589,0.06085730888119169
1.3963963963963963,-0.6333995666411951,-0.632807748399956,0.060406757256180714
1.4114114114114114,-0.6319676721008272,-0.6312097313044285,0.05999072435886599
1.4264264264264264,-0.6300612819236109,-0.6291410211387588,0.05960347391842503
1.4414414414414414,-0.6276365667631337,-0.6265593504389165,0.05923819108636829
1.4564564564564564,-0.6246527505878949,-0.6234252814852423,0.05888742773742865
1.4714714714714714,-0.6210731103821875,-0.6197031903059651,0.05854355837399276
1.4864864864864864,-0.6168659239119678,-0.6153622092670333,0.058199218111503574
1.5015015015015014,-0.6120053409188998,-0.6103771026292798,0.05784769931109645
1.5165165165165164,-0.6064721565599562,-0.6047290524180572,0.057483289965311726
1.5315315315315314,-0.6002544692859253,-0.5984063350796953,0.057101543817758955
1.5465465465465464,-0.5933482084461358,-0.5914048724793199,0.056699478433550256
1.5615615615615615,-0.5857575196484026,-0.5837286437062476,0.05627570230956217
1.5765765765765765,-0.5774949983482515,-0.5753899468765238,0.055830475199451834
1.5915915915915915,-0.5685817644430878,-0.5664095027266799,0.055365707022115615
1.6066066066066067,-0.5590473730135278,-0.5568163944103552,0.05488490022817192
1.6216216216216217,-0.5489295589999579,-0.5466478407004489,0.05439303880696328
1.6366366366366367,-0.5382738166978828,-0.5359488029114972,0.053896424953825676
1.6516516516516517,-0.5271328185874816,-0.524771429387598,0.05340246266536093
1.6666666666666667,-0.5155656821561668,-0.5131743453669401,0.052919387096385405
1.6816816816816818,-0.503637097883413,-0.5012218003532912,0.05245594015544509
1.6966966966966968,-0.49141633618136754,-0.4889826896152565,0.05202099694325944
1.7117117117117118,-0.4789761554887999,-0.47652947082837444,0.05162315410633155
1.7267267267267268,-0.46639163753016155,-0.4639370008505597,0.051270299158476924
1.7417417417417418,-0.45373897861934037,-0.45128132084147227,0.05096918781194347
1.7567567567567568,-0.44109426751890446,-0.4386384200971515,0.050725062390640833
1.7717717717717718,-0.4285322805775892,-0.42608300984465564,0.050541346478197545
1.7867867867867868,-0.4161253236150743,-0.41368733770990873,0.05041944764684612
1.8018018018018018,-0.40394214740147155,-0.4015200716460768,0.05035869108926448
1.8168168168168168,-0.39204695981803744,-0.3896452789288759,0.05035639329795861
1.8318318318318318,-0.38049855321397114,-0.3781215216372604,0.05040806891677252
1.8468468468468469,-0.3693495604748082,-0.36700108516630975,0.050507748503074504
1.8618618618618619,-0.35864584827765494,-0.35632935111843983,0.050648373007860285
1.8768768768768769,-0.3484260512699639,-0.346144320731358,0.050822224225551854
1.8918918918918919,-0.3387212467310412,-0.33647629011727304,0.05102134990970744
1.906906906906907,-0.32955476581277043,-0.3273476742213691,0.05123794706709049
1.921921921921922,-0.32094213475071603,-0.3187729726847845,0.05146467563668831
1.936936936936937,-0.3128911374338774,-0.31075886776163025,0.05169488548873855
1.951951951951952,-0.3054019892945198,-0.30330444206960055,0.05192275069608937
1.966966966966967,-0.2984676114681989,-0.2964015021876161,0.05214331496134818
1.981981981981982,-0.2920739934205732,-0.2900349928764633,0.052352460018104896
1.996996996996997,-0.286200631621061,-0.2841834859226548,0.05254681429164657
2.012012012012012,-0.28082103130312186,-0.2788197272485728,0.052723621994307655
2.027027027027027,-0.2759032578947687,-0.2739112259780148,0.05288059331298104
2.042042042042042,-0.2714105244026134,-0.2694208696050236,0.05301575480047365
2.057057057057057,-0.2673018010045337,-0.26530755030821546,0.053127316031704695
2.0720720720720722,-0.2635324334835225,-0.26152678880518415,0.053213564629365946
2.0870870870870872,-0.2600547580382865,-0.25803134395953137,0.05327279750058328
2.1021021021021022,-0.25681870151285896,-0.25477179861708227,0.05330329207909323
2.1171171171171173,-0.2537723582123197,-0.25169711480322904,0.05330331792008927
2.1321321321321323,-0.2508625371555851,-0.24875515436698725,0.05327118635549212
2.1471471471471473,-0.2480352767250971,-0.2458931642779764,0.05320533411552813
2.1621621621621623,-0.2452363270089732,-0.2430582289058221,0.05310443573618128
2.1771771771771773,-0.24241160344637422,-0.24019769454611412,0.05296753897503662
2.1921921921921923,-0.2395076184062127,-0.23725957399388972,0.05279421707466335
2.2072072072072073,-0.23647189976908514,-0.23419294088729511,0.052584731269763395
2.2222222222222223,-0.23325340717146908,-0.23094832463702056,0.052340196203969264
2.2372372372372373,-0.22980295707013446,-0.22747811682540509,0.05206273975587011
2.2522522522522523,-0.2260736670050197,-0.22373699884249557,0.05175564713156126
2.2672672672672673,-0.22202142726408278,-0.2196823981226427,0.05142347706021406
2.2822822822822824,-0.21760540456317634,-0.21527497663667952,0.051072135795632474
2.2972972972972974,-0.21278857744768415,-0.2104791503774535,0.0507088928427766
2.3123123123123124,-0.20753829714483102,-0.20526363268749964,0.05034232156369993
2.3273273273273274,-0.201826860950781,-0.19960198781318766,0.04998214891809184
2.3423423423423424,-0.1956320784904588,-0.19347317458629992,0.04963900247324791
2.3573573573573574,-0.18893780504228766,-0.1868620543227812,0.049324050241317446
2.3723723723723724,-0.18173441135777815,-0.1797598326570689,0.04904854015215688
2.3873873873873874,-0.1740191568022407,-0.17216440285159265,0.04882326045590485
2.4024024024024024,-0.16579643285062617,-0.16408055875566066,0.04865795827784034
2.4174174174174174,-0.15707784739706224,-0.15552004940071468,0.048560767885313834
2.4324324324324325,-0.14788212702609177,-0.14650145421088834,0.04853770915307454
2.4474474474474475,-0.13823482397145637,-0.13704986755559956,0.04859231664063815
2.4624624624624625,-0.12816782615385372,-0.12719639303459754,0.04872544861166426
2.4774774774774775,-0.11771868129748589,-0.11697746029800231,0.048935303927880223
2.4924924924924925,-0.106929758341428,-0.10643398903007645,0.04921764673370789
2.5075075075075075,-0.0958472798627109,-0.09561043467035026,0.049566210021909654
2.5225225225225225,-0.08452026691179568,-0.08455375746097737,0.04997322566781093
2.5375375375375375,-0.07299944181962285,-0.07331235985863542,0.050430014871537414
2.5525525525525525,-0.06133613495109047,-0.0619350370949725,0.05092757087330725
2.5675675675675675,-0.049581238329174306,-0.050469982061766054,0.05145707413880905
2.5825825825825826,-0.03778424322210892,-0.03896387947589421,0.052010295783461315
2.5975975975975976,-0.025992391116761458,-0.027461116416682446,0.052579863932693635
2.6126126126126126,-0.014249959020034288,-0.01600312784784174,0.05315938650636688
2.6276276276276276,-0.0025976916788702374,-0.00462788755178965,0.053743440083441424
2.6426426426426426,0.008927614176845865,0.006630452295772677,0.054327446695843676
2.6576576576576576,0.020293374623842873,0.017741775490745113,0.054907468203868874
2.6726726726726726,0.03147133807605581,0.02868007697079649,0.055479951532388924
2.6876876876876876,0.0424375684753537,0.039423408524638284,0.0560414580565467
2.7027027027027026,0.05317230306925228,0.04995370648843953,0.05658840753159481
2.7177177177177176,0.06365969684575719,0.060256513784917955,0.057116861929993885
2.7327327327327327,0.07388746633783493,0.0703206091207613,0.05762236814920385
2.7477477477477477,0.08384644598175763,0.08013755648848252,0.0580998715286518
2.7627627627627627,0.09353007077257805,0.08970118856137867,0.05854370514670166
2.7777777777777777,0.1029337997712877,0.09900703827475185,0.058947653536936505
2.7927927927927927,0.11205449614940492,0.10805173390931516,0.059305084199008214
2.8078078078078077,0.12088978088467285,0.11683237430462791,0.05960913633571639
2.8228228228228227,0.12943737884583242,0.12534590233042775,0.0598529536933118
2.8378378378378377,0.13769447766406398,0.13358849627429656,0.06002994712134343
2.8528528528528527,0.14565712127946392,0.1415550001668669,0.06013407228648266
2.8678678678678677,0.15331966114301435,0.14923841503739843,0.06016010859017213
2.8828828828828827,0.1606742885095458,0.15662947344063263,0.060103926457944774
2.8978978978978978,0.16771067084651828,0.1637163190964141,0.059962731523493316
2.9129129129129128,0.17441571390770486,0.17048431194115204,0.05973527561544983
2.9279279279279278,0.18077346833124067,0.1769159761598509,0.059422025733049326
2.942942942942943,0.1867651956428966,0.18299110477893837,0.05902528330600104
2.957957957957958,0.1923696032978481,0.18868702918058647,0.05854924698110707
2.972972972972973,0.19756325201122604,0.1939790555914588,0.05800001303312841
2.987987987987988,0.20232113136614274,0.19884106347012928,0.057385508385163625
3.003003003003003,0.2066173919247577,0.20324625315463618,0.05671535231776191
3.018018018018018,0.21042621428253552,0.20716802261918563,0.0560006444583892
3.033033033033033,0.2137227882427155,0.21058094626930343,0.0552536788077423
3.048048048048048,0.21648436910601232,0.21346182292316418,0.05448758660032817
3.063063063063063,0.21869137347989945,0.21579075596859712,0.05371591487220377
3.078078078078078,0.22032847441000294,0.21755222651173342,0.05295215273265536
3.093093093093093,0.22138565525139928,0.218736120330081,0.05220922328157675
3.108108108108108,0.22185918355117973,0.21933867158817943,0.05149896532497143
3.123123123123123,0.2217524701088064,0.2193632903351883,0.050831634601417965
3.138138138138138,0.22107678392163593,0.21882124636293757,0.05021545794321762
3.153153153153153,0.21985180036337396,0.21773218851018206,0.049656274399314214
3.168168168168168,0.21810596705616228,0.2161244853432401,0.04915729388334962
3.183183183183183,0.21587667885629955,0.21403537973174544,0.04871899611331377
3.198198198198198,0.21321025963260917,0.2115109556692886,0.04833918117953118
3.2132132132132134,0.2101617536731513,0.20860592040944229,0.04801316967203606
3.2282282282282284,0.20679453339444484,0.20538320842869637,0.04773413717293394
3.2432432432432434,0.20317973253158494,0.20191341591014614,0.04749355731959308
3.2582582582582584,0.1993955153270231,0.1982740755587049,0.04728172117158208
3.2732732732732734,0.19552619272718125,0.19454878193614822,0.04708829881868276
3.2882882882882885,0.1916611966494459,0.19082617754737494,0.04690291151195991
3.3033033033033035,0.1878939234374369,0.18719881004132882,0.046715687760664176
3.3183183183183185,0.18432045808726794,0.1837618714939812,0.04651778317611538
3.3333333333333335,0.1810381920211102,0.18061183210664558,0.04630184985461819
3.3483483483483485,0.17814434929465475,0.1778449829387672,0.04606244569230111
3.3633633633633635,0.1757344391820233,0.17555590550232647,0.04579637665243224
3.3783783783783785,0.17390065694887438,0.17383589001568983,0.045502965566960193
3.3933933933933935,0.1727302590097547,0.17277132853987293,0.045184239810528506
3.4084084084084085,0.1723039431503495,0.17244211367258108,0.04484502764722242
3.4234234234234235,0.17269426857790893,0.17292007745476642,0.044492949924676714
3.4384384384384385,0.17396415371638768,0.17426750813329825,0.04413829099324467
3.4534534534534536,0.1761654913951173,0.1765357839487904,0.043793731436403686
3.4684684684684686,0.17933792099633158,0.1797641628112823,0.043473926870329575
3.4834834834834836,0.1835077949818181,0.18397876437465155,0.04319492332854506
3.4984984984984986,0.18868737295219734,0.18919177659851047,0.04297341200334684
3.5135135135135136,0.19487427014437517,0.19540091256953096,0.04282584486448866
3.5285285285285286,0.20205117937561382,0.20258913550552823,0.04276745657035007
3.5435435435435436,0.2101858763872523,0.21072466099788412,0.04281126319539683
3.5585585585585586,0.21923150892481066,0.2197612362667044,0.04296712820819364
3.5735735735735736,0.22912716035385428,0.22963868713811633,0.04324099349490837
3.5885885885885886,0.23979866976737765,0.24028371518823302,0.04363436262773091
3.6036036036036037,0.2511596829196069,0.2516109205095104,0.04414409461125029
3.6186186186186187,0.2631129023193678,0.26352402016753734,0.04476252490882506
3.6336336336336337,0.2755515006701352,0.27591722878269026,0.045477887199374484
3.6486486486486487,0.2883606596237713,0.2886767657776347,0.046274975057538546
3.6636636636636637,0.3014191954383793,0.3016824535234221,0.04713596467739702
3.6786786786786787,0.31460123438982984,0.3148093716402483,0.04804131882487418
3.6936936936936937,0.3277779033855225,0.32792953475948466,0.0489707040476607
3.7087087087087087,0.3408190048230122,0.3409135638230151,0.049903870953789634
3.7237237237237237,0.3535946489670884,0.3536323242074544,0.05082146475917476
3.7387387387387387,0.3659768216454856,0.36595850739153624,0.051705746292305683
3.7537537537537538,0.37784086958062174,0.37776813637054496,0.05254121090561054
3.7687687687687688,0.3890668899274071,0.38894197844897405,0.05331509501237082
3.7837837837837838,0.39954101437386647,0.3993668523319818,0.054017759088900164
3.798798798798799,0.4091565813368292,0.4089368195219253,0.05464293408266048
3.813813813813814,0.41781519225779856,0.4175542528408888,0.0551878171402278
3.828828828828829,0.4254276497365872,0.42513077736670934,0.055653003828561864
3.843843843843844,0.43191477624673086,0.43158808110718566,0.05604224844060348
3.858858858858859,0.4372081125244701,0.4368585942730606,0.056362051887486844
3.873873873873874,0.4412504945309906,0.4408860370058075,0.05662108788546655
3.888888888888889,0.44399650732302487,0.4436258358870464,0.05682949187791083
3.903903903903904,0.44541281343837125,0.4450454095916038,0.05699805200546298
3.918918918918919,0.44547835274654035,0.4451243238130626,0.057137355450761235
3.933933933933934,0.44418441037567447,0.4438543153235625,0.05725695417768888
3.948948948948949,0.44153454953419724,0.4412391850014968,0.05736461891915065
3.963963963963964,0.4375444069856026,0.43729456014129564,0.057465747226010576
3.978978978978979,0.43224135072318737,0.43204752756542625,0.057562979667578104
3.993993993993994,0.42566400205098887,0.42553614110769156,0.057656058784239225
4.009009009009009,0.41786162772337365,0.41780880991358815,0.05774194082131148
4.024024024024024,0.4088934118335072,0.4089235775460813,0.05781514454414385
4.039039039039039,0.3988276214769505,0.39894730579718674,0.057868298716706
4.054054054054054,0.3877406844832827,0.3879547809912102,0.05789283343994838
4.069069069069069,0.3757162013005317,0.37602776398224164,0.057879752190116734
4.084084084084084,0.3628439160355845,0.36325400756989074,0.057820420950480504
4.099099099099099,0.349218673350757,0.3497262663315242,0.057707316721520185
4.114114114114114,0.3349393881373825,0.3355413236653952,0.05753468759800907
4.129129129129129,0.3201080535000331,0.3207990590752501,0.057299088153090684
4.1441441441441444,0.3048288095982349,0.3056015754749244,0.05699976518812211
4.1591591591591595,0.2892070914571696,0.29005240176359043,0.05663887883715498
4.1741741741741745,0.27334886825227184,0.27425578044185195,0.05622155213684443
4.1891891891891895,0.25735998017438183,0.25831604400285435,0.05575574867326616
4.2042042042042045,0.24134557223708625,0.2423370776724783,0.05525198340544117
4.2192192192192195,0.2254096177694819,0.22642186021778785,0.05472287707502894
4.2342342342342345,0.20965451830994122,0.21067206939043936,0.05418257059540114
4.2492492492492495,0.1941807616014591,0.19518773446350787,0.05364602311145349
4.2642642642642645,0.1790866157411747,0.18006691552673934,0.053128226200012736
4.2792792792792795,0.1644678355223558,0.16540538791487647,0.05264337637599169
4.2942942942942945,0.1504173567931847,0.15129631045616285,0.05220405723891572
4.3093093093093096,0.13702495630162062,0.13782985814992535,0.051820489015484916
4.324324324324325,0.12437685794485279,0.12509280332488518,0.05149990439098414
4.33933933933934,0.1125552714264951,0.11316803410991973,0.05124610334783585
4.354354354354355,0.10163785576190158,0.10213400489081761,0.051059225661862266
4.36936936936937,0.09169710747112156,0.09206411997018676,0.050935759242208306
4.384384384384385,0.08279968117300712,0.08302605846285108,0.05086877912336858
4.3993993993994,0.07500565808107428,0.07508105506696999,0.05084839016369731
4.414414414414415,0.06836778499744699,0.06828315725439614,0.05086233050758157
4.42942942942943,0.06293071220284592,0.06267848414436505,0.05089668502549241
4.444444444444445,0.05873026260097241,0.05830451544669772,0.05093665830010344
4.45945945945946,0.05579276616264769,0.055189440074979876,0.05096736326346565
4.474474474474475,0.05413449286891519,0.05335159317365664,0.05097459119448431
4.48948948948949,0.05376121393183552,0.052799007387908534,0.05094553834931749
4.504504504504505,0.054667915280604475,0.05352909943144567,0.05086947173707105
4.51951951951952,0.056838679585584834,0.055528506753859466,0.05073832034829494
4.534534534534535,0.06024674411065352,0.058773081902709565,0.05054717844764148
4.54954954954955,0.06485473223840424,0.06322804463960265,0.05029470506475351
4.564564564564565,0.0706150474670241,0.06884828465850254,0.049983399680994904
4.57957957957958,0.07747041085821699,0.07557880148208818,0.04961972961293275
4.594594594594595,0.08535451701496147,0.08335526328340218,0.04921408113979917
4.60960960960961,0.09419278016652864,0.09210466333835851,0.048780505581986544
4.624624624624625,0.10390314105288279,0.1017460517075652,0.04833623514753298
4.63963963963964,0.11439690696814724,0.11219132051754456,0.04790095349274247
4.654654654654655,0.1255796012183362,0.12334602361898879,0.04749582451093391
4.66966966966967,0.13735180383397952,0.1351102150507521,0.047142310727561726
4.684684684684685,0.14960997197188855,0.14737929514248513,0.04686084823540207
4.6996996996997,0.16224723529695742,0.1600448577159064,0.04666948289359227
4.714714714714715,0.17515416802532802,0.17299553618125438,0.046582602907083374
4.72972972972973,0.188219544591492,0.18611784992382774,0.046609914029134746
4.744744744744745,0.20133108957287732,0.19929705489093713,0.04675578590605888
4.75975975975976,0.2143762342435487,0.2124180035031871,0.047019049731927394
4.774774774774775,0.22724289180935017,0.22536601884257298,0.04739325762246167
4.78978978978979,0.23982026107415588,0.23802778656294993,0.04786734112412313
4.804804804804805,0.2519996642607318,0.2502922652966762,0.04842655005834318
4.81981981981982,0.26367541937811445,0.2620516127668437,0.0490535269848315
4.834834834834835,0.2747457414293263,0.2732021207073503,0.049729379259406126
4.84984984984985,0.28511366050163306,0.2836451474430146,0.05043464208667242
4.864864864864865,0.29468793901051415,0.2932880330087576,0.051150069183775265
4.87987987987988,0.3033839656765068,0.302044978398742,0.05185723029889649
4.894894894894895,0.31112460070845377,0.30983786829710663,0.0525389285275742
4.90990990990991,0.3178409455134682,0.3165970157397744,0.053179471592967285
4.924924924924925,0.3234730112387304,0.32226180777516744,0.053764840202936724
4.93993993993994,0.32797026355513764,0.3267812333865861,0.054282795619556304
4.954954954954955,0.33129202609347924,0.330114278625039,0.054722960832117175
4.96996996996997,0.3334077314272741,0.3322301788494896,0.05507689832660037
4.984984984984985,0.3342970159008495,0.3331085238219255,0.05533819504133225
5,0.3339496622710078,0.3327392176928291,0.05550255370966569
5.015015015015015,0.33236540138325743,0.3311223021108318,0.05556788077446358
5.03003003003003,0.3295535902990718,0.3282676562575921,0.055534355147692144
5.045045045045045,0.3255327888960829,0.3241945920478506,0.055404459466557074
5.06006006006006,0.32033025960494665,0.3189313656450405,0.05518295592055334
5.075075075075075,0.31398141544631747,0.31251462756996645,0.0548767916603011
5.09009009009009,0.30652923991868253,0.3049888329454787,0.05449492358138543
5.105105105105105,0.29802369879601337,0.29640563093728456,0.05404805823464096
5.12012012012012,0.28852115893276215,0.28682324851693985,0.05354830917214803
5.135135135135135,0.27808382328757597,0.27630587874136753,0.05300878075552737
5.15015015015015,0.26677918519250154,0.26492307837700213,0.05244309400804236
5.165165165165165,0.25467949905881765,0.2527491745098658,0.05186487620847663
5.18018018018018,0.2418612598301609,0.23986267537204065,0.05128724126709715
5.195195195195195,0.22840468007418527,0.22634567749270543,0.05072229199818903
5.21021021021021,0.214393152000487,0.2122832598153938,0.05018067751818216
5.225225225225225,0.19991268207098958,0.19776285578863328,0.04967123833687276
5.24024024024024,0.18505128818617458,0.18287359659378277,0.0492007675373047
5.255255255255255,0.16989835343450405,0.16770562236376876,0.048773908411067345
5.27027027027027,0.1545439356449291,0.15234936302090415,0.048393197373108536
5.285285285285285,0.13907803790277454,0.1368947956341209,0.04805924710977496
5.3003003003003,0.12358985111651194,0.12143069031207852,0.04777105063483219
5.315315315315315,0.10816698498783558,0.10604386096984851,0.047526374503173006
5.33033033033033,0.09289470773860231,0.09081844028930564,0.0473222009117206
5.345345345345345,0.07785521721941929,0.07583519945397724,0.047155175121209605
5.36036036036036,0.0631269662871245,0.06117093259870817,0.04702201685305701
5.375375375375375,0.04878406352850558,0.04689792341127916,0.046919861330811934
5.39039039039039,0.03489576667922725,0.033083507197066736,0.04684650598909633
5.405405405405405,0.021526080786994514,0.01978973637055909,0.046800550781509
5.42042042042042,0.008733466791357083,0.007073151276106104,0.04678143176479478
5.435435435435435,-0.0034293406768788814,-0.005015347985171782,0.04678935784245926
5.45045045045045,-0.014915414226992675,-0.016430538900466956,0.04682516831062122
5.465465465465465,-0.025683627384099145,-0.02713283825497129,0.04689013373503497
5.48048048048048,-0.035698579907254994,-0.037088207200468175,0.046985724684995074
5.495495495495495,-0.04493047698435988,-0.04626802101072057,0.04711337225272253
5.51051051051051,-0.05335498609799179,-0.05464892558382049,0.04727424159915389
5.525525525525525,-0.06095309505493021,-0.0622127018667345,0.047469035606668576
5.54054054054054,-0.06771099256328432,-0.0689461569651953,0.04769784073873109
5.555555555555555,-0.07361998900128258,-0.0748410569441523,0.04796002202591748
5.57057057057057,-0.07867648993018958,-0.07989411147689154,0.04825416925088192
5.585585585585585,-0.08288202882015787,-0.0841070148805112,0.04857809229801349
5.6006006006006,-0.08624335879893598,-0.08748654204051666,0.04892886052261479
5.615615615615615,-0.08877259644937757,-0.0900446916622825,0.049302878978966944
5.63063063063063,-0.09048740423188173,-0.09179886358335762,0.049695993382466795
5.645645645645645,-0.09141119243542663,-0.09277205191546664,0.050103615607670904
5.66066066066066,-0.09157331706696228,-0.09299303189952872,0.0505208621025016
5.675675675675675,-0.09100924710710598,-0.09249651583270783,0.05094269855436422
5.6906906906906904,-0.08976067333166161,-0.0913232524640606,0.051364085209413345
5.7057057057057055,-0.08787553155227441,-0.08952004495710499,0.05178011820163019
5.7207207207207205,-0.08540791566780598,-0.08713966487639604,0.05218616295177697
5.7357357357357355,-0.08241786021109623,-0.08424064355158341,0.05257797610208193
5.7507507507507505,-0.07897097786772991,-0.08088692738157396,0.05295181261283384
5.7657657657657655,-0.07513794436814968,-0.07714738984850254,0.05330451469357974
5.7807807807807805,-0.07099383076262468,-0.07309519983481004,0.053633579349254536
5.7957957957957955,-0.0666172908824004,-0.06880705285702443,0.05393720166001512
5.8108108108108105,-0.062089619262899576,-0.0643622786195027,0.05421429159753324
5.8258258258258255,-0.05749370148051445,-0.05984184444547873,0.05446446323176346
5.8408408408408405,-0.05291288432577393,-0.05532727930630717,0.054687996515441394
5.8558558558558556,-0.048429797193058156,-0.05089954706022084,0.054885773272566336
5.870870870870871,-0.04412515831952741,-0.04663789993595053,0.05505919033957896
5.885885885885886,-0.04007659999004533,-0.04261874416034195,0.055210053807888695
5.900900900900901,-0.03635754560228177,-0.03891454894118789,0.05534045886661606
5.915915915915916,-0.033036168730823316,-0.03559282788373809,0.055452659839328136
5.930930930930931,-0.030174460305508164,-0.03271521853548675,0.05554893477199348
5.945945945945946,-0.02782742505458978,-0.030336681381750115,0.055631448581714434
5.960960960960961,-0.02604242281668208,-0.02850483456308027,0.05570211856695693
5.975975975975976,-0.024858664556206035,-0.027259435183209575,0.05576248620738307
5.990990990990991,-0.024306867256709306,-0.02663201264363545,0.05581359971735571
6.006006006006006,-0.02440906659512713,-0.02664565426562132,0.05585591267036
6.021021021021021,-0.02517858163026468,-0.02731493877567742,0.055889204936426656
6.036036036036036,-0.026620121807022824,-0.0286460092018873,0.05591253282943947
6.051051051051051,-0.028730023444603365,-0.030636773447460023,0.05592421539853524
6.066066066066066,-0.03149660053418678,-0.0332772182957338,0.05592186296146169
6.081081081081081,-0.03490059305696882,-0.036549820818824366,0.05590245217641574
6.096096096096096,-0.03891569504853785,-0.040430040028698995,0.05586244928507699
6.111111111111111,-0.04350914416624703,-0.04488687102056953,0.05579797990569525
6.126126126126126,-0.048642354452776024,-0.049883443708470074,0.055705040286097955
6.141141141141141,-0.05427157424326529,-0.055377648452892524,0.05557974163068075
6.156156156156156,-0.06034855168075136,-0.06132277137215829,0.055418576311752454
6.171171171171171,-0.0668211910700814,-0.06766812289204346,0.05521869265982591
6.186186186186186,-0.07363418433696242,-0.07435964413817828,0.05497816366024182
6.201201201201201,-0.08072960321866479,-0.08134047715786616,0.05469623421814528
6.216216216216216,-0.08804743956346096,-0.08855148673172167,0.05437353159108497
6.231231231231231,-0.09552608332109892,-0.09593172375686145,0.05401222404023259
6.246246246246246,-0.10310273050756513,-0.1034188228855228,0.05361611369511839
6.261261261261261,-0.11071371662452924,-0.11094933027942744,0.0531906511394957
6.276276276276276,-0.11829477465433921,-0.11845896093286226,0.05274286148835553
6.291291291291291,-0.12578122072303793,-0.12588278891181187,0.05228117499768169
6.306306306306306,-0.13310807465780236,-0.1331553778846088,0.05181515980916144
6.321321321321321,-0.14021012674670938,-0.14021086327106413,0.05135516048871562
6.336336336336336,-0.14702196579481816,-0.1469830009753734,0.05091185357692025
6.351351351351351,-0.1534779868117767,-0.15340520075149353,0.05049574008990229
6.366366366366366,-0.15951239912992918,-0.15941056455242805,0.05011660397432798
6.381381381381381,-0.16505925724318823,-0.16493195154769863,0.049782973598282154
6.396396396396396,-0.17005253703469744,-0.16990209171952209,0.049501628736478474
6.411411411411412,-0.17442627924832815,-0.17425376899472053,0.04927719643719357
6.426426426426427,-0.178114820044635,-0.17792009273063225,0.049111874395125286
6.441441441441442,-0.18105312531897902,-0.18083487310921964,0.04900530980879208
6.456456456456457,-0.18317724125689502,-0.18293311172163151,0.048954646362296225
6.471471471471472,-0.18442486851391637,-0.1841516135092949,0.04895473439111447
6.486486486486487,-0.18473606162412634,-0.18442972046416325,0.04899848258672401
6.501501501501502,-0.18405404898025915,-0.18371016129876497,0.04907731666544425
6.516516516516517,-0.1823261622248743,-0.18194000490856727,0.04918170314647029
6.531531531531532,-0.17950485739887456,-0.1790716991060301,0.04930169518376046
6.546546546546547,-0.17554880397535844,-0.1750641700568508,0.049427461365088146
6.561561561561562,-0.1704240122378568,-0.16988395235259995,0.049549765774632076
6.576576576576577,-0.16410496462281238,-0.16350631497780108,0.04966037645303637
6.591591591591592,-0.15657571291495986,-0.1559163448474231,0.049752388043750595
6.606606606606607,-0.1478309008258804,-0.14710994737389227,0.049820451853967
6.621621621621622,-0.13787667073507576,-0.13709472292288727,0.04986091238372814
6.636636636636637,-0.12673141441324443,-0.1258906792431169,0.04987185367733211
6.651651651651652,-0.11442633048898086,-0.11353074314316003,0.04985306198492686
6.666666666666667,-0.10100575627572372,-0.10006103987071295,0.04980591360313321
6.681681681681682,-0.08652724824221669,-0.08554091572714623,0.04973319870594205
6.696696696696697,-0.07106139365548693,-0.07004268817371888,0.049638893616369924
6.711711711711712,-0.05469134538977307,-0.053651117651542554,0.04952789525853157
6.726726726726727,-0.03751208210059212,-0.036462606002431314,0.0494057322985561
6.741741741741742,-0.019629406342745577,-0.018584137094876746,0.04927826753462343
6.756756756756757,-0.0011587031471355599,-1.319853303981784e-4,0.04915140531343608
6.771771771771772,0.017776509553718425,0.01876977355225664,0.04903081617203286
6.786786786786787,0.03704620001012901,0.0379909081409005,0.04892168875072287
6.801801801801802,0.056515567434758364,0.057396787802473294,0.04882851665430234
6.816816816816817,0.07604686586726389,0.07685020241802686,0.048754925752748535
6.831831831831832,0.095501260213643,0.09621319870508577,0.04870354572199711
6.846846846846847,0.11474066966247298,0.11534888967768293,0.0486759285525487
6.861861861861862,0.13362955793447973,0.13412319907101794,0.048672516183326034
6.876876876876877,0.15203663578275933,0.15240650931226563,0.04869265902682268
6.891891891891892,0.16983644827260858,0.17007518920855544,0.04873468650370036
6.906906906906907,0.186910827008412,0.18701298528036028,0.048796029385476045
6.921921921921922,0.20315019500630102,0.20311226796411574,0.04887339148474729
6.936936936936937,0.2184547187466704,0.2182751302022292,0.04896296499835008
6.951951951951952,0.23273530758611832,0.23241434082065557,0.04906067982433201
6.966966966966967,0.24591446480257811,0.24545415830435072,0.0491624728910693
6.981981981981982,0.2579269968867257,0.2573310120208271,0.04926455956404456
6.996996996996997,0.26872058824287803,0.2679940576714382,0.049363686203985645
7.012012012012012,0.27825624735627347,0.27740561197378344,0.04945734158244703
7.027027027027027,0.28650862800638904,0.28554146862719515,0.04954390565138547
7.042042042042042,0.29346622567152625,0.2923910939165327,0.049622717464801236
7.057057057057057,0.2991314453850581,0.29795769636628777,0.049694049967152036
7.072072072072072,0.3035205335277486,0.30225816120053933,0.049758987680775184
7.087087087087087,0.30666336293670693,0.3053228375218788,0.04981921344593305
7.102102102102102,0.30860305879765904,0.30719516457338175,0.04987672127635041
7.117117117117117,0.30939545248516537,0.30793112357753466,0.04993348268724351
7.132132132132132,0.30910835210575516,0.30759850370402847,0.049991101884422164
7.147147147147147,0.307820622084778,0.30627597478043245,0.05005049935439426
7.162162162162162,0.3056210696236669,0.304051965305274,0.05011166245392256
7.177177177177177,0.30260714294316104,0.3010233518287581,0.050173495138870865
7.192192192192192,0.2988834544410563,0.29729397432383586,0.050233787612394484
7.207207207207207,0.29456015061003477,0.2929730011269881,0.050289312061454775
7.222222222222222,0.2897511590802507,0.2881731756492698,0.0503360351599865
7.237237237237237,0.28457235076095033,0.2830089846042536,0.05036942419723327
7.252252252252252,0.27913966110848965,0.2775947933077598,0.05038481367125494
7.267267267267267,0.27356721853140026,0.2720429971626071,0.050377794227712526
7.282282282282282,0.2679655295285938,0.2664622394453912,0.050344586132539525
7.297297297297297,0.2624397692306159,0.2609557438919004,0.05028236432610634
7.312312312312312,0.2570882226782785,0.25561980649677774,0.050189510192276694
7.327327327327327,0.25200091672199965,0.25054248476518454,0.050065774942217534
7.342342342342342,0.24725847529853676,0.24580251488856422,0.04991234951367782
7.357357357357357,0.24293122256612032,0.2414684785486438,0.04973184497052791
7.372372372372372,0.23907854950431226,0.23759823187597257,0.04952819476288401
7.387387387387387,0.23574855062712874,0.23423860003980004,0.04930649541365901
7.402402402402402,0.2329779288528671,0.23142533246412728,0.049072805031295325
7.4174174174174174,0.23079215865059785,0.22918330606607482,0.04883391950337497
7.4324324324324325,0.2292058905542654,0.2275269573850482,0.04859714445423455
7.4474474474474475,0.22822357410688218,0.22646091908696261,0.0483700773656124
7.4624624624624625,0.22784027129208095,0.22598083206981293,0.04816040916002214
7.4774774774774775,0.22804262849766394,0.22607430118990493,0.0479757487257236
7.4924924924924925,0.22880997198723757,0.22672196037360248,0.04782346818315129
7.5075075075075075,0.23011548969221904,0.22789861148519264,0.04771056209938521
7.5225225225225225,0.2319274608713687,0.22957440072582813,0.04764351122199581
7.5375375375375375,0.2342104948521146,0.23171599652296893,0.04762814123512605
7.5525525525525525,0.2369267407379511,0.23428773386126747,0.04766946970018353
7.5675675675675675,0.24003703172827753,0.23725269186581333,0.04777153932744183
7.5825825825825826,0.2435019306316625,0.24057367425159407,0.04793724207000121
7.597597597597598,0.24728264729960162,0.2442140660570456,0.04816814487188661
7.612612612612613,0.25134180403046974,0.24813854489346637,0.04846433276411424
7.627627627627628,0.25564403135940067,0.2523136306954846,0.04882428717392514
7.642642642642643,0.260156383816648,0.256708064480673,0.049244816176063834
7.657657657657658,0.2648485728590947,0.26129301364407753,0.049721049134262243
7.672672672672673,0.2696930218336028,0.2660421084601737,0.050246501658987544
7.687687687687688,0.27466475505699883,0.2709313213167986,0.05081320942544915
7.702702702702703,0.2797411394511329,0.2759387063289382,0.05141192262107768
7.717717717717718,0.28490150227698624,0.2810440219855651,0.0520323477933213
7.732732732732733,0.2901266521093228,0.28622826307850124,0.05266342126804354
7.747747747747748,0.29539833217000955,0.2914731301945081,0.05329359812519162
7.762762762762763,0.3006986355383956,0.29676046552459834,0.053911142488413666
7.777777777777778,0.30600941077175897,0.30207168281574015,0.054504407880522215
7.792792792792793,0.3113116844017589,0.3073872172444721,0.05506209984855339
7.807807807807808,0.3165851239963302,0.3126860181959291,0.055573516329707695
7.822822822822823,0.3218075623764285,0.317945104778877,0.05602876388344373
7.837837837837838,0.32695460050255865,0.3231392007617912,0.05641894974723697
7.852852852852853,0.33199930376447073,0.3282404627639267,0.056736350657233696
7.867867867867868,0.33691200407407124,0.3332183131528968,0.05697455960549477
7.882882882882883,0.34166021830416865,0.33803938722973403,0.057128611342964646
7.897897897897898,0.34620869213427674,0.34266760283417574,0.057195086663732166
7.912912912912913,0.3505195770466967,0.347064359268824,0.05717219449989738
7.927927927927928,0.35455274676415094,0.3511888711226056,0.05705982978102572
7.942942942942943,0.3582662574893455,0.35499864082100113,0.05685960401586622
7.957957957957958,0.3616169535519338,0.35845007118817557,0.05657484477235458
7.972972972972973,0.3645612161960526,0.36149921566808907,0.056210559791016725
7.987987987987988,0.3670558480658485,0.36410265891647514,0.05577336148243231
8.003003003003004,0.36905907944206834,0.366218514200713,0.055271348130841544
8.018018018018019,0.3705316746308717,0.36780751659400207,0.054713939325159555
8.033033033033034,0.3714381085217639,0.36883418272352764,0.05411166499459958
8.048048048048049,0.37174777486666666,0.36926799947062444,0.053475909907517494
8.063063063063064,0.3714361801404599,0.36908459637490315,0.05281861849129237
8.078078078078079,0.37048607090708896,0.3682668505518375,0.05215196815281367
8.093093093093094,0.3688884394299624,0.3668058697048144,0.05148802263915363
8.108108108108109,0.3666433526957356,0.36470179918432494,0.05083838001563003
8.123123123123124,0.363760554645767,0.36196440361997445,0.050213832147299846
8.138138138138139,0.3602598003843929,0.3586133825970589,0.0496240537475777
8.153153153153154,0.3561708940980867,0.3546783928128936,0.04907733877119093
8.168168168168169,0.35153341848190767,0.3501987652240432,0.04858039998637115
8.183183183183184,0.3463961612745463,0.345222923501743,0.048138243975197906
8.198198198198199,0.3408162623894546,0.3398075279500272,0.047754128831731975
8.213213213213214,0.33485812134696014,0.3340163851234928,0.04742960593368465
8.228228228228229,0.3285921176661233,0.3279191760906691,0.0471646410003248
8.243243243243244,0.3220932053487891,0.3215900644072904,0.046957803924699615
8.258258258258259,0.31543944590390793,0.3151062477395005,0.046806512226821244
8.273273273273274,0.30871054244989793,0.30854651469244204,0.046707309884544704
8.288288288288289,0.30198643081091736,0.30198986133402755,0.046656161979390716
8.303303303303304,0.2953459731737616,0.29551421120824806,0.046648745999339096
8.318318318318319,0.2888657870809571,0.28919526964804165,0.046680722498655396
8.333333333333334,0.282619228700193,0.2831055293567603,0.04674797071025871
8.348348348348349,0.2766755357659698,0.27731343087432536,0.04684677817299509
8.363363363363364,0.2710991234761803,0.27188266980366493,0.04697397704436434
8.378378378378379,0.2659490168066485,0.26687163337323977,0.047127023186038765
8.393393393393394,0.26127839573740164,0.26233294256317924,0.04730401713018239
8.408408408408409,0.257134226029189,0.25831307283892246,0.047503668585101876
8.423423423423424,0.25355694745823976,0.2548520264772925,0.04772520825762628
8.438438438438439,0.2505801936165356,0.251983032292749,0.04796825257665209
8.453453453453454,0.2482305221598511,0.2497322538748739,0.04823262856040528
8.468468468468469,0.24652714125398187,0.24811849470305258,0.04851816774135398
8.483483483483484,0.24548162634054932,0.24715289707278887,0.04882447986138882
8.498498498498499,0.24509763052857697,0.24683864091485114,0.049150718992079005
8.513513513513514,0.24537060113995873,0.24717065749728817,0.04949535669534151
8.528528528528529,0.24628752335376466,0.2481353808063311,0.04985597852845106
8.543543543543544,0.24782671864254155,0.24971056524801635,0.05022912117308144
8.558558558558559,0.24995772996089502,0.25186520143283136,0.05061016720663637
8.573573573573574,0.25264132676868534,0.25455956163198085,0.0509933125487016
8.588588588588589,0.2558296605439075,0.25774540276365604,0.05137161761085076
8.603603603603604,0.25946659542344064,0.2613663476148313,0.051737147195737423
8.618618618618619,0.26348822939557254,0.2653584550023032,0.052081196692689576
8.633633633633634,0.2678236098912407,0.26965097771471114,0.05239459396249006
8.64864864864865,0.27239563489010626,0.27416729465556666,0.05266805861667609
8.663663663663664,0.2771221182100726,0.2788259920655316,0.0528925943372998
8.67867867867868,0.281916986946659,0.2835420594048221,0.053059886397795866
8.693693693693694,0.2866915713318228,0.288228159498527,0.05316267615854372
8.70870870870871,0.2913559434468958,0.2927959305037826,0.05319508701837416
8.723723723723724,0.29582026156875746,0.29715727921370083,0.05315288159498702
8.73873873873874,0.29999608119068744,0.30122563069243374,0.05303363689689468
8.753753753753754,0.30379760116043414,0.30491710732060007,0.052836831874496615
8.76876876876877,0.3071428227657139,0.30815161982497946,0.052563848969954675
8.783783783783784,0.30995460964098986,0.31085386249146557,0.052217897303469075
8.7987987987988,0.31216164576121724,0.31295421333402046,0.05180386942743078
8.813813813813814,0.31369929641684674,0.31438954657219637,0.051328145978391
8.82882882882883,0.31451038213321436,0.31510396873667446,0.050798363189070675
8.843843843843844,0.3145458775831462,0.31504949080831346,0.050223157437422054
8.85885885885886,0.3137655465948148,0.31418664706511795,0.04961189927632338
8.873873873873874,0.3121385206631086,0.3124850671090459,0.04897442719901306
8.88888888888889,0.3096438224890895,0.30992400143543614,0.04832078918802844
8.903903903903904,0.3062708287563237,0.30649279361187914,0.04766099818865398
8.91891891891892,0.3020196584935051,0.30219128446739596,0.04700480620820256
8.933933933933934,0.2969014659229739,0.29703012651862953,0.046361500771784456
8.94894894894895,0.29093861060866566,0.2910309810347265,0.045739726816827156
8.963963963963964,0.2841646738814205,0.28422656646621597,0.045147336534079055
8.97897897897898,0.2766242896803279,0.27666052611621517,0.044591268890367713
8.993993993993994,0.268372760628807,0.26838708540680223,0.04407745940291112
9.00900900900901,0.2594754365823149,0.25947047511865196,0.04361077915637683
9.024024024024024,0.2500068428851875,0.2499841064566704,0.04319500027652513
9.03903903903904,0.24004955858638433,0.24000949624083204,0.0428327835295605
9.054054054054054,0.2296928599067369,0.22963495507670542,0.042525682937328724
9.06906906906907,0.21903115999722236,0.21895406682070892,0.042274162724337386
9.084084084084084,0.2081622909349388,0.2080640025779405,0.04207762367471016
9.0990990990991,0.19718568638870018,0.19706372532904218,0.04193443875930451
9.114114114114114,0.1862005320391873,0.18605215065807845,0.04184200094714365
9.12912912912913,0.17530395462234583,0.17512633383270626,0.04179678845911775
9.144144144144144,0.16458931887494632,0.16437975303270677,0.04179445346621207
9.15915915915916,0.15414469480783544,0.15390075277761173,0.04182993891267252
9.174174174174174,0.14405154632772038,0.143771201116032,0.04189762490742831
9.18918918918919,0.1343836774802344,0.13406539998656505,0.04199150171511649
9.204204204204204,0.12520645602071293,0.12484927179695794,0.04210536187972206
9.21921921921922,0.1165763172592858,0.11617982831765977,0.04223300051347405
9.234234234234235,0.1085405356829261,0.10810491201882261,0.04236841103993304
9.24924924924925,0.10113723894665358,0.1006631863196886,0.04250596394919156
9.264264264264265,0.09439562926194633,0.09388434080393844,0.04264055816435181
9.27927927927928,0.08833637136088933,0.08778947077137679,0.04276773784654219
9.294294294294295,0.08297210403034665,0.08239158759074477,0.04288377116483983
9.30930930930931,0.07830803330309155,0.07769621686201113,0.042985691076850234
9.324324324324325,0.07434256914048985,0.07370204479180664,0.04307130104431756
9.33933933933934,0.07106797310174903,0.07040157868449468,0.04313915061576347
9.354354354354355,0.06847099130575991,0.06778179426471254,0.04318848691933588
9.36936936936937,0.0665334542493989,0.06582474993316377,0.043219188439917164
9.384384384384385,0.06523283215602595,0.06450815538025541,0.043231687190998735
9.3993993993994,0.06454274102840496,0.0638058887426592,0.04322688472942911
9.414414414414415,0.0644334001463402,0.06368846232925832,0.04320606656610364
9.42942942942943,0.0648720461802497,0.06412344164010823,0.043170818518506876
9.444444444444445,0.06582331229112692,0.06507582584065331,0.04312294750842004
9.45945945945946,0.06724958253972252,0.06650840000640593,0.04306440827658451
9.474474474474475,0.06911133267866755,0.0683820703588621,0.04299723650060481
9.48948948948949,0.07136746803975438,0.07065619345807567,0.04292348790372215
9.504504504504505,0.07397566787647188,0.07328890902488086,0.042845182189166546
9.51951951951952,0.07689274332744736,0.07623748389178658,0.04276425010838874
9.534534534534535,0.0800750133029193,0.0794586717122143,0.042682481768973816
9.54954954954955,0.08347869926228492,0.08290908970996112,0.04260147450875479
9.564564564564565,0.087060336270904,0.08654561017179861,0.04252257938496042
9.57957957957958,0.09077719414818432,0.09032576084903249,0.04244684657973103
9.594594594594595,0.09458769921477926,0.09420812522716408,0.04237497175393398
9.60960960960961,0.09845184438963815,0.09815273103280195,0.04230724743082614
9.624624624624625,0.10233157344083837,0.10212141363328776,0.04224352558107379
9.63963963963964,0.10619112428379333,0.1060781403507944,0.0421831993242892
9.654654654654655,0.10999731650757491,0.10998928227715236,0.04212521260900397
9.66966966966967,0.11371976986225175,0.11382382194628377,0.04206810644586863
9.684684684684685,0.1173310432098065,0.11755348808223694,0.042010108425229196
9.6996996996997,0.12080668725493605,0.12115281235554319,0.04194926874310658
9.714714714714715,0.12412520893698531,0.12459910731225361,0.04188364096992904
9.72972972972973,0.12726795029165142,0.127872368990273,0.041811499808812276
9.744744744744745,0.13021888943802548,0.1309551117971779,0.04173158184016358
9.75975975975976,0.1329643756685302,0.1338321466259093,0.04164332960995425
9.774774774774775,0.13549281402713542,0.13649031565295752,0.04154711525739773
9.78978978978979,0.13779431697050987,0.13891819864317434,0.04144441792047292
9.804804804804805,0.13986034157349353,0.14110580585489815,0.041337929897314434
9.81981981981982,0.14168333027322302,0.14304427190046431,0.041231570197593596
9.834834834834835,0.14325637149771062,0.14472556336779527,0.04113039063983518
9.84984984984985,0.1445728939593688,0.14614221090284743,0.04104036872875101
9.864864864864865,0.14562640524521983,0.14728707406080144,0.04096809260123514
9.87987987987988,0.14641028195535483,0.1481531448065008,0.04092035546254155
9.894894894894895,0.14691761535489714,0.14873339328615404,0.040903688874922246
9.90990990990991,0.14714111357468967,0.14902065754606234,0.040923874377596384
9.924924924924925,0.14707305900029077,0.14900757731888598,0.04098547937940563
9.93993993993994,0.1467053177146515,0.14868657085260562,0.04109146441058059
9.954954954954955,0.14602939670862147,0.14804985299140985,0.04124290366207864
9.96996996996997,0.14503654397710683,0.1470894922643451,0.041438849451518586
9.984984984984985,0.14371788645933778,0.14579750450684154,0.041676355366783886
10,0.14206460091425363,0.14416598043196863,0.04195065500018336
10.015015015015015,0.14006811309413444,0.1421872444828205,0.042255476488090984
10.03003003003003,0.13772032085002905,0.13985404214518743,0.04258346019138067
10.045045045045045,0.13501383695399738,0.13715975260897476,0.04292663937016078
10.06006006006006,0.13194224737286647,0.1340986231903559,0.043276941844986906
10.075075075075075,0.12850038043328302,0.1306660212465181,0.04362667347427175
10.09009009009009,0.124684581778672,0.12685869844600037,0.04396895026348276
10.105105105105105,0.12049298927786016,0.1226750612487059,0.04429805344261714
10.12012012012012,0.11592580118394472,0.11811544038164928,0.04460968964227828
10.135135135135135,0.11098552997314608,0.11318235107739873,0.04490114563315476
10.15015015015015,0.10567723355014098,0.10788073499825762,0.04517133373466365
10.165165165165165,0.10000871502870073,0.10221817423283626,0.0454207300478957
10.18018018018018,0.09399068221456643,0.09620506764559297,0.0456512133556404
10.195195195195195,0.08763685833449057,0.08985476028109278,0.04586581802358816
10.21021021021021,0.08096403653124158,0.08318361752805058,0.046068419493696756
10.225225225225225,0.07399207218326978,0.0762110373340841,0.046263375677010894
10.24024024024024,0.06674380915169291,0.06895939586952628,0.046455151176662296
10.255255255255255,0.059244938487521395,0.06145392454643102,0.046647953114240054
10.27027027027027,0.0515237907791506,0.05372251903530713,0.046845406752846194
10.285285285285285,0.04361106598192832,0.045795483682754455,0.04705029572748432
10.3003003003003,0.035539507037101355,0.03770521730479204,0.04726438557058643
10.315315315315315,0.02734352566297566,0.029485848517415904,0.047488340944495326
10.33033033033033,0.019058790235187528,0.02117283041398535,0.04772173760993583
10.345345345345345,0.010721786575431302,0.01280250541584018,0.04796316096802286
10.36036036036036,0.00236936272100891,0.004411651487446686,0.04821037527250518
10.375375375375375,-0.005961731593289405,-0.003962979327559672,0.048460542260723556
10.39039039039039,-0.014235300824273604,-0.012285119811974863,0.04871046544329315
10.405405405405405,-0.02241614608544865,-0.020519434725216022,0.04895683654669848
10.42042042042042,-0.03047048663094483,-0.028631948176598143,0.04919646312625855
10.435435435435435,-0.0383663539661813,-0.036590444326155235,0.04942646043858964
10.45045045045045,-0.04607395312461088,-0.044364835435966456,0.04964439553478338
10.465465465465465,-0.053565986237454795,-0.0519274918975931,0.0498483765858163
10.48048048048048,-0.06081793372495035,-0.059253529106727695,0.050037085261315034
10.495495495495495,-0.06780828829010835,-0.06632104598120178,0.05020975433866599
10.51051051051051,-0.07451873651703936,-0.07311130964014294,0.050366096560770526
10.525525525525525,-0.08093428245659157,-0.07960888047005645,0.05050619409644926
10.54054054054054,-0.08704330736829735,-0.08580167174143291,0.050630360781566755
10.555555555555555,-0.09283756005093607,-0.091680938374171,0.05073899154640545
10.57057057057057,-0.09831207319244728,-0.09724119063172637,0.05083241487572908
10.585585585585585,-0.10346500310231313,-0.10248003063886651,0.05091076452872022
10.6006006006006,-0.10829739314920156,-0.10739791274199534,0.05097388577696432
10.615615615615615,-0.1128128651616867,-0.11199783279070598,0.051021288893261484
10.63063063063063,-0.11701724774021811,-0.11628495617105598,0.05105215852175712
10.645645645645645,-0.12091815548712571,-0.12026619945677594,0.051065422118839764
10.66066066066066,-0.12452453806589582,-0.12394978532717554,0.05105987438373727
10.675675675675675,-0.12784622215401098,-0.1273447943288849,0.05103434821765984
10.69069069069069,-0.13089347216594147,-0.13046073955325163,0.05098791706896602
10.705705705705705,-0.13367659660402967,-0.13330719089547502,0.050920109285170295
10.72072072072072,-0.13620562573461917,-0.13589347398052826,0.050831112848017605
10.735735735735735,-0.13849008290946263,-0.13822846505221248,0.050721948878622046
10.75075075075075,-0.14053886643375085,-0.14032049734592875,0.05059459452788207
10.765765765765765,-0.14236025182286735,-0.14217738714537587,0.05045204001897376
10.78078078078078,-0.14396201615541407,-0.14380657945655637,0.050298270217034716
10.795795795795796,-0.14535167766789836,-0.14521540468818486,0.050138167617489536
10.81081081081081,-0.1465368353928583,-0.14641142955898487,0.049977340508496275
10.825825825825826,-0.14752558609223454,-0.1474028782274486,0.04982188673815756
10.84084084084084,-0.14832698944199235,-0.1481990937983797,0.04967810949219909
10.855855855855856,-0.14895154771487015,-0.14881100620358534,0.04955220626176088
10.87087087087087,-0.14941166330167763,-0.14925157015665547,0.04944995525757645
10.885885885885886,-0.149722036434266,-0.1495361365236444,0.049376424445888
10.9009009009009,-0.14989996649165116,-0.1496827220490322,0.04933572679936788
10.915915915915916,-0.1499655233117165,-0.14971214590609047,0.04933084116525217
10.93093093093093,-0.14994155998554234,-0.1496480069458666,0.049363511599603796
10.945945945945946,-0.14985354561888564,-0.1495164826972783,0.04943422976622187
10.96096096096096,-0.14972920536097933,-0.14934593994696282,0.04954229609533966
10.975975975975976,-0.14959796535610656,-0.14916635681849877,0.04968594710687396
10.99099099099099,-0.14949021174016894,-0.14900856725464645,0.049862529869415126
11.006006006006006,-0.1494363847763922,-0.14890335010770198,0.050068700949033144
11.02102102102102,-0.14946594092704102,-0.14888039594327668,0.05030062687453748
11.036036036036036,-0.14960622619466463,-0.14896719434231032,0.050554166008418173
11.05105105105105,-0.1498813124990498,-0.14918789209769995,0.050825017136063785
11.066066066066066,-0.15031085431392952,-0.1495621774674993,0.051108827060296506
11.08108108108108,-0.15090902458709934,-0.15010424696295768,0.05140125683089585
11.096096096096096,-0.15168358672276838,-0.15082190868538028,0.05169801280968479
11.11111111111111,-0.15263515310565864,-0.15171586999032502,0.05199485365867655
11.126126126126126,-0.15375667068731036,-0.15277924762663475,0.052287586983821174
11.14114114114114,-0.1550331613069537,-0.15399732618729217,0.05257206962082794
11.156156156156156,-0.1564417297425553,-0.15534757670017038,0.05284422365097079
11.17117117117117,-0.15795183720510303,-0.15679993261218853,0.05310007672282045
11.186186186186186,-0.15952582333789042,-0.15831730643232525,0.053335830838149946
11.2012012012012,-0.16111964687150393,-0.15985631793990537,0.0535479591664884
11.216216216216216,-0.16268380478168942,-0.1613681949618232,0.053733326306586345
11.23123123123123,-0.1641643826573546,-0.1627998008209331,0.05388932414800328
11.246246246246246,-0.16550418523570035,-0.1640947388974778,0.05401401331681752
11.26126126126126,-0.1666438956235002,-0.16519448427986103,0.054106259133920205
11.276276276276276,-0.1675232142782339,-0.16603949492917852,0.054165850949175136
11.29129129129129,-0.1680819338869819,-0.16657025969776046,0.054193594443933846
11.306306306306306,-0.16826091328896953,-0.16672824738907127,0.054191367811715914
11.32132132132132,-0.16800292196051267,-0.16645672926389662,0.05416213446043246
11.336336336336336,-0.16725333577727866,-0.1657014564512633,0.0541099069152185
11.35135135135135,-0.1659606743120169,-0.16441118313418548,0.054039658885223586
11.366366366366366,-0.1640769794133221,-0.16253803574067988,0.05395718498405792
11.381381381381381,-0.1615580439054368,-0.16003773733503784,0.053868910375595824
11.396396396396396,-0.1583635076627281,-0.15686970467968062,0.05378165565164127
11.411411411411411,-0.15445684578710706,-0.15299704276405096,0.05370236547440407
11.426426426426426,-0.14980527990692682,-0.14838646773018402,0.05363781277617351
11.441441441441441,-0.1443796484777093,-0.14300819382476773,0.05359429332023219
11.456456456456456,-0.1381542751520483,-0.13683582303264494,0.053577327793134205
11.471471471471471,-0.131106875553844,-0.12984627715519242,0.05359138985120461
11.486486486486486,-0.12321854191058568,-0.12201981105839359,0.053639678237835456
11.501501501501501,-0.11447384176992131,-0.11334014242961318,0.05372394892213947
11.516516516516516,-0.10486106131570058,-0.10379472750622509,0.053844419149802196
11.531531531531531,-0.09437261555705846,-0.09337520382224164,0.05399974965453636
11.546546546546546,-0.08300563697204538,-0.08207801014188491,0.054187104707240516
11.561561561561561,-0.07076274129154858,-0.0699051806683755,0.05440228308045295
11.576576576576576,-0.057652954461736176,-0.056865295806861116,0.05463990735393401
11.591591591591591,-0.04369276911271639,-0.042974555948142486,0.0548936551334903
11.606606606606606,-0.028907283027955352,-0.028257928914823455,0.05515651424756469
11.621621621621621,-0.013331357332405893,-0.012750307109294631,0.055421044960848584
11.636636636636636,0.002989280237512363,0.003502401558351882,0.055679635399695906
11.651651651651651,0.019997070101945246,0.020442332719488462,0.05592474103392867
11.666666666666666,0.03762187999146789,0.03799896065372065,0.05614910424609628
11.681681681681681,0.05578057168405664,0.05608871126672922,0.05634595467076789
11.696696696696696,0.07437694834129364,0.07461496334137735,0.05650919410243254
11.711711711711711,0.09330213826210344,0.09346849007175642,0.05663357061601506
11.726726726726726,0.11243544747165916,0.11252836851318194,0.05671484482433719
11.741741741741741,0.13164568560331982,0.1316633560523907,0.05674994717181309
11.756756756756756,0.15079293938186492,0.15073370284666965,0.056737119657227136
11.771771771771771,0.1697307385269932,0.1695933403342914,0.056676029658253246
11.786786786786786,0.1883085330371854,0.18809236133981805,0.05656783906668624
11.801801801801801,0.20637438125612537,0.20607968953745162,0.05641521009672454
11.816816816816816,0.22377773683384108,0.2234058268479959,0.056222230843925004
11.831831831831831,0.24037222063062724,0.2399255674171024,0.05599424925568154
11.846846846846846,0.2560182705773691,0.2555005756779533,0.05573761320088843
11.861861861861861,0.2705855771982323,0.2700017420985122,0.05545932568948445
11.876876876876876,0.28395523273983886,0.28331125121238626,0.055166636361627074
11.891891891891891,0.29602154493814264,0.2953243196785075,0.05486660122348809
11.906906906906906,0.3066934896006129,0.305950584659255,0.05456565032875354
11.921921921921921,0.3158957969093325,0.31511514239052507,0.054269206074242966
11.936936936936936,0.3235696828136535,0.32275925176049086,0.053981392001256644
11.951951951951951,0.32967324805519543,0.3288407271739118,0.053704863375670354
11.966966966966966,0.3341815730996548,0.3333340489724483,0.05344077730635439
11.981981981981981,0.337086538172733,0.3362302189848346,0.053188903669645314
11.996996996996996,0.3383963949462757,0.3375363847373937,0.052947861195103425
12.012012012012011,0.33813511178225564,0.33727525012890175,0.05271544840628864
12.027027027027026,0.3363415094829896,0.3354842846804419,0.052489028907605643
12.042042042042041,0.33306820070484516,0.33221473932779455,0.05226592606240936
12.057057057057056,0.32838034466936106,0.327530475239465,0.052043783625658625
12.072072072072071,0.3223542301201829,0.32150661387614077,0.051820855602172346
12.087087087087086,0.31507570361209536,0.3142280214067276,0.05159619906198974
12.102102102102101,0.3066384666166495,0.3057876480362566,0.05136975614797983
12.117117117117116,0.2971422725951741,0.2962847516986327,0.05114232440890282
12.132132132132131,0.2866910628852727,0.2858230445700027,0.05091542650096098
12.147147147147146,0.27539108669935536,0.2745088085692804,0.05069110017852623
12.162162162162161,0.2633490546486464,0.2624490312145319,0.050471636619413306
12.177177177177176,0.25067037623400157,0.24974961504706789,0.050259299061635496
12.192192192192191,0.23745752938153084,0.23651371194971782,0.05005605428547796
12.207207207207206,0.22380860450640797,0.22284022821132485,0.04986334674852425
12.222222222222221,0.20981605732630926,0.20882253771575168,0.049681939568187866
12.237237237237236,0.19556569456651915,0.1945474300749699,0.049511838755491526
12.252252252252251,0.18113590578674313,0.18009430895719009,0.04935230810314982
12.267267267267266,0.16659714378482088,0.16553464435082668,0.04920197301659878
12.282282282282281,0.15201164622279925,0.15093167197299506,0.04905900338890546
12.297297297297296,0.1374333828791556,0.1363403241523425,0.04892135915838607
12.312312312312311,0.12290820659892986,0.12180736967808614,0.04878707787984936
12.327327327327327,0.10847418167957457,0.10737173541843038,0.04865458151244275
12.342342342342342,0.09416206097107166,0.09306497984588011,0.0485229793707524
12.357357357357357,0.07999588211035383,0.07891188767245726,0.04839234529984963
12.372372372372372,0.06599365369525102,0.06493115521174159,0.04826394909243081
12.387387387387387,0.05216810345474805,0.05113613744368417,0.04814042456271237
12.402402402402402,0.03852746224417347,0.03753562969440431,0.04802585934330933
12.417417417417417,0.025076259707020737,0.024134659062649545,0.04792579444765799
12.432432432432432,0.011816109507833178,0.010935263027145908,0.04784712523079508
12.447447447447447,-0.0012535359453836323,-0.0020627650478900086,0.047797899995081876
12.462462462462462,-0.01413467941674712,-0.014861181542954658,0.04778701849624053
12.477477477477477,-0.0268301375692713,-0.027462665114431663,0.04782384013988061
12.492492492492492,-0.039342978611487854,-0.03987026950633824,0.04791772040082643
12.507507507507507,-0.05167605066450862,-0.05208696740713244,0.048077503031250586
12.522522522522522,-0.06383160996967568,-0.06411529317180219,0.048311003443611174
12.537537537537537,-0.0758110549070116,-0.07595708889410734,0.04862452340975452
12.552552552552552,-0.0876147681340545,-0.08761335458291088,0.04902243720156203
12.567567567567567,-0.099242065016535555,-0.09908419913514317,0.04950688356854137
12.582582582582582,-0.11069124202463328,-0.11036888454423927,0.050077586838085913
12.597597597597597,-0.12195971411400446,-0.12146595154164308,0.050731815686398084
12.612612612612612,-0.1330442255761555,-0.1323734108962438,0.0514644725579739
12.627627627627627,-0.14394111475637753,-0.14308898117629462,0.052268293356765555
12.642642642642642,-0.1546466097483107,-0.15361035119402017,0.053134128293124284
12.657657657657657,-0.16515713001418303,-0.16393544385770306,0.054051271760406916
12.672672672672672,-0.17546956812543568,-0.17406265794361195,0.05500781150482139
12.687687687687687,-0.18558152665583294,-0.18399106548290067,0.05599097368794083
12.702702702702702,-0.19549148775751202,-0.19372054505175906,0.056987448728383905
12.717717717717717,-0.20519889704802746,-0.2032518351691425,0.0579836911026299
12.732732732732732,-0.21470414893996584,-0.2125864970591054,0.058966193104432844
12.747747747747747,-0.2240084671426902,-0.22172678195155812,0.059921737066495846
12.762762762762762,-0.23311368135268828,-0.23067540453635413,0.06083763250779621
12.777777777777777,-0.24202190865666215,-0.2394352307669519,0.06170194432189397
12.792792792792792,-0.2507351554042418,-0.2480088945279427,0.06250371598430339
12.807807807807807,-0.25925486177527773,-0.25639836333638677,0.06323318846453503
12.822822822822824,-0.2675814165173504,-0.2646044778677564,0.06388201170978472
12.837837837837839,-0.275713672972528,-0.2726264933573121,0.06444344177816949
12.852852852852854,-0.28364849924369495,-0.2804616525649722,0.06491251339958891
12.867867867867869,-0.2913803949681364,-0.28810481982368996,0.06528617530444374
12.882882882882884,-0.29890120458791547,-0.29554820362998224,0.06556337439475698
12.897897897897899,-0.306199952284319,-0.30278119129939335,0.0657450750088203
12.912912912912914,-0.3132628170736787,-0.30979031353572817,0.06583420138457367
12.927927927927929,-0.3200732582886862,-0.31655934961031895,0.06583549513470727
12.942942942942944,-0.3266122922810166,-0.32306957559752564,0.06575528516660364
12.957957957957959,-0.33285891128925993,-0.32930014925587897,0.06560117486536612
12.972972972972974,-0.3387906257213977,-0.3352286162581326,0.06538166005553564
12.987987987987989,-0.34438410234060857,-0.34083151418524815,0.06510570043152397
13.003003003003004,-0.34961586372763676,-0.34608504363953646,0.06478227557224751
13.018018018018019,-0.35446300953614823,-0.35096577058105954,0.06441996282025202
13.033033033033034,-0.35890391790949866,-0.355451321022806,0.06402657665511087
13.048048048048049,-0.3629188862225602,-0.3595210288527077,0.06360890648623851
13.063063063063064,-0.36649067403724295,-0.36315649990795257,0.0631725815019596
13.078078078078079,-0.3696049175514402,-0.3663420604179389,0.06272207782019103
13.093093093093094,-0.3722503933892076,-0.3690650652481664,0.06226086625774924
13.108108108108109,-0.3744191196597758,-0.3713160505132152,0.061791681001727
13.123123123123124,-0.3761062930299296,-0.37308872542020205,0.06131687314239083
13.138138138138139,-0.3773100712967961,-0.3743798088888058,0.06083880100961844
13.153153153153154,-0.3780312208389797,-0.3751887267657079,0.06036020339651532
13.168168168168169,-0.3782726566794397,-0.37551719453480975,0.05988450286616738
13.183183183183184,-0.37803890916919053,-0.37536871763859186,0.05941599417773161
13.198198198198199,-0.3773355551203451,-0.37474804634021236,0.058959886343383144
13.213213213213214,-0.3761686523868969,-0.37366062413372947,0.05852218428461782
13.228228228228229,-0.3745442154032612,-0.372112067935322,0.05810941552760528
13.243243243243244,-0.37246776521380986,-0.3701077147731308,0.05772822672687712
13.258258258258259,-0.36994398139359197,-0.36765226376500176,0.057384891806112046
13.273273273273274,-0.36697647544366707,-0.3647495343443257,0.05708478593881885
13.288288288288289,-0.3635676963249497,-0.3614023526149048,0.056831885495244996
13.303303303303304,-0.35971896942270476,-0.3576125681161915,0.056628352140824394
13.318318318318319,-0.3554306610828613,-0.3533811939047048,0.05647424929298512
13.333333333333334,-0.3507024525745314,-0.34870865440027327,0.05636742238939788
13.348348348348349,-0.34553370047328746,-0.3435951184935626,0.0563035535799367
13.363363363363364,-0.3399238554625089,-0.33804089039834195,0.05627638013877053
13.378378378378379,-0.33387290869048963,-0.3320468279124346,0.05627804777083384
13.393393393393394,-0.327381834196168,-0.32561475719162886,0.05629955785360968
13.408408408408409,-0.320452997446631,-0.3187478547298087,0.05633126279163826
13.423423423423424,-0.31309050347925665,-0.31145097071462086,0.056363365701593025
13.438438438438439,-0.3053004631517424,-0.30373087291732837,0.05638638793893726
13.453453453453454,-0.2970911621370007,-0.2955963963365341,0.056391578233048904
13.468468468468469,-0.2884731240862218,-0.28705849048302795,0.056371248146907964
13.483483483483484,-0.2794590663605807,-0.2781301630184014,0.056319028440128184
13.498498498498499,-0.27006375348192546,-0.26882632504173415,0.05623004860302395
13.513513513513514,-0.26030375962432323,-0.25916354932284424,0.05610104692478184
13.528528528528529,-0.25019715678973414,-0.24915975795156428,0.05593042104827797
13.543543543543544,-0.2397631495923106,-0.2388338600320616,0.05571822944177909
13.558558558558559,-0.22902168070207343,-0.22820536309221218,0.055466153108314244
13.573573573573574,-0.2179930329187021,-0.21729398375128195,0.05517742469051578
13.588588588588589,-0.20669745455723118,-0.2061192838892568,0.05485672939214774
13.603603603603604,-0.19515483435961714,-0.19470035811087955,0.05451007923810535
13.618618618618619,-0.18338445054706762,-0.1830555967343377,0.05414465948986644
13.633633633633634,-0.17140481595079082,-0.17120254589972955,0.053768643857644065
13.64864864864865,-0.15923363745235103,-0.15915788272383122,0.053390973844066075
13.663663663663664,-0.14688790327085316,-0.14693751875778122,0.05302109747444012
13.67867867867868,-0.13438410598846917,-0.13455683936414395,0.05266866416848309
13.693693693693694,-0.12173860264817717,-0.12203108005928334,0.052343175869227286
13.70870870870871,-0.10896810584861492,-0.10937583343288657,0.05205359986122925
13.723723723723724,-0.09609029160689364,-0.09660767207623414,0.05180795574279544
13.73873873873874,-0.08312450104443055,-0.08374486422296863,0.05161289705752772
13.753753753753754,-0.07009250396709045,-0.0708081498408717,0.05147331590925227
13.76876876876877,-0.05701928359549418,-0.057821536161309244,0.05139200483413599
13.783783783783784,-0.043933793653002914,-0.04481306370213645,0.05136941252182091
13.7987987987988,-0.030869632499439328,-0.03181548749143404,0.05140352724696251
13.813813813813814,-0.017865574901975767,-0.018866814315368265,0.051489913509759185
13.82882882882883,-0.004965901316676409,-0.006010636325018713,0.051621913957696476
13.843843843843844,0.007779531880486434,0.006703794886615134,0.05179101188560216
13.85885885885886,0.02031552922400289,0.019221800925398668,0.051987331983327494
13.873873873873874,0.03258213420118711,0.03148384923422854,0.05220024120461679
13.88888888888889,0.04451556370682996,0.04342648014543791,0.052418999947443055
13.903903903903904,0.056049490959434393,0.05498357985280332,0.05263340765190549
13.91891891891892,0.06711664317557871,0.06608796543978619,0.05283438702233817
13.933933933933934,0.07765065417526573,0.07667322247113482,0.053014457164032865
13.94894894894895,0.08758808824811568,0.08667571235723565,0.05316805720308687
13.963963963963964,0.0968705327903292,0.09603664840015488,0.05329169722070284
13.97897897897898,0.10544664585494189,0.10470412847406779,0.053383931039876764
13.993993993993994,0.11327404255539103,0.11263501031863493,0.05344516372621349
14.00900900900901,0.12032091189932033,0.11979652305414197,0.053477323569737216
14.024024024024024,0.126567272580339,0.1261675252162157,0.05348344172843688
14.03903903903904,0.1320058008340353,0.13173934368696089,0.053467190815630755
14.054054054054054,0.13664219306521258,0.13651615681507553,0.05343243529045834
14.06906906906907,0.14049505744505492,0.14051491571861038,0.05338284129029335
14.084084084084084,0.14359535887039854,0.14376482715499855,0.05332158236381794
14.0990990990991,0.14598546777042204,0.1463064467152778,0.053251162295867675
14.114114114114114,0.14771788316653092,0.14819045045949986,0.0531733594141685
14.12912912912913,0.1488537129845951,0.14947616535760122,0.053089281125235255
14.144144144144144,0.14946099966966464,0.15022994384172844,0.05299950519249948
14.15915915915916,0.14961297726390216,0.15052346600587377,0.05290427682124985
14.174174174174174,0.14938633848028168,0.15043204567323415,0.052803728290742626
14.18918918918919,0.14885957848187797,0.1500330051825771,0.052698090093981374
14.204204204204204,0.1481114677002091,0.1494041699023108,0.05258786813319875
14.21921921921922,0.1472196906354338,0.14862251864634796,0.05247396908603597
14.234234234234235,0.14625967248109983,0.14776301159650257,0.052357764327461025
14.24924924924925,0.14530360161066874,0.14689760400501203,0.05224109078518517
14.264264264264265,0.1444196441458652,0.14609444253830953,0.05212619417312135
14.27927927927928,0.14367133741024693,0.14541723204539217,0.05201562579939675
14.294294294294295,0.143117142236443,0.14492475398847207,0.051912108337315785
14.30930930930931,0.14281012984704702,0.14467051378706255,0.05181838837995491
14.324324324324325,0.1427977772437915,0.14470249279604763,0.05173709408158989
14.33933933933934,0.14312184550012966,0.1450629813564502,0.051670614580840074
14.354354354354355,0.14381831776746107,0.14578847202633574,0.05162101420924322
14.36936936936937,0.14491737781708985,0.14690959633230943,0.051589988989984244
14.384384384384385,0.1464434151251935,0.14845109370656404,0.05157886624694676
14.3993993993994,0.14841504838009525,0.15043180713883308,0.05158864123476916
14.414414414414415,0.15084516531134404,0.1528647058694773,0.051620038741126625
14.42942942942943,0.15374098234295455,0.15575694055776032,0.05167358376565708
14.444444444444445,0.15710413220774075,0.15910994020303676,0.05174966451905964
14.45945945945946,0.1609307908445083,0.1629195622190611,0.0518485734445973
14.474474474474475,0.16521185628349727,0.16717630719372373,0.051970517392146406
14.48948948948949,0.1699331916407658,0.17186560797889655,0.052115595453583324
14.504504504504505,0.1750759418427267,0.17696819907702346,0.05228375080046771
14.51951951951952,0.18061692956798295,0.18246056728738239,0.05247470950149704
14.534534534534535,0.18652913060408616,0.18831547888076874,0.05268792332228379
14.54954954954955,0.1927822229884855,0.19450257289631598,0.05292253408230897
14.564564564564565,0.199343198606046,0.20098900517443394,0.05317737419523148
14.57957957957958,0.20617702098152146,0.2077401240001509,0.053451012249556326
14.594594594594595,0.21324730934357664,0.2147201560760901,0.05374184516019801
14.60960960960961,0.22051702697441786,0.22189288108977553,0.05404823102248805
14.624624624624625,0.2279491515136024,0.22922227428605388,0.05436865066799819
14.63963963963964,0.23550730617092286,0.23667309893193397,0.05470188196652698
14.654654654654655,0.24315633346950688,0.2442114339926828,0.05504716949298346
14.66966966966967,0.2508627968216808,0.2518051263118399,0.0554043731104116
14.684684684684685,0.2585953995209029,0.2594241607130522,0.055774081771195375
14.6996996996997,0.2663253152028575,0.2670409453910284,0.05615768270277568
14.714714714714715,0.27402642812799216,0.2746305134907366,0.05655738043719172
14.72972972972973,0.2816754854860229,0.28217064473667075,0.056976164323571984
14.744744744744745,0.28925216713136603,0.28964191329730204,0.057417726879377594
14.75975975975976,0.2967390806282147,0.2970276697486341,0.05788633841815931
14.774774774774775,0.30412169119440075,0.30431396607642436,0.05838668579491304
14.78978978978979,0.3113881971246957,0.3114894331990092,0.05892368485618781
14.804804804804805,0.3185293616291648,0.3185451205857364,0.059502277305120616
14.81981981981982,0.32553831184742815,0.3254743072771089,0.06012722320781768
14.834834834834835,0.332410315210863,0.3322722930653145,0.06080290027008342
14.84984984984985,0.3391425424357471,0.3389361778439769,0.06153312028852629
14.864864864864865,0.34573382534508623,0.3454646362501753,0.062320971834932404
14.87987987987988,0.3521844165248583,0.35185769375684867,0.06316869632434473
14.894894894894895,0.3584957565956688,0.35811650937699985,0.06407760226896225
14.90990990990991,0.36467025368048395,0.36424316915136573,0.06504801992014753
14.924924924924925,0.3707110785160477,0.3702404936392792,0.06607929588167583
14.93993993993994,0.37662197761912025,0.37611186174207073,0.06716982487937351
14.954954954954955,0.38240710599724764,0.38186105237714973,0.06831711390463993
14.96996996996997,0.38807088009682883,0.3874921048005341,0.06951787255673539
14.984984984984985,0.3936178510111964,0.3930091977531058,0.07076812265325355
15,0.3990525974254513,0.3984165470837352,0.07206332003894075
