interval,rating,rating_boot_mean,rating_boot_se
0,0.5230766074410121,0.5181378836205094,0.14301716278933405
0.015015015015015015,0.5190834524141472,0.5142761632200084,0.1409620964656547
0.03003003003003003,0.5150678479684668,0.51038846153669,0.1388667927124644
0.04504504504504504,0.5110247974897633,0.5064696506019722,0.13673030233598096
0.06006006006006006,0.5069479294395469,0.5025132437649751,0.13455266490279993
0.07507507507507508,0.5028293215544223,0.49851122773581985,0.1323351588475273
0.09009009009009009,0.4986593283060373,0.4944538996521533,0.13008057493305333
0.10510510510510511,0.49442641945425725,0.49032971700515265,0.12779350712449739
0.12012012012012012,0.4901170393692967,0.48612516996044147,0.12548065126362823
0.13513513513513514,0.48571549866274927,0.4818246872854354,0.12315109723191574
0.15015015015015015,0.4812039114237021,0.47741058862075875,0.12081659450724405
0.16516516516516516,0.4765621928356946,0.4728630970493267,0.11849176423931085
0.18018018018018017,0.4717681329461982,0.46816042663241914,0.11619422354610831
0.19519519519519518,0.4667975626338113,0.463278959585341,0.11394458045050604
0.21021021021021022,0.4616246271132747,0.4581935268361412,0.11176625212620764
0.22522522522522523,0.45622218038173035,0.4528778036410514,0.10968505706415159
0.24024024024024024,0.45056231062215224,0.44730482854966896,0.10772853632544974
0.2552552552552553,0.4446170015926738,0.44144764922013485,0.10592497356689878
0.2702702702702703,0.4383589284060924,0.43528009237879167,0.1043021109195065
0.2852852852852853,0.43176237795724715,0.4287776477314796,0.10288559903161815
0.3003003003003003,0.42480427488802375,0.4219184471508779,0.10169727177218289
0.3153153153153153,0.417465283896308,0.4146843114388851,0.10075339098705498
0.3303303303303303,0.409730949102147,0.407061828007135,0.10006305086718276
0.34534534534534533,0.4015928219548425,0.3990434146754031,0.09962694923022225
0.36036036036036034,0.3930495217719673,0.3906283182778007,0.09943671210099583
0.37537537537537535,0.3841076684232418,0.38182349271446725,0.09947489596432933
0.39039039039039036,0.3747826257727917,0.37264430022757977,0.09971569970475225
0.40540540540540543,0.3650989978975519,0.3631149825639877,0.10012631707762829
0.42042042042042044,0.3550908280803817,0.3532688555831578,0.10066877511868647
0.43543543543543545,0.3448014629742561,0.34314819169977206,0.10130205251723126
0.45045045045045046,0.3342830605260001,0.3328037688516063,0.1019842609701226
0.46546546546546547,0.3235957391795186,0.32229408161565565,0.10267469630998216
0.4804804804804805,0.31280638615463574,0.31168422850192223,0.1033356119958178
0.4954954954954955,0.30198716262760344,0.301044507964798,0.10393362140226081
0.5105105105105106,0.2912137618109814,0.29044877284139786,0.10444068637921367
0.5255255255255256,0.2805634907904247,0.2799726073901425,0.10483469158454711
0.5405405405405406,0.27011325738632813,0.2696914017264622,0.10509963504701372
0.5555555555555556,0.2599375485599887,0.2596784044524486,0.10522548586647817
0.5705705705705706,0.2501064867496608,0.2500028352987053,0.10520777167519589
0.5855855855855856,0.240684045246764,0.24072813573244878,0.10504696346377691
0.6006006006006006,0.23172649396059933,0.2319104272410775,0.10474772536226458
0.6156156156156156,0.22328113362925128,0.22359723520724883,0.10431809331524625
0.6306306306306306,0.2153853608518061,0.2158265219941913,0.10376864030331262
0.6456456456456456,0.20806608943142274,0.20862605718723806,0.10311167758924518
0.6606606606606606,0.2013395365589141,0.20201313698349616,0.10236053199700326
0.6756756756756757,0.1952113663147312,0.1959946494489577,0.10152892897968295
0.6906906906906907,0.1896771686042691,0.19056746853819614,0.10063050069433786
0.7057057057057057,0.18472323952175776,0.18571914793706523,0.09967842798062494
0.7207207207207207,0.18032761959120328,0.18142887625836365,0.09868521554486588
0.7357357357357357,0.1764613394853827,0.17766864800802884,0.09766259125898476
0.7507507507507507,0.17308981863214642,0.17440459999640068,0.09662151368517019
0.7657657657657657,0.1701743604075954,0.17159846033110743,0.09557226697548858
0.7807807807807807,0.16767368812325875,0.16920905656007185,0.09452461922762781
0.7957957957957957,0.16554546842000215,0.16719383066926619,0.0934880190714054
0.8108108108108109,0.16374777264176316,0.165510311214598,0.09247180543740385
0.8258258258258259,0.16224043193446944,0.1641174966362043,0.09148540677311268
0.8408408408408409,0.16098624787547927,0.16297710855471212,0.09053850810200346
0.8558558558558559,0.15995202709334827,0.16205467940610546,0.08964116705002877
0.8708708708708709,0.15910941533208317,0.16132044498953418,0.08880386322105684
0.8858858858858859,0.15843551353563884,0.1607500192580669,0.08803746915230709
0.9009009009009009,0.15791326560623176,0.16032483586429686,0.08735313565978925
0.9159159159159159,0.1575316143917099,0.16003234846763403,0.08676208979847262
0.9309309309309309,0.1572854290833767,0.15986598949208017,0.0862753498725127
0.9459459459459459,0.15717521348289631,0.1598248947447913,0.08590336865638347
0.960960960960961,0.1572066104693882,0.15991340889295336,0.08565562266961099
0.975975975975976,0.15738972341896465,0.16014039404901068,0.08554017120025485
0.990990990990991,0.15773828025291287,0.16051837040939507,0.0855632129286681
1.006006006006006,0.15826867016561375,0.1610625237933412,0.08572866973311813
1.021021021021021,0.15899888684490493,0.16178961979784767,0.08603782619618186
1.0360360360360361,0.15994741506577526,0.16271686789584103,0.08648904962628354
1.0510510510510511,0.16113209981440463,0.16386078095605353,0.08707760973427268
1.0660660660660661,0.16256903846662252,0.16523607619272035,0.08779561048136644
1.0810810810810811,0.16427153686957424,0.16685466234840643,0.08863204010968972
1.0960960960960962,0.16624916931345174,0.16872475492081307,0.08957293977183141
1.1111111111111112,0.1685069801848204,0.1708501564776171,0.09060168679069056
1.1261261261261262,0.17104486142897365,0.1732297326486848,0.09169938518575416
1.1411411411411412,0.1738571347106783,0.1758571064075261,0.09284535312432445
1.1561561561561562,0.1769323603008738,0.1787205840026617,0.09401769375379875
1.1711711711711712,0.18025338626734533,0.1818033157111161,0.09519393201777715
1.1861861861861862,0.18379764166432702,0.18508368388401278,0.0963516955323932
1.2012012012012012,0.18753766640217376,0.18853590004180082,0.0974694128213095
1.2162162162162162,0.19144185880591355,0.19213078262067929,0.09852699794256957
1.2312312312312312,0.19547541018450196,0.1958366779727645,0.0995064877030086
1.2462462462462462,0.19960138482376785,0.1996204799732131,0.1003925970931906
1.2612612612612613,0.2037818945717219,0.2034486986206972,0.10117316087663496
1.2762762762762763,0.20797931049875482,0.2072885257502868,0.10183943463572882
1.2912912912912913,0.21215745077721912,0.21110884665725085,0.10238623678386415
1.3063063063063063,0.2162826845001062,0.2148811500932621,0.10281192346004543
1.3213213213213213,0.2203248958780044,0.21858029554722244,0.10311819986336766
1.3363363363363363,0.2242582619392974,0.22218510553675025,0.1033097832942091
1.3513513513513513,0.2280618089034284,0.22567876118997762,0.10339394372755881
1.3663663663663663,0.23171972681043398,0.22904899092320852,0.10337995603241132
1.3813813813813813,0.2352214375076627,0.23228805367892527,0.10327850309169077
1.3963963963963963,0.23856142633631394,0.23539252915097458,0.10310107054668442
1.4114114114114114,0.24173886150808643,0.2383629369497999,0.10285937159299169
1.4264264264264264,0.24475703612709926,0.24120321416851198,0.10256483454322994
1.4414414414414414,0.2476226753606052,0.243920085925798,0.10222817750445184
1.4564564564564564,0.2503451550802406,0.2465223660390925,0.10185908456282136
1.4714714714714714,0.2529356784875227,0.249020225101974,0.10146598755128379
1.4864864864864864,0.25540645426165093,0.25142446118092604,0.10105594800671114
1.5015015015015014,0.25776991433335833,0.25374580453434287,0.100634626317973
1.5165165165165164,0.26003800233146834,0.25599428270533886,0.10020632001140466
1.5315315315315314,0.2622215559130509,0.25817866659041594,0.09977405089499605
1.5465465465465464,0.26432979832839937,0.2603060121484775,0.09933968126123871
1.5615615615615615,0.266369947289374,0.26238130672399534,0.09890404206850309
1.5765765765765765,0.26834694291944267,0.2644072238442562,0.09846706029946052
1.5915915915915915,0.27026329149599176,0.2663839860259788,0.09802787776225902
1.6066066066066067,0.2721190179158529,0.26830933168792603,0.09758495871861161
1.6216216216216217,0.27391171725976204,0.27017857970862885,0.09713618827654183
1.6366366366366367,0.27563669434659577,0.27198478340677645,0.09667896702835535
1.6516516516516517,0.2772871795463964,0.27371896461536155,0.09621030968283996
1.6666666666666667,0.2788546091327349,0.2753704178967645,0.09572695633838248
1.6816816816816818,0.2803289588705794,0.27692707462183136,0.09522550461002337
1.6966966966966968,0.2816991201423532,0.27837591643527554,0.09470256919559361
1.7117117117117118,0.2829533085239952,0.2797034273959588,0.09415497284140635
1.7267267267267268,0.28407949517736664,0.2808960736870296,0.09357996927193815
1.7417417417417418,0.2850658516032853,0.2819407991497587,0.09297549471019642
1.7567567567567568,0.2859011981196721,0.2828255239667103,0.09234044035748196
1.7717717717717718,0.28657544585923583,0.2835396326244896,0.09167493383727653
1.7867867867867868,0.28708002114701436,0.2840744359138796,0.09098061336055602
1.8018018018018018,0.2874082599164652,0.28442359034725484,0.0902608744989105
1.8168168168168168,0.2875557585299701,0.28458345724603534,0.08952106629212934
1.8318318318318318,0.28752066624510264,0.28455338320924733,0.08876861141376108
1.8468468468468469,0.2873039039457592,0.2843358841054658,0.08801302484656122
1.8618618618618619,0.2869092940200923,0.2839367165277179,0.08726580766518786
1.8768768768768769,0.28634358779931474,0.2833648241427378,0.08654019780102323
1.8918918918918919,0.28561638009125995,0.28263215172903844,0.08585076865572555
1.906906906906907,0.2847399052208793,0.281753326869531,0.08521287933683827
1.921921921921922,0.2837287155676351,0.28074521787239487,0.08464199662511786
1.936936936936937,0.2825992515169397,0.2796263858384188,0.08415292709641597
1.951951951951952,0.28136932035894746,0.27841645789106684,0.08375901556746967
1.966966966966967,0.2800575100462596,0.2771354562944168,0.08347137977525484
1.981981981981982,0.2786825707816328,0.27580312338678925,0.08329825722183062
1.996996996996997,0.27726280208510634,0.2744382840755945,0.08324453544910838
2.012012012012012,0.27581548444223786,0.27305828562028556,0.08331152055340496
2.027027027027027,0.2743563924173914,0.27167854866567676,0.08349697208815261
2.042042042042042,0.2728994203016751,0.2703122546141443,0.08379539991234183
2.057057057057057,0.2714563425620061,0.2689701835164025,0.08419858605433632
2.0720720720720722,0.27003672061196266,0.26766070503153194,0.08469626841862668
2.0870870870870872,0.2686479560357626,0.26638991398002304,0.08527690770265206
2.1021021021021022,0.26729547968236594,0.26516189270328105,0.08592845602209932
2.1171171171171173,0.2659830571238244,0.2639790756053971,0.08663905440482751
2.1321321321321323,0.26471318459081045,0.2628426872209288,0.08739760331502325
2.1471471471471473,0.26348754596958174,0.261753223856282,0.088194171592149
2.1621621621621623,0.2623075006577525,0.26071094990554206,0.08902023074629456
2.1771771771771773,0.2611745735907177,0.25971638276054837,0.08986872055313086
2.1921921921921923,0.26009092192848493,0.258770744163301,0.09073396671798174
2.2072072072072073,0.2590597570363824,0.25787636026293215,0.09161148154764179
2.2222222222222223,0.258085704862587,0.25703699702266897,0.09249768438147091
2.2372372372372373,0.2571750921068104,0.2562581216026115,0.09338958067201593
2.2522522522522523,0.25633614936018134,0.25554708370358353,0.09428443780547424
2.2672672672672673,0.25557912552730655,0.25491321351678675,0.09517949260586868
2.2822822822822824,0.2549163103248312,0.2543678349178441,0.0960717203602392
2.2972972972972974,0.2543619636124776,0.2539241939888706,0.09695768835972288
2.3123123123123124,0.2539321519521493,0.2535973040187804,0.09783350854150442
2.3273273273273274,0.25364449433800024,0.25340370901849263,0.09869489407724821
2.3423423423423424,0.2535178207136407,0.2533611686997506,0.09953731410039002
2.3573573573573574,0.25357174886389733,0.25348826899813726,0.10035622985676063
2.3723723723723724,0.25382618763479053,0.2538039637368543,0.10114738531390219
2.3873873873873874,0.2543007771993655,0.2543270550421836,0.10190711679355197
2.4024024024024024,0.2550142801482456,0.2550756226756087,0.1026326407182148
2.4174174174174174,0.25598394034314387,0.2560664154876662,0.1033222772461074
2.4324324324324325,0.25722482945008146,0.25731422155837935,0.1039755713046403
2.4474474474474475,0.25874920354145553,0.2588312369841959,0.10459328172057995
2.4624624624624625,0.2605658937958154,0.2606264563137968,0.10517722346153709
2.4774774774774775,0.26267975585278,0.26270510987166634,0.10572996623413988
2.4924924924924925,0.26509120161501776,0.265068174183127,0.10625441268803254
2.5075075075075075,0.2677958351752352,0.26771198104745486,0.1067532983523458
2.5225225225225225,0.2707842111719209,0.2706279482722174,0.10722866993927924
2.5375375375375375,0.2740417294626558,0.2738024506755661,0.10768140583168256
2.5525525525525525,0.27754867486597,0.27721684392367296,0.10811084048179888
2.5675675675675675,0.2812804052286858,0.2808476465666047,0.10851454275930611
2.5825825825825826,0.28520768558775483,0.2846668779037939,0.10888827856030563
2.5975975975975976,0.28929716102404895,0.288642541757331,0.10922616346075623
2.6126126126126126,0.29351195617756975,0.292739239527332,0.10952098609169873
2.6276276276276276,0.29781238544216043,0.2969188905804197,0.10976466147667915
2.6426426426426426,0.30215675463028924,0.30114153440295055,0.10994875913388732
2.6576576576576576,0.3065022323793926,0.30536618712070907,0.11006504508470953
2.6726726726726726,0.3108057677111036,0.3095517248087052,0.11010598007700007
2.6876876876876876,0.3150250288974442,0.31365776717865945,0.11006512690474039
2.7027027027027026,0.3191193380911569,0.3176455373284988,0.10993743532419666
2.7177177177177176,0.32305057602050774,0.32147867583712075,0.1097193910235994
2.7327327327327327,0.3267840314346595,0.3251239902067791,0.10940903284544978
2.7477477477477477,0.33028917093055987,0.32855212321058236,0.10900585790565336
2.7627627627627627,0.33354030631724807,0.33173812593454466,0.10851064592970205
2.7777777777777777,0.33651713879319456,0.3346619231810138,0.10792524117948682
2.7927927927927927,0.33920516192942723,0.3373086605046633,0.10725233247895906
2.8078078078078077,0.3415959087541585,0.3396689236505877,0.10649526924055405
2.8228228228228227,0.3436870320999208,0.3417388227750968,0.10565794461424918
2.8378378378378377,0.3454822117695009,0.3435199357886112,0.10474476680183525
2.8528528528528527,0.3469908869639972,0.34501910768484073,0.10376072729413534
2.8678678678678677,0.34822781774768785,0.3462481059805231,0.10271156151319305
2.8828828828828827,0.3492124850363119,0.34722313647894165,0.10160398430451768
2.8978978978978978,0.3499683445914134,0.34796422848000885,0.10044597107214522
2.9129129129129128,0.3505219566356247,0.34849450416058886,0.09924704607016009
2.9279279279279278,0.3509020187517588,0.3488393528776264,0.09801853325794897
2.942942942942943,0.35113833538530254,0.34902553720666135,0.09677372281605724
2.957957957957958,0.3512607621395833,0.3490802631064304,0.09552790839409568
2.972972972972973,0.35129816666908065,0.3490302511075151,0.09429825681211115
2.987987987987988,0.35127744984273324,0.34890084825574375,0.09310348353365987
3.003003003003003,0.35122267050356987,0.3487152211620699,0.09196332379769602
3.018018018018018,0.351154314245011,0.3484936685362604,0.09089781035688652
3.033033033033033,0.3510887410066738,0.3482530868627081,0.08992639297893552
3.048048048048048,0.3510378380775832,0.3480066155543077,0.08906695969065172
3.063063063063063,0.35100889469978275,0.3477634784424315,0.08833484137848693
3.078078078078078,0.35100470259985017,0.34752902755052645,0.0877418951538985
3.093093093093093,0.35102387437906707,0.34730498367404855,0.08729576340459964
3.108108108108108,0.3510613598235476,0.3470898573488759,0.08699939196760759
3.123123123123123,0.3511091298908953,0.3468795242800406,0.08685086283003031
3.138138138138138,0.3511569902613064,0.34666792199182994,0.08684355842826981
3.153153153153153,0.35119348149260826,0.34644782984571537,0.0869666332525891
3.168168168168168,0.3512068212133239,0.3462116928290101,0.08720573235307534
3.183183183183183,0.35118584527384233,0.34595245049977735,0.0875438722436042
3.198198198198198,0.35112090887363934,0.34566433576682926,0.08796239092501724
3.2132132132132134,0.351004714679795,0.34534361318522594,0.08844187961875616
3.2282282282282284,0.3508330420235251,0.3449892324670963,0.088963025523054
3.2432432432432434,0.35060535859275416,0.34460337926414186,0.08950731725283162
3.2582582582582584,0.35032530293010333,0.3441919113809698,0.0900575876366896
3.2732732732732734,0.3500010319841891,0.34376467398053895,0.0905983886158577
3.2882882882882885,0.3496454326545837,0.3433356917678436,0.09111620823814916
3.3033033033033035,0.3492761996414263,0.34292323947703224,0.09159954978808407
3.3183183183183185,0.34891578406947465,0.34254979428021287,0.09203889857396497
3.3333333333333335,0.3485912185495368,0.3422418751357445,0.09242660391644009
3.3483483483483485,0.34833382489192993,0.342029774825621,0.09275670363122289
3.3633633633633635,0.348178810941298,0.3419471907545843,0.09302471676028909
3.3783783783783785,0.3481647632733977,0.3420307607538548,0.09322742815758565
3.3933933933933935,0.34833304302518026,0.34231951037454583,0.0933626861181597
3.4084084084084085,0.34872709306442146,0.34285421864123755,0.09342923159947637
3.4234234234234235,0.3493916660793739,0.3436767100693552,0.09342657454955916
3.4384384384384385,0.35037198490979643,0.34482908196200934,0.09335492914226885
3.4534534534534536,0.35171284838494243,0.3463528775506602,0.09321521503648766
3.4684684684684686,0.3534576978565338,0.3482882173211286,0.0930091259439437
3.4834834834834836,0.35564766126677433,0.3506729027109509,0.09273925983728318
3.4984984984984986,0.3583205927431433,0.35354150808220763,0.09240929735684618
3.5135135135135136,0.3615101261934644,0.356924478264746,0.09202420697935508
3.5285285285285286,0.36524476110953735,0.36084724984921646,0.09159044816176037
3.5435435435435436,0.36954699781076966,0.3653294146597647,0.09111613802934257
3.5585585585585586,0.37443253781892305,0.3703839434008603,0.09061114437506922
3.5735735735735736,0.37990956319396846,0.37601648639098784,0.09008706884098139
3.5885885885885886,0.385978106780179,0.38222476669931604,0.08955708998186544
3.6036036036036037,0.3926295237215251,0.38899807909853107,0.08903564685029772
3.6186186186186187,0.3998460735719986,0.39631690629203203,0.08853795953059129
3.6336336336336337,0.40760062201986963,0.40415266212378287,0.08807940258495203
3.6486486486486487,0.41585647169883844,0.4124675701459395,0.08767476858257679
3.6636636636636637,0.4245673326480721,0.42121468512351395,0.0873374787504354
3.6786786786786787,0.43367744442046324,0.4303380647909823,0.08707881269103818
3.6936936936936937,0.44312186319610725,0.4397730992930302,0.0869072355007878
3.7087087087087087,0.45282692800961716,0.4494470059487485,0.08682789595472977
3.7237237237237237,0.46271091978038664,0.4592794968670586,0.08684235314709432
3.7387387387387387,0.47268492471508394,0.4691836260304648,0.08694856310003926
3.7537537537537538,0.48265390941846614,0.4790668202650287,0.0871411257678868
3.7687687687687688,0.49251800848481336,0.48883209460338894,0.0874117623279333
3.7837837837837838,0.5021740164936301,0.4983794466504721,0.08774996821728895
3.798798798798799,0.511517065554111,0.5076074166336203,0.08814377287573602
3.813813813813814,0.5204424575071699,0.5164147901147538,0.08858053378498862
3.828828828828829,0.5288476075644515,0.5247024094556738,0.08904769874001503
3.843843843843844,0.5366340447146328,0.5323750489887262,0.08953348314237163
3.858858858858859,0.5437094049213522,0.5393432986552306,0.09002742468599888
3.873873873873874,0.5499893471717769,0.5455253929764928,0.0905207928799678
3.888888888888889,0.5553993207740764,0.5508489179124408,0.09100684343597834
3.903903903903904,0.5598761155229909,0.5552523284697769,0.09148091705953058
3.918918918918919,0.5633691345315955,0.5586862153970364,0.09194038914218525
3.933933933933934,0.565841342193257,0.5611142698743202,0.09238448232700688
3.948948948948949,0.5672698559021557,0.5625139100203947,0.09281395895264759
3.963963963963964,0.5676461684284939,0.5628765509438315,0.09323071556715833
3.978978978978979,0.5669760065847088,0.5622075191819775,0.09363730700265611
3.993993993993994,0.5652788493727124,0.5605256307674927,0.09403643230606941
4.009009009009009,0.5625871436888054,0.5578624680343953,0.09443041818496191
4.024024024024024,0.558945266753184,0.5542614022087288,0.09482073659739768
4.039039039039039,0.5544082910607219,0.5497764159739345,0.09520759104251432
4.054054054054054,0.5490406096611663,0.5444707823467956,0.0955896008704421
4.069069069069069,0.542914477288777,0.538415653739617,0.0959636049985062
4.084084084084084,0.5361085169819799,0.5316886088931043,0.09632459676941552
4.099099099099099,0.5287062333370145,0.5243721966245796,0.09666579156575347
4.114114114114114,0.5207945635301113,0.5165525053463861,0.09697881943869525
4.129129129129129,0.5124624868272813,0.5083177773115408,0.09725402737381138
4.1441441441441444,0.5037997034850362,0.4997570775914168,0.09748087041529725
4.1591591591591595,0.4948953855607661,0.4909590206663842,0.09764836774124856
4.1741741741741745,0.48583699581481943,0.48201055269637294,0.09774559858882877
4.1891891891891895,0.47670916698525767,0.4729957852233903,0.09776221312841753
4.2042042042042045,0.46759263241574855,0.46399487617644264,0.0976889344244501
4.2192192192192195,0.45856320027552044,0.4550829563322128,0.09751802907693079
4.2342342342342345,0.44969076720184303,0.44632910341496973,0.09724372580358535
4.2492492492492495,0.4410383727299005,0.4377953712795347,0.09686256310478397
4.2642642642642645,0.4326613028180344,0.42953588753497207,0.09637364941354619
4.2792792792792795,0.4246062584683951,0.4215960389266187,0.09577882199585303
4.2942942942942945,0.41691061312222044,0.4140117691841288,0.09508269452339643
4.3093093093093096,0.40960178934289393,0.40680901825864557,0.09429258777230766
4.324324324324325,0.40269679043064355,0.4000033343428484,0.09341834323271639
4.33933933933934,0.39620192522030895,0.3935996902899542,0.09247202530817632
4.354354354354355,0.3901127636936201,0.3875925336283219,0.09146752386678604
4.36936936936937,0.3844143566935515,0.38196609407661536,0.09042007471630999
4.384384384384385,0.37908174476310036,0.3766949642883884,0.0893457206301569
4.3993993993994,0.37408076912583804,0.3717449587486502,0.08826073941063382
4.414414414414415,0.3693691826877136,0.3670742428544852,0.08718106780355538
4.42942942942943,0.36489804170097223,0.36263471006688097,0.08612175067690875
4.444444444444445,0.36061334078712387,0.35837357068391906,0.08509644369764391
4.45945945945946,0.356457837000072,0.3542351024573992,0.08411699486619456
4.474474474474475,0.3523729942157213,0.3501625021673939,0.08319312587028664
4.48948948948949,0.3483009689010798,0.34609976945956905,0.08233222852218916
4.504504504504505,0.34418655342242727,0.34199355054379027,0.08153928480429219
4.51951951951952,0.3399789941407074,0.3377948701745231,0.08081691157110052
4.534534534534535,0.33563360861575064,0.3334606856706662,0.08016552313092176
4.54954954954955,0.3311131386508488,0.3289552061336055,0.07958359726870826
4.564564564564565,0.3263887924398968,0.3242509326596921,0.07906802340442176
4.57957957957958,0.32144094811415247,0.31932939012041534,0.07861450620012649
4.594594594594595,0.31625951072556896,0.3141815367735019,0.07821799466575005
4.60960960960961,0.31084393339931565,0.30880785335798805,0.07787310609815318
4.624624624624625,0.3052029295485776,0.30321812734708525,0.0775745161316972
4.63963963963964,0.29935391558906727,0.2974309598555609,0.07731729052346294
4.654654654654655,0.29332223192826473,0.29147303178976697,0.07709714045594593
4.66966966966967,0.287140194038601,0.2853781719593741,0.07691059031376415
4.684684684684685,0.28084602549147486,0.2791862730875459,0.07675505422213816
4.6996996996997,0.27448272159475623,0.27294210222780013,0.07662882436856894
4.714714714714715,0.2680968866049522,0.26669405043758837,0.0765309797297159
4.72972972972973,0.261737580312738,0.2604928631648867,0.07646122803158117
4.744744744744745,0.25545520202402194,0.2543903881834687,0.0764196965807391
4.75975975975976,0.24930043235095903,0.24843837254057652,0.07640668920328553
4.774774774774775,0.24332324638448397,0.24268733426880473,0.0764224271872738
4.78978978978979,0.23757200613880533,0.23718552889581762,0.07646679209806437
4.804804804804805,0.23209263583938414,0.23197802531594885,0.07653908778933241
4.81981981981982,0.22692788069657807,0.22710590055218388,0.07663783791377889
4.834834834834835,0.22211664815662377,0.22260555846464694,0.07676063369619383
4.84984984984985,0.21769343004335792,0.21850817364030609,0.07690404456827239
4.864864864864865,0.21368780423818137,0.2148392585855966,0.077063601394094
4.87987987987988,0.21012401531817912,0.2116183499739113,0.07723385841963554
4.894894894894895,0.20702063462712553,0.20885880808662813,0.07740853583923385
4.90990990990991,0.2043903013758846,0.20656772271893417,0.07758074016555738
4.924924924924925,0.20223954739507338,0.20474591865959732,0.07774325466979795
4.93993993993994,0.2005687089854226,0.20338805432057533,0.07788888730929341
4.954954954954955,0.19937192986812594,0.2024828080707278,0.07801085905171475
4.96996996996997,0.1986372594976283,0.20201314815804836,0.07810321156395839
4.984984984984985,0.19834685094419363,0.2019566835867649,0.07816121002946512
5,0.19847726215760567,0.2022860947163498,0.07818171451821064
5.015015015015015,0.19899986363948735,0.2029696434149612,0.07816349198445169
5.03003003003003,0.19988135430379866,0.20397176307258466,0.07810744078291565
5.045045045045045,0.20108438549090654,0.20525372842005055,0.07801670084938862
5.06006006006006,0.20256829060626896,0.20677440371438055,0.07789662579229877
5.075075075075075,0.20428991457992202,0.20849106531660358,0.07775459860861715
5.09009009009009,0.20620453323443028,0.2103602909844585,0.07759968111608714
5.105105105105105,0.2082668477385293,0.21233890343501105,0.0774420988710748
5.12012012012012,0.210432033762551,0.2143849501505396,0.07729257826870484
5.135135135135135,0.212656819035176,0.2164586954035399,0.07716156989815694
5.15015015015015,0.2149005571745262,0.21852359459763773,0.07705841024851065
5.165165165165165,0.21712626050673856,0.2205472158971301,0.07699048970747006
5.18018018018018,0.2193015507525593,0.22250207043076828,0.07696250499098328
5.195195195195195,0.2213994846274015,0.22436631075731944,0.07697587535264787
5.21021021021021,0.22339921214830857,0.2261242583055073,0.07702839202600757
5.225225225225225,0.22528642917344835,0.22776672447967958,0.07711414941098622
5.24024024024024,0.22705359254368643,0.22929109711100992,0.07722377718342587
5.255255255255255,0.22869987594773453,0.23070117367538465,0.07734495958735733
5.27027027027027,0.23023085674487007,0.2320067346261232,0.07746319737466248
5.285285285285285,0.23165793760342662,0.23322286347378468,0.07756274423125147
5.3003003003003,0.23299752089136444,0.2343690338850849,0.07762763616596613
5.315315315315315,0.23426996715121287,0.23546799700980547,0.07764272984531477
5.33033033033033,0.23549838063540754,0.2365445134853955,0.07759467265785625
5.345345345345345,0.23670727389850452,0.23762398329628348,0.07747274049557504
5.36036036036036,0.2379211692647354,0.23873103231629209,0.07726949564954849
5.375375375375375,0.2391631973798498,0.23988811667056698,0.07698123412950413
5.39039039039039,0.24045375211444553,0.24111420504170297,0.07660820734193066
5.405405405405405,0.2418092571862396,0.24242359498853713,0.07615461658655799
5.42042042042042,0.24324109357063867,0.24382491270703313,0.07562839023384405
5.435435435435435,0.2447547287172245,0.24532033701323339,0.07504076318501879
5.45045045045045,0.2463490794216666,0.24690507827917677,0.07440568689180581
5.465465465465465,0.248016130478938,0.24856713219385765,0.07373910625852537
5.48048048048048,0.24974082141053774,0.250287317082825,0.07305814718905723
5.495495495495495,0.2515012039387451,0.2520395925530355,0.07238026485396885
5.51051051051051,0.2532688636925706,0.2537916468057985,0.07172240688799815
5.525525525525525,0.255009591017589,0.25550573038289476,0.07110024631057993
5.54054054054054,0.2566842778347358,0.257139705629752,0.07052753469415748
5.555555555555555,0.2582500103588756,0.2586482739877029,0.0700156162852817
5.57057057057057,0.25966132127393593,0.2599843375490395,0.06957312878726214
5.585585585585585,0.2608715598234028,0.2611004472793614,0.06920589801949203
5.6006006006006,0.26183433438976844,0.2619502880499969,0.06891701446453656
5.615615615615615,0.26250497968384157,0.2624901501952146,0.06870706305559864
5.63063063063063,0.2628419998015388,0.2626803387113752,0.0685744662710049
5.645645645645645,0.2628084392376527,0.26248647436122163,0.06851589625949014
5.66066066066066,0.26237313650434,0.2618806456592185,0.06852671420355792
5.675675675675675,0.2615118192256522,0.26084237673088473,0.06860140275947553
5.6906906906906904,0.26020800530945304,0.25935938303004696,0.06873396755843919
5.7057057057057055,0.2584536817830252,0.2574280944930128,0.068918293660346
5.7207207207207205,0.25624974079041835,0.25505393353328804,0.06914845040163516
5.7357357357357355,0.2536061607087713,0.25225134299230756,0.06941894224646206
5.7507507507507505,0.250541928947161,0.24904356648084522,0.06972490417953864
5.7657657657657655,0.24708471135634524,0.24546219027490584,0.07006223893123875
5.7807807807807805,0.24327028095455475,0.24154646195928267,0.07042769143775784
5.7957957957957955,0.23914172558426794,0.23734240631003,0.07081885493744022
5.8108108108108105,0.23474845996333962,0.2329017634987761,0.07123410410250385
5.8258258258258255,0.23014507227928938,0.2282807786399751,0.07167245406133417
5.8408408408408405,0.22539003898611293,0.22353887503780606,0.07213334982218542
5.8558558558558556,0.2205443438641258,0.21873724624723184,0.07261639759553958
5.870870870870871,0.21567003881625915,0.21393740422655444,0.07312105657700653
5.885885885885886,0.2108287844485901,0.20919972236380685,0.07364631555204403
5.900900900900901,0.20608040836572508,0.2045820129041319,0.0741903820791707
5.915915915915916,0.20148151841817685,0.20013817816311014,0.07475041230439526
5.930930930930931,0.19708420692785567,0.19591697374925438,0.07532230653547418
5.945945945945946,0.19293488017739532,0.1919609197198932,0.07590059000978527
5.960960960960961,0.18907324509602216,0.18830539207411706,0.07647839070863156
5.975975975975976,0.18553148196933084,0.1849779222099816,0.07704751769929032
5.990990990990991,0.18233362797704575,0.1819977259705274,0.07759863538522616
6.006006006006006,0.17949519127381544,0.17937547678109192,0.07812152204524432
6.021021021021021,0.1770230090922746,0.1771133293329773,0.07860539564586345
6.036036036036036,0.17491535599885277,0.17520519158425563,0.07903928629996118
6.051051051051051,0.17316230015365008,0.17363723390874955,0.07941243286845205
6.066066066066066,0.17174629656052037,0.17238861548991047,0.0797146808938029
6.081081081081081,0.17064299733205668,0.17143240003789664,0.0799368601280323
6.096096096096096,0.16982225052606512,0.17073662611953175,0.08007112221446416
6.111111111111111,0.16924925175392352,0.1702654922901131,0.08011122246528031
6.126126126126126,0.1688858070805833,0.16998061414309634,0.0800527339911784
6.141141141141141,0.1686916621561696,0.16984230951505233,0.07989318746325962
6.156156156156156,0.16862585126243423,0.16981086935859865,0.07963213519877323
6.171171171171171,0.16864802100745546,0.16984777497356607,0.07927114363881377
6.186186186186186,0.1687196865079476,0.16991682693362395,0.0788137231387539
6.201201201201201,0.16880538261468037,0.16998515660759125,0.07826520782941294
6.216216216216216,0.1688736784931562,0.17002409705621144,0.07763260071124817
6.231231231231231,0.16889803006197784,0.1700098957350027,0.07692439984489986
6.246246246246246,0.1688574508597551,0.16992425642175574,0.07615042042837487
6.261261261261261,0.16873698742896331,0.16975470185853586,0.07532162485073939
6.276276276276276,0.16852799002183705,0.16949475169907371,0.0744499688284697
6.291291291291291,0.16822817330056536,0.1691439126254092,0.073548266949629
6.306306306306306,0.16784146486778323,0.16870747924817567,0.07263007592426436
6.321321321321321,0.16737764223082138,0.16819614604903327,0.07170958910454242
6.336336336336336,0.16685176158817153,0.16762543262262597,0.07080153185839214
6.351351351351351,0.16628338508188453,0.16701492726633776,0.0699210445174678
6.366366366366366,0.16569561730229013,0.16638735789573256,0.06908353814546732
6.381381381381381,0.16511396716949084,0.16576750453103617,0.0683045085064695
6.396396396396396,0.1645650579830764,0.16518097421342395,0.06759929556435555
6.411411411411412,0.16407521633561897,0.16465286696117987,0.0669827798168265
6.426426426426427,0.1636689793817273,0.1642063698379956,0.06646901289219723
6.441441441441442,0.1633675690447565,0.16386132475348866,0.06607078802336928
6.456456456456457,0.16318739031049087,0.16363282347193064,0.06579916574627863
6.471471471471472,0.1631386178338502,0.16352988960751216,0.06566298034223789
6.486486486486487,0.16322393965305534,0.16355431127283226,0.06566836144706605
6.501501501501502,0.1634375279203903,0.1636996887571291,0.06581831083861449
6.516516516516517,0.16376430347648982,0.16395075856612779,0.0661123748480375
6.531531531531532,0.16417955339414883,0.16428304804902086,0.06654644716296533
6.546546546546547,0.1646489482851826,0.16466290368763037,0.06711272545938682
6.561561561561562,0.1651289896371143,0.16504792129559095,0.06779983026958013
6.576576576576577,0.1655678975955209,0.16538778857675354,0.06859307874405968
6.591591591591592,0.1659069276624953,0.1656255307186885,0.06947489260832196
6.606606606606607,0.16608208220984522,0.16569912915894702,0.07042531096175397
6.621621621621622,0.16602616106491175,0.16554346368150297,0.07142257552642033
6.636636636636637,0.1656710762099498,0.16509250990283209,0.07244375796175123
6.651651651651652,0.16495034013398588,0.16428170920599414,0.07346540426653102
6.666666666666667,0.16380162657690925,0.16305041728287037,0.07446417797735033
6.681681681681682,0.16216929693573678,0.16134433136929588,0.07541748986105556
6.696696696696697,0.16000678571324956,0.1591177953894716,0.0763041056480588
6.711711711711712,0.15727874397511415,0.15633588659555578,0.07710472434664999
6.726726726726727,0.15396285042798727,0.15297619658525977,0.07780251781605135
6.741741741741742,0.15005121476634664,0.14903023319226086,0.07838361815748726
6.756756756756757,0.1455513164872724,0.144504386816604,0.07883753413964868
6.771771771771772,0.14048644341757605,0.139420424269687,0.07915747259520083
6.786786786786787,0.1348956166108785,0.13381549403159443,0.07934053688656534
6.801801801801802,0.12883301087127705,0.12774164781787753,0.07938777346089279
6.816816816816817,0.12236690175654277,0.12126490343482878,0.07930404031702115
6.831831831831832,0.11557818937056262,0.1144638920752431,0.07909767867776263
6.846846846846847,0.10855856555181566,0.1074281486248345,0.07877998160262327
6.861861861861862,0.10140840336728894,0.10025611554680527,0.0783644703431802
6.876876876876877,0.09423445554386294,0.09305293902570437,0.07786600976994036
6.891891891891892,0.08714745132621514,0.08592814003792229,0.07729981607627107
6.906906906906907,0.08025967928367995,0.07899324285794074,0.07668043015857628
6.921921921921922,0.07368263716672804,0.07235943941555353,0.07602074490628173
6.936936936936937,0.06752481969955205,0.06613536031304428,0.07533118041749416
6.951951951951952,0.06188970208520746,0.060425012806819875,0.0746190951064558
6.966966966966967,0.05687396204255778,0.05532593342256775,0.07388850192471524
6.981981981981982,0.052565967497717206,0.05092758897597497,0.07314012922278319
6.996996996996997,0.04904454169078717,0.047310045521890394,0.07237182945771616
7.012012012012012,0.04637800338847625,0.04454291103554349,0.07157930200378117
7.027027027027027,0.04462346788955059,0.0426845452288798,0.07075706485439014
7.042042042042042,0.04382638512289136,0.04178151946253462,0.06989958856246943
7.057057057057057,0.044020284672897876,0.04186830167932732,0.06900249621840766
7.072072072072072,0.0452266940885525,0.042967135899803804,0.06806373458820283
7.087087087087087,0.04745519618540266,0.04508808311945573,0.0670846305062787
7.102102102102102,0.05070359289492879,0.048229190281260034,0.06607075901923855
7.117117117117117,0.054958147075645274,0.052376756066404864,0.06503256167345486
7.132132132132132,0.06019387900949488,0.05750566614223736,0.0639856621288519
7.147147147147147,0.06637490046501093,0.06357977575442487,0.06295083143864452
7.162162162162162,0.07345477562998404,0.07055232364577663,0.06195355889973623
7.177177177177177,0.08137690437692588,0.07836636772556198,0.06102319115505188
7.192192192192192,0.09007492879951635,0.08695523922808254,0.06019161937951932
7.207207207207207,0.0994731684488602,0.09624301786775599,0.05949152975056701
7.222222222222222,0.10948709304612309,0.10614503537408145,0.05895429089982541
7.237237237237237,0.12002384363265053,0.11656841852191853,0.05860763029383612
7.252252252252252,0.1309828142409502,0.12741268521997265,0.058473333088909736
7.267267267267267,0.14225630642060566,0.1385704083629107,0.05856525288626251
7.282282282282282,0.1537302685705726,0.14992796208687825,0.05888792193746685
7.297297297297297,0.16528513125122457,0.16136636398824103,0.059435971180728964
7.312312312312312,0.17679674866593992,0.1727622250258728,0.06019443024165862
7.327327327327327,0.18813745541431448,0.18398881649316137,0.0611398161666981
7.342342342342342,0.19917724641258605,0.19491726083620195,0.06224178984097231
7.357357357357357,0.2097850864099092,0.20541785033053037,0.06346509781726388
7.372372372372372,0.219830353543149,0.21536149469764282,0.064771530528566
7.387387387387387,0.22918441852184138,0.22462129548676305,0.0661216940719952
7.402402402402402,0.2377223569351063,0.2330742411845277,0.06747647949980672
7.4174174174174174,0.24532478646711192,0.24060301218963276,0.0687981935055077
7.4324324324324325,0.2518798132444519,0.24709787865100488,0.07005137285203031
7.4474474474474475,0.2572850620495928,0.25245866646942555,0.07120333891764477
7.4624624624624625,0.26144975391186537,0.2565967574622227,0.07222456234732887
7.4774774774774775,0.26429678214499935,0.2594370790453262,0.07308890725204062
7.4924924924924925,0.2657647251030044,0.2609200274167458,0.07377381535853116
7.5075075075075075,0.2658097219792973,0.26100325713383954,0.0742604770271528
7.5225225225225225,0.26440712835353547,0.2596632605090871,0.074534020644333
7.5375375375375375,0.26155286251397897,0.2568966539807796,0.07458373605189102
7.5525525525525525,0.25726435341663634,0.2527210871668112,0.07440333236714494
7.5675675675675675,0.25158100776419273,0.24717569510485066,0.0739912165614463
7.5825825825825826,0.2445641278346378,0.24032102617440804,0.07335076724119521
7.597597597597598,0.23629623333129582,0.23223839761398848,0.07249056889160609
7.612612612612613,0.22687976871612642,0.2230286567066531,0.07142456590435396
7.627627627627628,0.21643521033859117,0.21281035695207628,0.07017209322930071
7.642642642642643,0.2050986224809365,0.20171739233629468,0.06875774133789679
7.657657657657658,0.1930187449744167,0.18989616599967707,0.06721101696618577
7.672672672672673,0.1803537239421254,0.1775023988227541,0.06556576739968656
7.687687687687688,0.16726761847650565,0.16469770559232114,0.06385934481705596
7.702702702702703,0.15392682743015662,0.15164607909326078,0.06213149917256934
7.717717717717718,0.14049658086979022,0.13851042439318215,0.06042300508535303
7.732732732732733,0.12713763027174646,0.12544927671373204,0.05877405284085491
7.747747747747748,0.11400325160893411,0.11261381782852563,0.05722246812970101
7.762762762762763,0.10123664847417971,0.10014528013949439,0.05580186905582367
7.777777777777778,0.0889688113089203,0.08817279738027373,0.05453991610052244
7.792792792792793,0.07731685685784606,0.07681172944070767,0.05345684762628045
7.807807807807808,0.06638284213066765,0.06616245909348392,0.052564501393633105
7.822822822822823,0.05625302185956788,0.05630963291817282,0.051865985028862915
7.837837837837838,0.04699749938804109,0.04732179922283442,0.05135607212611045
7.852852852852853,0.038670208992291566,0.039251383214924725,0.05102228271126048
7.867867867867868,0.0313091629285839,0.032134934250952936,0.05084649088765849
7.882882882882883,0.024936898479716238,0.02599358121397373,0.05080682435036756
7.897897897897898,0.019561067913997053,0.02083363893777875,0.050879600627714926
7.912912912912913,0.015175126216908693,0.01664731978080046,0.05104108054919841
7.927927927927928,0.01175908616588636,0.013413518417496896,0.05126888947065609
7.942942942942943,0.009280326164565197,0.01109865304495448,0.051543034822711574
7.957957957957958,0.007694451597489857,0.009657560888753393,0.05184651443545349
7.972972972972973,0.0069462237250695336,0.009034458603603447,0.052165554693349166
7.987987987987988,0.006970579846890203,0.00916398751776966,0.052489541230270574
8.003003003003004,0.007693773366549923,0.009972368515834553,0.052810713047206935
8.018018018018019,0.00903466157776428,0.011378690882681208,0.05312369014437623
8.033033033033034,0.010906162036050503,0.013296353300636323,0.05342490016283528
8.048048048048049,0.013216885508935997,0.015634663651935284,0.05371196409918698
8.063063063063064,0.015872935706281864,0.018300588264001223,0.053983095854620564
8.078078078078079,0.018779845077403205,0.02120062237794403,0.05423656479493127
8.093093093093094,0.02184459441446369,0.024242734153520837,0.05447026358605868
8.108108108108109,0.024977644741975003,0.02733831704678822,0.05468141432787536
8.123123123123124,0.028094895937183846,0.03040407252468468,0.0548664339937781
8.138138138138139,0.031119480175507627,0.033363739019066835,0.055020965791110175
8.153153153153154,0.03398330113568846,0.03614958515469193,0.05514006752569049
8.168168168168169,0.03662824214367699,0.038703595870274124,0.05521853319713252
8.183183183183184,0.039006986892525866,0.04097829811457103,0.05525131181224547
8.198198198198199,0.0410834226232088,0.042937196259781395,0.05523397936310252
8.213213213213214,0.04283262444640909,0.04455481339221077,0.05516321692039004
8.228228228228229,0.04424044734121761,0.04581636010729087,0.05503724979617382
8.243243243243244,0.04530277614569172,0.046717074501381815,0.05485620888414056
8.258258258258259,0.04602450125051671,0.04726129356250441,0.05462238421252877
8.273273273273274,0.04641829752387559,0.0474613259289636,0.05434035090285024
8.288288288288289,0.0465032861845992,0.04733619884928666,0.0540169577520074
8.303303303303304,0.046303654830737936,0.04691034887789833,0.05366117760701371
8.318318318318319,0.04584730121969362,0.046212317754400226,0.05328382617538624
8.333333333333334,0.045164553592480845,0.0452735037367875,0.052897162011187576
8.348348348348349,0.04428700622867791,0.04412700610797917,0.05251438559497853
8.363363363363364,0.0432464951347366,0.04280658815649916,0.052149060267665935
8.378378378378379,0.042074226521374165,0.041345772797351923,0.05181448271342895
8.393393393393394,0.04080006077431868,0.03977707589010026,0.05152303573516595
8.408408408408409,0.03945194729753106,0.03813137557552802,0.051285560673289723
8.423423423423424,0.03805550088678256,0.03643741160300586,0.05111078987559863
8.438438438438439,0.03663370789227896,0.03472140641628571,0.05100487972314829
8.453453453453454,0.035206749903059116,0.03300679929252485,0.05097108061733347
8.468468468468469,0.03379193349725566,0.03131408557680723,0.05100957151974977
8.483483483483484,0.03240371619070389,0.029660754475160887,0.051117473706697114
8.498498498498499,0.031053820544272047,0.028061320430013817,0.051289043088466865
8.513513513513514,0.02975142997830884,0.02652744432547584,0.05151602519467118
8.528528528528529,0.028503460798019544,0.025068141269039335,0.05178814417131283
8.543543543543544,0.027314904974987224,0.023690071206505695,0.05209368857343152
8.558558558558559,0.026189237209247776,0.02239790703066221,0.05242015293628279
8.573573573573574,0.025128877715157368,0.021194772186963348,0.052754894544662714
8.588588588588589,0.024135699192305193,0.020082736271099057,0.05308576827839127
8.603603603603604,0.023211562870030605,0.01906335311055283,0.05340170751087234
8.618618618618619,0.022358864784815254,0.01813822178999647,0.053693224660024075
8.633633633633634,0.021581070074524526,0.017309547534147252,0.053952810495570734
8.64864864864865,0.02088321057344778,0.016580676797667296,0.054175216524378754
8.663663663663664,0.0202723198238677,0.01595657973499821,0.0543576098687113
8.67867867867868,0.019757780102509583,0.015444253687626402,0.054499595333615154
8.693693693693694,0.019351558319999764,0.015053023497657081,0.05460310513326497
8.70870870870871,0.019068311596864857,0.014794718205413535,0.054672163194979674
8.723723723723724,0.018925348653516045,0.014683708716967461,0.05471253807164912
8.73873873873874,0.01894243942036192,0.014736796921056365,0.05473130600944054
8.753753753753754,0.019141471943739018,0.01497295303268845,0.05473635309710107
8.76876876876877,0.01954596220789822,0.015412904205554176,0.05473585184031508
8.783783783783784,0.02018042847719237,0.016078583333199923,0.05473775190904109
8.7987987987988,0.021069646899985164,0.01699245221753588,0.05474932607503885
8.813813813813814,0.02223780929690571,0.018176717824393774,0.05477680954418457
8.82882882882883,0.023707607337343384,0.019652464191477398,0.054825163520752083
8.843843843843844,0.025499269869822417,0.021438725810864943,0.054897982175720464
8.85885885885886,0.027629582253519712,0.023551531117483187,0.05499754732023246
8.873873873873874,0.03011091836340483,0.026002947195965548,0.055125018815334895
8.88888888888889,0.03295031764660615,0.02880015901427038,0.05528073326587214
8.903903903903904,0.03614864118472653,0.031944618327917715,0.05546457096524164
8.91891891891892,0.03969984198096533,0.03543129865647058,0.055676343012839066
8.933933933933934,0.04359038527814177,0.039248093058468596,0.0559161479299745
8.94894894894895,0.04779885411393071,0.0433753903634545,0.05618465012207909
8.963963963963964,0.05229577294429068,0.047785862563635186,0.0564832407485687
8.97897897897898,0.05704367744716348,0.05244449078190339,0.05681405414866201
8.993993993993994,0.06199745112884771,0.05730884933877949,0.05717982886869431
9.00900900900901,0.0671049389342557,0.06232965692682565,0.0575836202640805
9.024024024024024,0.07230783492433014,0.06745159110332068,0.05802839004023136
9.03903903903904,0.07754282588624414,0.0726143479483865,0.05851651502372258
9.054054054054054,0.08274295658482464,0.07775391387771383,0.059049270680292434
9.06906906906907,0.087839166709032,0.08280400257362129,0.05962635214632608
9.084084084084084,0.09276193607524899,0.08769759822882145,0.060245495004462545
9.0990990990991,0.09744296494815696,0.09236853810537751,0.06090224895335544
9.114114114114114,0.1018168117698249,0.09675306381360518,0.06158994063737287
9.12912912912913,0.10582241196277592,0.10079127225592618,0.06229983952409381
9.144144144144144,0.10940440891833017,0.1044284038313664,0.06302151631460255
9.15915915915916,0.11251424118019553,0.10761591665035006,0.06374336078452306
9.174174174174174,0.11511094689987962,0.11031231006514379,0.06445320850675942
9.18918918918919,0.11716166611088867,0.11248367734345893,0.0651390157281451
9.204204204204204,0.11864184126464856,0.11410398423661024,0.06578951942175935
9.21921921921922,0.119535134887299,0.11515508603353486,0.06639482455453981
9.234234234234235,0.11983309857325797,0.11562650921678959,0.06694687134096734
9.24924924924925,0.11953463875015358,0.11551503418694334,0.06743974974829892
9.264264264264265,0.11864533122886838,0.11482412225671394,0.06786984484305521
9.27927927927928,0.11717663854558437,0.1135632331949564,0.06823581304423809
9.294294294294295,0.11514508201882845,0.11174707931403188,0.06853840462733082
9.30930930930931,0.11257141510312516,0.10939485896835713,0.06878016084673759
9.324324324324325,0.10947983699510745,0.10652950702598853,0.06896502396900624
9.33933933933934,0.10589727652322135,0.1031769930886237,0.06909790465203017
9.354354354354355,0.10185276701905746,0.09936569063794118,0.06918425295424813
9.36936936936937,0.09737692385545106,0.09512583247026518,0.06922967654843121
9.384384384384385,0.09250152818242734,0.09048906023829126,0.06923964254834507
9.3993993993994,0.087259213447692,0.08548806903077723,0.06921928830631233
9.414414414414415,0.08168324573922729,0.08015634196721166,0.06917335268625048
9.42942942942943,0.07580738488631322,0.07452796494907232,0.06910622417457624
9.444444444444445,0.06966581055569324,0.068637508094825,0.06902208752055065
9.45945945945946,0.06329309616723833,0.06251995802383069,0.06892513814274857
9.474474474474475,0.0567242131700405,0.05621068401476574,0.0688198247637027
9.48948948948949,0.04999454888183433,0.04974542106287966,0.068711076627217
9.504504504504505,0.043139922506159084,0.043160253865927596,0.06860447263311915
9.51951951951952,0.03619658590503366,0.03649158760896258,0.06850631566384714
9.534534534534535,0.029201198029060398,0.02977609388976415,0.06842358567950453
9.54954954954955,0.02219076441592374,0.023050623005675674,0.06836375884726935
9.564564564564565,0.015202535709662533,0.016352076879427697,0.06833449575188802
9.57957957957958,0.00827386160521144,0.009717239917740332,0.06834321801959627
9.594594594594595,0.0014419989000655118,0.0031825678826233206,0.06839660764071821
9.60960960960961,-0.005256125609786233,-0.0032160627330672276,0.06850007492930077
9.624624624624625,-0.011784194831239814,-0.009443640384850864,0.06865724756918817
9.63963963963964,-0.018106819511443308,-0.015466333309009117,0.06886953322951149
9.654654654654655,-0.024189889234136345,-0.021251826604406766,0.06913580137600332
9.66966966966967,-0.03000094943747691,-0.026769674042847035,0.06945221695415284
9.684684684684685,-0.035509596492411484,-0.031991656758528206,0.06981224157300053
9.6996996996997,-0.0406878819012217,-0.036892140832352836,0.07020679949806237
9.714714714714715,-0.04551071587843699,-0.04144842577488777,0.07062458916340854
9.72972972972973,-0.04995626002753158,-0.04564107599193276,0.07105250848455463
9.744744744744745,-0.054006298611939035,-0.049454227503749774,0.07147615537117528
9.75975975975976,-0.05764657812467994,-0.05287586253654974,0.07188036363637877
9.774774774774775,-0.06086710555478806,-0.055898045187023016,0.07224973806813842
9.78978978978979,-0.06366239695862519,-0.05851711224732561,0.07256915924639662
9.804804804804805,-0.0660316696426852,-0.06073381450813744,0.07282423709859767
9.81981981981982,-0.06797897336183104,-0.06255340541867102,0.07300170076265206
9.834834834834835,-0.0695132582842594,-0.06398567579999652,0.0730897200681816
9.84984984984985,-0.07064837987795446,-0.06504493524710206,0.07307816029606135
9.864864864864865,-0.07140304311623473,-0.06574994273625913,0.07295877662757139
9.87987987987988,-0.07180069026939391,-0.06612379057790706,0.07272535786482452
9.894894894894895,-0.07186933786323461,-0.06619374703054202,0.072373830713063
9.90990990990991,-0.07164136901445811,-0.06599106346397647,0.07190233630351911
9.924924924924925,-0.07115328723652413,-0.06555075183560566,0.07131128982396204
9.93993993993994,-0.07044543696157542,-0.06491133739830769,0.07060343220411167
9.954954954954955,-0.0695616945308523,-0.0641145900467839,0.06978387984198102
9.96996996996997,-0.068549131418802,-0.06320523565589352,0.06886017440954935
9.984984984984985,-0.06745764917784682,-0.0622306463561059,0.0678423298987691
10,-0.0663395832625667,-0.06124050616103583,0.06674286834517222
10.015015015015015,-0.06524927077849273,-0.06028644597560802,0.06557682925163048
10.03003003003003,-0.06424257557613539,-0.059421640053794904,0.06436173093764612
10.045045045045045,-0.06337636324496512,-0.05870035472832838,0.06311745544792219
10.06006006006006,-0.06270791870342474,-0.05817743997507064,0.06186602330038183
10.075075075075075,-0.06229430043700044,-0.057907755343863124,0.060631221877797056
10.09009009009009,-0.06219162814717311,-0.05794552417063649,0.05943805397495097
10.105105105105105,-0.06245430468207581,-0.05834361387807952,0.05831198365981923
10.12012012012012,-0.06313417853520567,-0.059152745542561884,0.057277977679447444
10.135135135135135,-0.064279659668242,-0.06042064255523554,0.05635937299728044
10.15015015015015,-0.06593480849931051,-0.06219113573923192,0.0555766420949758
10.165165165165165,-0.06813842497423611,-0.06450325009603536,0.054946169857130335
10.18018018018018,-0.07092317092415712,-0.06739030564448491,0.054479186863069455
10.195195195195195,-0.07431476353770579,-0.07087907065670498,0.05418100982580756
10.21021021021021,-0.07833127988522888,-0.07498900903265306,0.05405071126899174
10.225225225225225,-0.08298261132207059,-0.07973166375192678,0.054081278557376246
10.24024024024024,-0.08827010185779463,-0.08511021473743283,0.054260241375095046
10.255255255255255,-0.09418639621672187,-0.09111924192130692,0.05457066958864018
10.27027027027027,-0.10071551183166928,-0.09774471319716373,0.05499239210216741
10.285285285285285,-0.10783313539189579,-0.10496420318488064,0.05550327357471187
10.3003003003003,-0.11550713018071912,-0.11274733368574065,0.05608040768506666
10.315315315315315,-0.12369822686821502,-0.12105641200404502,0.056701130430520455
10.33033033033033,-0.13236085922285584,-0.1298472306302979,0.057343808619931685
10.345345345345345,-0.14144409865591295,-0.13906998257315656,0.05798840394839047
10.36036036036036,-0.150892638426445,-0.1486702418986523,0.0586168443949649
10.375375375375375,-0.16064777993769375,-0.1585899591997502,0.059213250536963996
10.39039039039039,-0.17064837947335154,-0.16876842656039037,0.059764067019635735
10.405405405405405,-0.18083172306961748,-0.17914317531671312,0.06025814290961786
10.42042042042042,-0.1911343087643871,-0.18965078136665103,0.06068679315029577
10.435435435435435,-0.20149252782756064,-0.20022756554035018,0.061043860171340926
10.45045045045045,-0.211843248417168,-0.21081018921189829,0.06132578210070699
10.465465465465465,-0.22212431527918322,-0.22133615665865575,0.06153166315487891
10.48048048048048,-0.2322749867569955,-0.23174424467632831,0.061663333045635565
10.495495495495495,-0.24223633496770366,-0.2419748859715806,0.06172537562712194
10.51051051051051,-0.25195163632257295,-0.25197053553365956,0.06172510242092032
10.525525525525525,-0.2613667776853,-0.2616760484750606,0.061672444180561906
10.54054054054054,-0.2704306986772458,-0.2710390939189507,0.06157973369825309
10.555555555555555,-0.27909588344889635,-0.28001062279796696,0.06146135636189605
10.57057057057057,-0.28731890629443474,-0.28854539849777777,0.06133325247241866
10.585585585585585,-0.2950610255720846,-0.2966025888754016,0.06121226781282224
10.6006006006006,-0.3022888103832226,-0.30414640719540337,0.06111536655023651
10.615615615615615,-0.3089747752862636,-0.31114677895373244,0.06105874214993556
10.63063063063063,-0.31509799089335755,-0.3175800024435032,0.06105688482016746
10.645645645645645,-0.3206446333390699,-0.3234293642603046,0.06112168367588088
10.66066066066066,-0.3256084339461415,-0.3286856675857736,0.06126165300300561
10.675675675675675,-0.3299909922773782,-0.3333476315770318,0.06148137005215704
10.69069069069069,-0.33380192112069385,-0.3374221246750958,0.06178119453468735
10.705705705705705,-0.3370588003708779,-0.34092420280739066,0.06215730919080515
10.72072072072072,-0.33978692743676914,-0.34387693451218115,0.06260208217813956
10.735735735735735,-0.3420188636192028,-0.34631100778615553,0.06310471370960144
10.75075075075075,-0.3437937876322387,-0.34826412655440137,0.06365209921665697
10.765765765765765,-0.34515667786478715,-0.34978021666617204,0.06422982443151463
10.78078078078078,-0.3461573530901214,-0.3509084710037375,0.06482320525088822
10.795795795795796,-0.34684940645568146,-0.35170226980085834,0.06541829448359808
10.81081081081081,-0.3472890694780814,-0.3522180152317875,0.06600279386621219
10.825825825825826,-0.3475340416183873,-0.35251391889119876,0.0665668279879024
10.84084084084084,-0.3476423173936507,-0.3526487775305634,0.0671035529657785
10.855855855855856,-0.3476710377426174,-0.3526807672627061,0.06760958451181431
10.87087087087087,-0.3476753864970539,-0.3526662804705239,0.06808523681110107
10.885885885885886,-0.3477075473025989,-0.35265882392599857,0.06853456618019255
10.9009009009009,-0.3478157320380761,-0.35270799204976716,0.06896521358965588
10.915915915915916,-0.34804328931377637,-0.3528585264519634,0.06938804022607956
10.93093093093093,-0.3484279012878145,-0.3531494721761066,0.06981655297336804
10.945945945945946,-0.34900087877119773,-0.35361344232753816,0.07026612441251608
10.96096096096096,-0.3497865679811086,-0.35427600554980415,0.07075302622062345
10.975975975975976,-0.35080188659861355,-0.35515521434756747,0.07129331564517495
10.99099099099099,-0.35205601097609457,-0.356261295547865,0.07190163973079865
11.006006006006006,-0.3535502392496792,-0.35759652614421283,0.07259004641136066
11.02102102102102,-0.35527805557151226,-0.35915531732964506,0.07336690888574475
11.036036036036036,-0.35722541770347105,-0.3609245258628515,0.07423607322837546
11.05105105105105,-0.359371283220908,-0.3628840045816658,0.07519632461463734
11.066066066066066,-0.36168837854971886,-0.3650073929623759,0.07624123496218481
11.08108108108108,-0.36414420067896164,-0.36726313480734385,0.0773594094354685
11.096096096096096,-0.3667022250170912,-0.36961569469852645,0.0785351002121347
11.11111111111111,-0.36932327640010776,-0.37202692951015587,0.07974911321882383
11.126126126126126,-0.37196700588767284,-0.37445755798152286,0.08097990507591629
11.14114114114114,-0.3745934057650464,-0.3768686619740824,0.08220475686873446
11.156156156156156,-0.37716429067658513,-0.3792231490208279,0.08340091769640703
11.17117117117117,-0.3796446748162197,-0.38148710786817785,0.08454663006933888
11.186186186186186,-0.38200398339402575,-0.3836309968016354,0.08562197554919046
11.2012012012012,-0.38421705006542795,-0.3856306176702039,0.08660950720158446
11.216216216216216,-0.3862648688329309,-0.3874678450261965,0.08749466132714742
11.23123123123123,-0.3881350869460514,-0.38913109763098086,0.08826596194228246
11.246246246246246,-0.3898222424132818,-0.3906155566641702,0.0889150463826114
11.26126126126126,-0.39132776415926696,-0.3919231495362173,0.08943654906070733
11.276276276276276,-0.3926597634687978,-0.3930623290101881,0.08982788342666939
11.29129129129129,-0.39383265168761983,-0.3940476838122913,0.09008896061028979
11.306306306306306,-0.3948666213460922,-0.3948994191114927,0.09022187834796479
11.32132132132132,-0.39578702655065834,-0.395642743742519,0.09023060694093914
11.336336336336336,-0.39662369454125945,-0.3963071967219277,0.09012069137833696
11.35135135135135,-0.39741019472185984,-0.3969259394811671,0.0898989814062699
11.366366366366366,-0.39818308515741535,-0.397535033296647,0.08957339497901383
11.381381381381381,-0.3989811502584966,-0.3981727144714095,0.0891527156418219
11.396396396396396,-0.39984463770718426,-0.39887867354985185,0.08864642114070329
11.411411411411411,-0.4008144979759022,-0.3996933396484257,0.0880645388690278
11.426426426426426,-0.40193162624201956,-0.4006571670968393,0.0874175234003571
11.441441441441441,-0.4032361041639167,-0.40180991909708597,0.08671615195648527
11.456456456456456,-0.40476643783474314,-0.4031899420141852,0.08597143478833358
11.471471471471471,-0.4065587882031561,-0.40483342414810963,0.08519453865694479
11.486486486486486,-0.40864619127034196,-0.40677363430843205,0.0843967224718298
11.501501501501501,-0.41105776736982125,-0.4090401381178503,0.08358928432575537
11.516516516516516,-0.41381792175099263,-0.4116579935961792,0.0827835184292739
11.531531531531531,-0.41694554245843746,-0.4146469320958055,0.08199067873285348
11.546546546546546,-0.4204532060458904,-0.4180205359151143,0.08122194347805028
11.561561561561561,-0.42434640685729,-0.42178542970015054,0.08048837192680536
11.576576576576576,-0.428622831238837,-0.4259405087790342,0.07980084169427494
11.591591591591591,-0.4332717037997436,-0.4304762334962565,0.07916995324599592
11.606606606606606,-0.4382732382711053,-0.43537402397323766,0.07860588807186103
11.621621621621621,-0.44359823004844584,-0.44060579398440386,0.07811820957907281
11.636636636636636,-0.4492078304596644,-0.4461336652155457,0.0777156013213678
11.651651651651651,-0.45505354343434434,-0.45190990346245363,0.07740554577322081
11.666666666666666,-0.4610774828446038,-0.45787711578136114,0.07719395778423217
11.681681681681681,-0.4672129227603825,-0.46396874179237624,0.07708479872819926
11.696696696696696,-0.4733851628966224,-0.47010986304434826,0.0770797082235671
11.711711711711711,-0.47951271769963666,-0.47621834164182186,0.0771776978906155
11.726726726726726,-0.48550882038475573,-0.4822062836274906,0.07737495384124121
11.741741741741741,-0.49128321387868434,-0.4879818046998188,0.07766479007161492
11.756756756756756,-0.49674418059495795,-0.4934510568816713,0.0780377833567878
11.771771771771771,-0.5018007441697686,-0.498520456191982,0.07848210263135923
11.786786786786786,-0.5063649607022886,-0.5030990348278749,0.07898402434737073
11.801801801801801,-0.5103542064921139,-0.5071008284544826,0.07952860286197248
11.816816816816816,-0.5136933650889229,-0.5104472013356095,0.0801004446902737
11.831831831831831,-0.5163168193014608,-0.5130690102302714,0.08068452035855302
11.846846846846846,-0.5181701634564498,-0.514908512676238,0.08126693985918419
11.861861861861861,-0.519211566637666,-0.5159209362790855,0.0818356187202042
11.876876876876876,-0.5194127371992564,-0.5160756420725942,0.08238077184303381
11.891891891891891,-0.5187594604831083,-0.5153568355173483,0.08289519083601926
11.906906906906906,-0.5172517032746614,-0.5137638015033786,0.08337428574701972
11.921921921921921,-0.5149032982697573,-0.5113106629432715,0.08381590092362325
11.936936936936936,-0.5117412383703459,-0.5080256844321346,0.08421994331643948
11.951951951951951,-0.5078046232841359,-0.503950161587349,0.0845878854962509
11.966966966966966,-0.5031433096022142,-0.49913695210241105,0.08492222078333042
11.981981981981981,-0.49781632070337495,-0.49364871579145453,0.08522595107030612
11.996996996996996,-0.49189007522724776,-0.4875559379476289,0.08550217797827951
12.012012012012011,-0.4854364933028726,-0.4809348135039604,0.08575384622497337
12.027027027027026,-0.4785310389397581,-0.47386506927130473,0.08598365828142565
12.042042042042041,-0.47125075546418493,-0.4664277984881122,0.08619414712210247
12.057057057057056,-0.4636723487928649,-0.45870337656001003,0.0863878652858109
12.072072072072071,-0.4558703705794801,-0.45076951961550765,0.08656762889431398
12.087087087087086,-0.4479155495629239,-0.4426995386994938,0.08673674806492279
12.102102102102101,-0.4398733144494291,-0.43456083237446697,0.08689918104406522
12.117117117117116,-0.4318025451164274,-0.42641364952492244,0.08705956657353986
12.132132132132131,-0.4237545807693814,-0.4183101426486813,0.08722311372145547
12.147147147147146,-0.4157725041043788,-0.4102937203334329,0.08739535585492825
12.162162162162161,-0.4078907099763403,-0.4023986964786583,0.08758180068965844
12.177177177177176,-0.40013475619343697,-0.3946502236664961,0.08778752724337148
12.192192192192191,-0.39252148360405004,-0.38706448939286925,0.08801679022599658
12.207207207207206,-0.3850593833504197,-0.3796491470145813,0.08827269183492631
12.222222222222221,-0.3777491816460632,-0.3724039484627705,0.08855697082625076
12.237237237237236,-0.37058460709776603,-0.36532154305380654,0.08886994143017482
12.252252252252251,-0.36355330259389523,-0.3583884059568067,0.08921059355222322
12.267267267267266,-0.35663784302701074,-0.35158586076981474,0.08957684444323845
12.282282282282281,-0.34981682130921027,-0.3448911628313382,0.08996591386180436
12.297297297297296,-0.3430659678269842,-0.3382786129191872,0.09037478187067684
12.312312312312311,-0.3363592721525666,-0.3317206744349758,0.09080068166748274
12.327327327327327,-0.32967007996805237,-0.32518907065642527,0.09124157890319885
12.342342342342342,-0.32297214231745053,-0.3186558418549816,0.09169659261839244
12.357357357357357,-0.3162405981367888,-0.3120943448169202,0.0921663197319781
12.372372372372372,-0.3094528743074584,-0.3054801794745198,0.09265303358480757
12.387387387387387,-0.30258949014909026,-0.29879202896006607,0.09316073642451989
12.402402402402402,-0.29563475535160305,-0.29201240054691213,0.09369505547616079
12.417417417417417,-0.2885773519762906,-0.2851282558247608,0.09426298233395228
12.432432432432432,-0.2814107925364244,-0.2781315193108851,0.09487246596186479
12.447447447447447,-0.2741337475383032,-0.2710194557883942,0.09553188061659812
12.462462462462462,-0.26675023746502974,-0.2637949082391017,0.09624940114416741
12.477477477477477,-0.25926968622719204,-0.2564663905080685,0.09703232846606531
12.492492492492492,-0.2517068357351119,-0.24904803192526315,0.0978864162871792
12.507507507507507,-0.24408152452887485,-0.24155937503627872,0.09881525450049211
12.522522522522522,-0.23641833729474304,-0.23402503225326987,0.0998197639800591
12.537537537537537,-0.22874613645092184,-0.22647421239772472,0.1008978506495722
12.552552552552552,-0.22109749155009412,-0.21894013342409327,0.10204425413782499
12.567567567567567,-0.21350802668448232,-0.21145934266285726,0.1032506093925054
12.582582582582582,-0.20601571000247296,-0.20407097024373635,0.10450572065240565
12.597597597597597,-0.19866011245360732,-0.1968159445160099,0.10579602890015426
12.612612612612612,-0.1914816646062059,-0.18973619991289484,0.10710623879562316
12.627627627627627,-0.18452094054699533,-0.1828739075779754,0.10842006077064015
12.642642642642642,-0.17781799631602457,-0.1762707571138272,0.1097210189956163
12.657657657657657,-0.1714117870449289,-0.1699673141318848,0.11099327579739222
12.672672672672672,-0.16533968210597783,-0.1640024731503424,0.1122224265475392
12.687687687687687,-0.15963709145012442,-0.15841301921051132,0.11339622445478943
12.702702702702702,-0.1543372093473773,-0.15323330485682457,0.11450520057740973
12.717717717717717,-0.14947087446009144,-0.14849504237925962,0.11554314962499507
12.732732732732732,-0.14506653813138065,-0.14422720495437585,0.1165074562456966
12.747747747747747,-0.14115032649096693,-0.14045602497598428,0.11739923965175761
12.762762762762762,-0.1377461769366396,-0.1372050737653803,0.11822329738633928
12.777777777777777,-0.1348760261018624,-0.1344954041923567,0.11898783300129026
12.792792792792792,-0.1325600247950872,-0.1323457365858019,0.11970395884342518
12.807807807807807,-0.13081675567022702,-0.13077266860228576,0.12038497536641198
12.822822822822824,-0.12966343148374154,-0.12979089127680846,0.1210454431908698
12.837837837837839,-0.12911605548965024,-0.1294133960374555,0.12170008333063083
12.852852852852854,-0.12918953046860746,-0.12965166070004333,0.12236256302924865
12.867867867867869,-0.1298977086268632,-0.13051580601423712,0.12304424646538942
12.882882882882884,-0.1312533806111389,-0.13201471785427613,0.12375300697238496
12.897897897897899,-0.13326820761251823,-0.1341561333119364,0.12449220581022052
12.912912912912914,-0.1359526054407643,-0.1369466914938931,0.12525993824384296
12.927927927927929,-0.1393155930741252,-0.14039195157136045,0.12604862920508114
12.942942942942944,-0.14336462018383317,-0.14449638149892483,0.12684502964320712
12.957957957957959,-0.14810538831828937,-0.14926332084077534,0.12763062527565913
12.972972972972974,-0.1535416788273093,-0.15469492044682914,0.1283824282700885
12.987987987987989,-0.15967519743641914,-0.1607920605235221,0.12907408613636026
13.003003003003004,-0.16650544106054935,-0.16755424721642187,0.1296772160613867
13.018018018018019,-0.17402958753967204,-0.17497948645943412,0.13016285979270834
13.033033033033034,-0.18224240413399398,-0.18306413283050596,0.13050295388613203
13.048048048048049,-0.19113616648626933,-0.1918027107221275,0.13067172039091698
13.063063063063064,-0.20070057692050236,-0.20118770545016015,0.13064690038963417
13.078078078078079,-0.21092266982797667,-0.21120932306095058,0.1304107736320993
13.093093093093094,-0.22178669272041796,-0.22185521953477164,0.12995092878424241
13.108108108108109,-0.23327395430519873,-0.2331102027147599,0.12926076844915155
13.123123123123124,-0.2453626354307083,-0.24495591342978898,0.12833974990745625
13.138138138138139,-0.2580275645317576,-0.2573704956840065,0.12719337595965502
13.153153153153154,-0.27123996569026376,-0.27032826917278274,0.12583296025390464
13.168168168168169,-0.28496719393429265,-0.283799420452643,0.1242751981779971
13.183183183183184,-0.29917247821776205,-0.2977497315374976,0.12254157799652585
13.198198198198199,-0.3138146969808409,-0.312140366227432,0.12065766769499157
13.213213213213214,-0.32884821371772693,-0.3269277348466577,0.11865231133034773
13.228228228228229,-0.34422280016712803,-0.34206345707729346,0.11655676514702334
13.243243243243244,-0.3598836723950844,-0.3574944401088726,0.11440379910849204
13.258258258258259,-0.3757716602069524,-0.37316308536775633,0.11222678486132273
13.273273273273274,-0.39182352330814413,-0.3890076317608679,0.11005878765617116
13.288288288288289,-0.407972418974703,-0.40496263691952,0.10793167845639613
13.303303303303304,-0.42414851643658713,-0.42095959075900524,0.10587528401117023
13.318318318318319,-0.4402797435864154,-0.4369276482979883,0.10391659696081766
13.333333333333334,-0.45629264290648264,-0.45279446171377247,0.10207907403165327
13.348348348348349,-0.47211330648929073,-0.46848708567506475,0.10038205608757805
13.363363363363364,-0.4876683553741773,-0.48393292567628104,0.09884034667254665
13.378378378378379,-0.5028859265469553,-0.49906069685605353,0.09746398322407411
13.393393393393394,-0.5176966319646163,-0.5138013608866618,0.09625822581763527
13.408408408408409,-0.5320344576805989,-0.5280890110041156,0.09522377223211767
13.423423423423424,-0.5458375770928284,-0.5418616798942836,0.09435718736902163
13.438438438438439,-0.5590490598471468,-0.5550620515138946,0.0936515132430377
13.453453453453454,-0.5716174662180996,-0.5676380653850316,0.09309700711174203
13.468468468468469,-0.5834973250545833,-0.5795434097364829,0.09268194341426514
13.483483483483484,-0.5946495008858353,-0.5907379073377815,0.0923934119933517
13.498498498498499,-0.605041461936892,-0.6011878043117856,0.09221805049869752
13.513513513513514,-0.6146474651827312,-0.6108659770801421,0.0921426610841513
13.528528528528529,-0.6234486769476233,-0.6197520755280502,0.09215467771186905
13.543543543543544,-0.6314332478809548,-0.6278326212939004,0.09224246766145197
13.558558558558559,-0.6385963595143656,-0.6351010788001252,0.092395466894623
13.573573573573574,-0.6449402562438532,-0.6415579134035257,0.0926041623364629
13.588588588588589,-0.6504742717801933,-0.6472106461360264,0.09285994438168058
13.603603603603604,-0.6552148532155326,-0.6520739082952777,0.09315486014653813
13.618618618618619,-0.6591855792358753,-0.6561694920495694,0.09348130262090482
13.633633633633634,-0.6624171620609508,-0.6595263857025145,0.0938316734292098
13.64864864864865,-0.6649474158279679,-0.6621807748103922,0.09419805772750248
13.663663663663664,-0.6668211677973179,-0.664175983484917,0.09457194894702464
13.67867867867868,-0.6680900834288608,-0.66556232451409,0.0949440585083644
13.693693693693694,-0.668812372584197,-0.666396823006276,0.09530424098748887
13.70870870870871,-0.6690523424189758,-0.6667427767540314,0.09564155820262422
13.723723723723724,-0.6688797635168623,-0.6666691180686681,0.0959444961162163
13.73873873873874,-0.6683690200233486,-0.6662495470297188,0.09620133637727322
13.753753753753754,-0.6675980223865521,-0.6655614153322068,0.09640067021214216
13.76876876876877,-0.6666468730098777,-0.6646843533102301,0.0965320271020229
13.783783783783784,-0.6655962905404337,-0.6636986499509074,0.09658657561884634
13.7987987987988,-0.6645258170846425,-0.6626834159306941,0.09655784067060204
13.813813813813814,-0.663511853260888,-0.661714581459144,0.09644237219353032
13.82882882882883,-0.6626255870290926,-0.6608628020105712,0.09624029692998504
13.843843843843844,-0.6619309015736864,-0.6601913634894776,0.09595568885258629
13.85885885885886,-0.6614823627772706,-0.6597541915432873,0.09559670576296886
13.873873873873874,-0.6613233956430074,-0.6595940754094624,0.0951754592286047
13.88888888888889,-0.661484759431739,-0.6597412133276853,0.09470761066497525
13.903903903903904,-0.6619834220830566,-0.6602121736130242,0.09421171512979164
13.91891891891892,-0.6628219155985687,-0.6610093436009519,0.0937083624516805
13.933933933933934,-0.6639882266657884,-0.6621209096405899,0.09321918847219472
13.94894894894895,-0.6654562433081738,-0.6635213778967207,0.09276584358858272
13.963963963963964,-0.6671867421301485,-0.665172611282631,0.09236900872145146
13.97897897897898,-0.6691288656306006,-0.6670253258577981,0.09204753937399889
13.993993993993994,-0.6712220088211026,-0.6690209635880175,0.09181779787238369
14.00900900900901,-0.6733980120569096,-0.6710938397988282,0.09169320559755088
14.024024024024024,-0.6755835444913647,-0.67317345422559,0.09168401601161007
14.03903903903904,-0.6777025604599014,-0.6751868544068331,0.09179728103535575
14.054054054054054,-0.6796787186144353,-0.6770609483646929,0.09203696261205041
14.06906906906907,-0.6814376688944894,-0.6787246783313355,0.09240413107218783
14.084084084084084,-0.6829091328711229,-0.6801109864775352,0.09289719282545682
14.0990990990991,-0.684028725814714,-0.6811585247835766,0.09351210033105925
14.114114114114114,-0.6847394913599554,-0.681813082118276,0.09424251402046549
14.12912912912913,-0.6849931396840969,-0.6820287203976962,0.0950799049929204
14.144144144144144,-0.6847509961414656,-0.6817686270438238,0.09601360525085506
14.15915915915916,-0.6839846784736138,-0.6810057020888072,0.09703082627737858
14.174174174174174,-0.6826765268557617,-0.6797229049452889,0.09811667539005375
14.18918918918919,-0.6808198124994416,-0.6779133883178524,0.09925420225404706
14.204204204204204,-0.6784187480601145,-0.6755804455423907,0.10042450589264787
14.21921921921922,-0.6754883177155341,-0.6727372936253002,0.10160692678952402
14.234234234234235,-0.6720539376594269,-0.6694067083688022,0.10277934075123854
14.24924924924925,-0.6681509501420281,-0.6656205212345392,0.1039185624968266
14.264264264264265,-0.6638239473379415,-0.6614189810435568,0.10500085853279954
14.27927927927928,-0.6591259164378109,-0.6568499782303131,0.10600256138542861
14.294294294294295,-0.6541171955323621,-0.6519681260731168,0.10690077089831444
14.30930930930931,-0.6488642319696367,-0.6468336928908486,0.10767412293400964
14.324324324324325,-0.6434381414809351,-0.6415113821949339,0.10830360113329185
14.33933933933934,-0.6379130775893553,-0.6360689644845168,0.10877336304483906
14.354354354354355,-0.6323644361406031,-0.6305757746347335,0.10907154770356053
14.36936936936937,-0.626866938034109,-0.6251011020166811,0.10919102756165318
14.384384384384385,-0.6214926524752918,-0.6197125154131979,0.10913006375423107
14.3993993993994,-0.6163090408089986,-0.6144741797366533,0.10889282044613799
14.414414414414415,-0.6113771143907504,-0.6094452343946262,0.10848969211547126
14.42942942942943,-0.6067498062541268,-0.6046783116225871,0.10793739792745576
14.444444444444445,-0.602470653382664,-0.6002182751609528,0.10725880083579456
14.45945945945946,-0.5985728731340945,-0.5961012538719577,0.10648241682106777
14.474474474474475,-0.5950788942007845,-0.5923540308397799,0.10564159286622052
14.48948948948949,-0.5920003714129051,-0.5889938269711468,0.10477335184914004
14.504504504504505,-0.5893386780706485,-0.586028491141483,0.10391692894915604
14.51951951951952,-0.5870858335680885,-0.5834570795209416,0.1031120567432389
14.534534534534535,-0.5852257922314729,-0.5812707783736627,0.10239709235871874
14.54954954954955,-0.5837359953080371,-0.57945410075744,0.10180711482007519
14.564564564564565,-0.5825890744244506,-0.577986270873984,0.10137214663230708
14.57957957957958,-0.5817545924943159,-0.5768427019191105,0.10111566212815047
14.594594594594595,-0.5812007162706023,-0.5759964744274547,0.10105352918812778
14.60960960960961,-0.5808957314547659,-0.5754197313271183,0.10119348854084365
14.624624624624625,-0.5808093335962498,-0.5750849213051497,0.10153521117139583
14.63963963963964,-0.5809136527864924,-0.5749658412087215,0.1020709016365528
14.654654654654655,-0.5811839944614955,-0.5750384485726703,0.1027863490913768
14.66966966966967,-0.581599300181237,-0.5752814347742791,0.10366228255394137
14.684684684684685,-0.5821423495546032,-0.5756765661151353,0.10467586987433464
14.6996996996997,-0.5827997368342096,-0.5762088133019285,0.10580221028222803
14.714714714714715,-0.583561663119114,-0.5768662989446008,0.10701570087069909
14.72972972972973,-0.5844215880851305,-0.5776400979213624,0.10829119755237566
14.744744744744745,-0.5853757845281483,-0.5785239272447221,0.1096049312306376
14.75975975975976,-0.586422835694747,-0.5795137610752871,0.11093517351813373
14.774774774774775,-0.5875631103086777,-0.5806074035168627,0.11226267025714347
14.78978978978979,-0.5887982441954761,-0.5818040475057015,0.11357087522681583
14.804804804804805,-0.590130651117408,-0.5831038431054149,0.11484602239596464
14.81981981981982,-0.5915630793452846,-0.584507493340587,0.11607707520492179
14.834834834834835,-0.5930982249407463,-0.5860158907195756,0.11725558787732131
14.84984984984985,-0.5947384078957088,-0.5876298030616339,0.1183755084767437
14.864864864864865,-0.5964853132608753,-0.5893496133036764,0.11943294760172088
14.87987987987988,-0.5983397962007564,-0.5911751146839754,0.1204259310407854
14.894894894894895,-0.600301747493368,-0.5931053600900268,0.12135414980282805
14.90990990990991,-0.6023700142718846,-0.5951385623804629,0.12221871686144345
14.924924924924925,-0.6045423696885819,-0.5972720410853537,0.12302193671577859
14.93993993993994,-0.6068155245698308,-0.5995022099807263,0.12376709140182986
14.954954954954955,-0.6091851739272488,-0.601824599542202,0.1244582447771832
14.96996996996997,-0.6116460713045604,-0.604233908130828,0.125100065629456
14.984984984984985,-0.6141921242919303,-0.6067240758778706,0.1256976693104762
15,-0.6168165050594727,-0.6092883755485812,0.12625647707376875
