interval,output,model_id,model_label,model_theory,model_colour,timbre_label
0,0.8541326964234335,Har18,Harrison & Pearce (2018),harmonicity,#11A3FF,Stretched
0.015015015015015015,0.848124615376119,Har18,Harrison & Pearce (2018),harmonicity,#11A3FF,Stretched
0.03003003003003003,0.8387679812662439,Har18,Harrison & Pearce (2018),harmonicity,#11A3FF,Stretched
0.04504504504504504,0.8258240920292499,Har18,Harrison & Pearce (2018),harmonicity,#11A3FF,Stretched
0.06006006006006006,0.8095514035177279,Har18,Harrison & Pearce (2018),harmonicity,#11A3FF,Stretched
0.07507507507507508,0.7904104623352783,Har18,Harrison & Pearce (2018),harmonicity,#11A3FF,Stretched
0.09009009009009009,0.7687888571939165,Har18,Harrison & Pearce (2018),harmonicity,#11A3FF,Stretched
0.10510510510510511,0.7450689497738635,Har18,Harrison & Pearce (2018),harmonicity,#11A3FF,Stretched
0.12012012012012012,0.7197810813386134,Har18,Harrison & Pearce (2018),harmonicity,#11A3FF,Stretched
0.13513513513513514,0.6935485514722947,Har18,Harrison & Pearce (2018),harmonicity,#11A3FF,Stretched
0.15015015015015015,0.6669218089420897,Har18,Harrison & Pearce (2018),harmonicity,#11A3FF,Stretched
0.16516516516516516,0.6403078611113031,Har18,Harrison & Pearce (2018),harmonicity,#11A3FF,Stretched
0.18018018018018017,0.6140329433049388,Har18,Harrison & Pearce (2018),harmonicity,#11A3FF,Stretched
0.19519519519519518,0.5884358125222852,Har18,Harrison & Pearce (2018),harmonicity,#11A3FF,Stretched
0.21021021021021022,0.5638879933265211,Har18,Harrison & Pearce (2018),harmonicity,#11A3FF,Stretched
0.22522522522522523,0.5407364504958251,Har18,Harrison & Pearce (2018),harmonicity,#11A3FF,Stretched
0.24024024024024024,0.5192359750758794,Har18,Harrison & Pearce (2018),harmonicity,#11A3FF,Stretched
0.2552552552552553,0.4995053766206522,Har18,Harrison & Pearce (2018),harmonicity,#11A3FF,Stretched
0.2702702702702703,0.4815071286851852,Har18,Harrison & Pearce (2018),harmonicity,#11A3FF,Stretched
0.2852852852852853,0.4650906448994292,Har18,Harrison & Pearce (2018),harmonicity,#11A3FF,Stretched
0.3003003003003003,0.4501218687327366,Har18,Harrison & Pearce (2018),harmonicity,#11A3FF,Stretched
0.3153153153153153,0.4365935386829888,Har18,Harrison & Pearce (2018),harmonicity,#11A3FF,Stretched
0.3303303303303303,0.4245922805609137,Har18,Harrison & Pearce (2018),harmonicity,#11A3FF,Stretched
0.34534534534534533,0.41417730634999717,Har18,Harrison & Pearce (2018),harmonicity,#11A3FF,Stretched
0.36036036036036034,0.4053265562538961,Har18,Harrison & Pearce (2018),harmonicity,#11A3FF,Stretched
0.37537537537537535,0.39797830486641217,Har18,Harrison & Pearce (2018),harmonicity,#11A3FF,Stretched
0.39039039039039036,0.3920714208010756,Har18,Harrison & Pearce (2018),harmonicity,#11A3FF,Stretched
0.40540540540540543,0.38753863845059533,Har18,Harrison & Pearce (2018),harmonicity,#11A3FF,Stretched
0.42042042042042044,0.38429934522307674,Har18,Harrison & Pearce (2018),harmonicity,#11A3FF,Stretched
0.43543543543543545,0.3822896286062328,Har18,Harrison & Pearce (2018),harmonicity,#11A3FF,Stretched
0.45045045045045046,0.3815007199302397,Har18,Harrison & Pearce (2018),harmonicity,#11A3FF,Stretched
0.46546546546546547,0.38197362534450613,Har18,Harrison & Pearce (2018),harmonicity,#11A3FF,Stretched
0.4804804804804805,0.38374724601583937,Har18,Harrison & Pearce (2018),harmonicity,#11A3FF,Stretched
0.4954954954954955,0.3868141293058156,Har18,Harrison & Pearce (2018),harmonicity,#11A3FF,Stretched
0.5105105105105106,0.3911272131058886,Har18,Harrison & Pearce (2018),harmonicity,#11A3FF,Stretched
0.5255255255255256,0.3966477770556652,Har18,Harrison & Pearce (2018),harmonicity,#11A3FF,Stretched
0.5405405405405406,0.4033971512700014,Har18,Harrison & Pearce (2018),harmonicity,#11A3FF,Stretched
0.5555555555555556,0.4114663897740436,Har18,Harrison & Pearce (2018),harmonicity,#11A3FF,Stretched
0.5705705705705706,0.4209442494877248,Har18,Harrison & Pearce (2018),harmonicity,#11A3FF,Stretched
0.5855855855855856,0.4318060831333637,Har18,Harrison & Pearce (2018),harmonicity,#11A3FF,Stretched
0.6006006006006006,0.4438931346539428,Har18,Harrison & Pearce (2018),harmonicity,#11A3FF,Stretched
0.6156156156156156,0.45701382248962097,Har18,Harrison & Pearce (2018),harmonicity,#11A3FF,Stretched
0.6306306306306306,0.47102452772878656,Har18,Harrison & Pearce (2018),harmonicity,#11A3FF,Stretched
0.6456456456456456,0.48579401408482764,Har18,Harrison & Pearce (2018),harmonicity,#11A3FF,Stretched
0.6606606606606606,0.5011338183300875,Har18,Harrison & Pearce (2018),harmonicity,#11A3FF,Stretched
0.6756756756756757,0.5167903392744315,Har18,Harrison & Pearce (2018),harmonicity,#11A3FF,Stretched
0.6906906906906907,0.5324795135005486,Har18,Harrison & Pearce (2018),harmonicity,#11A3FF,Stretched
0.7057057057057057,0.5479061564557903,Har18,Harrison & Pearce (2018),harmonicity,#11A3FF,Stretched
0.7207207207207207,0.5627583264246399,Har18,Harrison & Pearce (2018),harmonicity,#11A3FF,Stretched
0.7357357357357357,0.5767108351677396,Har18,Harrison & Pearce (2018),harmonicity,#11A3FF,Stretched
0.7507507507507507,0.589474915378382,Har18,Harrison & Pearce (2018),harmonicity,#11A3FF,Stretched
0.7657657657657657,0.6008728372229725,Har18,Harrison & Pearce (2018),harmonicity,#11A3FF,Stretched
0.7807807807807807,0.6108165568698964,Har18,Harrison & Pearce (2018),harmonicity,#11A3FF,Stretched
0.7957957957957957,0.6190893314243909,Har18,Harrison & Pearce (2018),harmonicity,#11A3FF,Stretched
0.8108108108108109,0.6251057058943184,Har18,Harrison & Pearce (2018),harmonicity,#11A3FF,Stretched
0.8258258258258259,0.6280585015391014,Har18,Harrison & Pearce (2018),harmonicity,#11A3FF,Stretched
0.8408408408408409,0.6274989662934821,Har18,Harrison & Pearce (2018),harmonicity,#11A3FF,Stretched
0.8558558558558559,0.6237311262822957,Har18,Harrison & Pearce (2018),harmonicity,#11A3FF,Stretched
0.8708708708708709,0.6175289580967209,Har18,Harrison & Pearce (2018),harmonicity,#11A3FF,Stretched
0.8858858858858859,0.6095476847629301,Har18,Harrison & Pearce (2018),harmonicity,#11A3FF,Stretched
0.9009009009009009,0.6000706521315979,Har18,Harrison & Pearce (2018),harmonicity,#11A3FF,Stretched
0.9159159159159159,0.5891668962753951,Har18,Harrison & Pearce (2018),harmonicity,#11A3FF,Stretched
0.9309309309309309,0.576933759895906,Har18,Harrison & Pearce (2018),harmonicity,#11A3FF,Stretched
0.9459459459459459,0.5636125911106394,Har18,Harrison & Pearce (2018),harmonicity,#11A3FF,Stretched
0.960960960960961,0.5495676001961114,Har18,Harrison & Pearce (2018),harmonicity,#11A3FF,Stretched
0.975975975975976,0.535199587963572,Har18,Harrison & Pearce (2018),harmonicity,#11A3FF,Stretched
0.990990990990991,0.5208749518396356,Har18,Harrison & Pearce (2018),harmonicity,#11A3FF,Stretched
1.006006006006006,0.5069056673829203,Har18,Harrison & Pearce (2018),harmonicity,#11A3FF,Stretched
1.021021021021021,0.4935571248665799,Har18,Harrison & Pearce (2018),harmonicity,#11A3FF,Stretched
1.0360360360360361,0.4810436973106846,Har18,Harrison & Pearce (2018),harmonicity,#11A3FF,Stretched
1.0510510510510511,0.46950070173899205,Har18,Harrison & Pearce (2018),harmonicity,#11A3FF,Stretched
1.0660660660660661,0.4589660668452439,Har18,Harrison & Pearce (2018),harmonicity,#11A3FF,Stretched
1.0810810810810811,0.44941437484284913,Har18,Harrison & Pearce (2018),harmonicity,#11A3FF,Stretched
1.0960960960960962,0.4408289413401087,Har18,Harrison & Pearce (2018),harmonicity,#11A3FF,Stretched
1.1111111111111112,0.43323990726006273,Har18,Harrison & Pearce (2018),harmonicity,#11A3FF,Stretched
1.1261261261261262,0.4266910413168361,Har18,Harrison & Pearce (2018),harmonicity,#11A3FF,Stretched
1.1411411411411412,0.42118623077315764,Har18,Harrison & Pearce (2018),harmonicity,#11A3FF,Stretched
1.1561561561561562,0.41668007255570705,Har18,Harrison & Pearce (2018),harmonicity,#11A3FF,Stretched
1.1711711711711712,0.41310501791545534,Har18,Harrison & Pearce (2018),harmonicity,#11A3FF,Stretched
1.1861861861861862,0.4103872158333716,Har18,Harrison & Pearce (2018),harmonicity,#11A3FF,Stretched
1.2012012012012012,0.4084387653098422,Har18,Harrison & Pearce (2018),harmonicity,#11A3FF,Stretched
1.2162162162162162,0.4071523237110996,Har18,Harrison & Pearce (2018),harmonicity,#11A3FF,Stretched
1.2312312312312312,0.4064155139684588,Har18,Harrison & Pearce (2018),harmonicity,#11A3FF,Stretched
1.2462462462462462,0.40613432261339494,Har18,Harrison & Pearce (2018),harmonicity,#11A3FF,Stretched
1.2612612612612613,0.4062460663469479,Har18,Harrison & Pearce (2018),harmonicity,#11A3FF,Stretched
1.2762762762762763,0.40671694344529913,Har18,Harrison & Pearce (2018),harmonicity,#11A3FF,Stretched
1.2912912912912913,0.4075328708914352,Har18,Harrison & Pearce (2018),harmonicity,#11A3FF,Stretched
1.3063063063063063,0.40869196811028025,Har18,Harrison & Pearce (2018),harmonicity,#11A3FF,Stretched
1.3213213213213213,0.4102014386880995,Har18,Harrison & Pearce (2018),harmonicity,#11A3FF,Stretched
1.3363363363363363,0.4120784075852044,Har18,Harrison & Pearce (2018),harmonicity,#11A3FF,Stretched
1.3513513513513513,0.4143514712215339,Har18,Harrison & Pearce (2018),harmonicity,#11A3FF,Stretched
1.3663663663663663,0.41705869505683757,Har18,Harrison & Pearce (2018),harmonicity,#11A3FF,Stretched
1.3813813813813813,0.42024067270248255,Har18,Harrison & Pearce (2018),harmonicity,#11A3FF,Stretched
1.3963963963963963,0.42392631633563393,Har18,Harrison & Pearce (2018),harmonicity,#11A3FF,Stretched
1.4114114114114114,0.42811219729990074,Har18,Harrison & Pearce (2018),harmonicity,#11A3FF,Stretched
1.4264264264264264,0.4327630416144031,Har18,Harrison & Pearce (2018),harmonicity,#11A3FF,Stretched
1.4414414414414414,0.4378601907304055,Har18,Harrison & Pearce (2018),harmonicity,#11A3FF,Stretched
1.4564564564564564,0.44344340070207916,Har18,Harrison & Pearce (2018),harmonicity,#11A3FF,Stretched
1.4714714714714714,0.44955625856941633,Har18,Harrison & Pearce (2018),harmonicity,#11A3FF,Stretched
1.4864864864864864,0.456133045665267,Har18,Harrison & Pearce (2018),harmonicity,#11A3FF,Stretched
1.5015015015015014,0.46297240683011875,Har18,Harrison & Pearce (2018),harmonicity,#11A3FF,Stretched
1.5165165165165164,0.469839441360878,Har18,Harrison & Pearce (2018),harmonicity,#11A3FF,Stretched
1.5315315315315314,0.4765726363405512,Har18,Harrison & Pearce (2018),harmonicity,#11A3FF,Stretched
1.5465465465465464,0.4830785028847005,Har18,Harrison & Pearce (2018),harmonicity,#11A3FF,Stretched
1.5615615615615615,0.4892446553766936,Har18,Harrison & Pearce (2018),harmonicity,#11A3FF,Stretched
1.5765765765765765,0.4948901752672659,Har18,Harrison & Pearce (2018),harmonicity,#11A3FF,Stretched
1.5915915915915915,0.4998109325575887,Har18,Harrison & Pearce (2018),harmonicity,#11A3FF,Stretched
1.6066066066066067,0.5038671906811159,Har18,Harrison & Pearce (2018),harmonicity,#11A3FF,Stretched
1.6216216216216217,0.5070303249024035,Har18,Harrison & Pearce (2018),harmonicity,#11A3FF,Stretched
1.6366366366366367,0.5093604405836997,Har18,Harrison & Pearce (2018),harmonicity,#11A3FF,Stretched
1.6516516516516517,0.5109185739817979,Har18,Harrison & Pearce (2018),harmonicity,#11A3FF,Stretched
1.6666666666666667,0.5116085296643663,Har18,Harrison & Pearce (2018),harmonicity,#11A3FF,Stretched
1.6816816816816818,0.5110555807885673,Har18,Harrison & Pearce (2018),harmonicity,#11A3FF,Stretched
1.6966966966966968,0.5087703388356647,Har18,Harrison & Pearce (2018),harmonicity,#11A3FF,Stretched
1.7117117117117118,0.5045844860886138,Har18,Harrison & Pearce (2018),harmonicity,#11A3FF,Stretched
1.7267267267267268,0.4988755005933766,Har18,Harrison & Pearce (2018),harmonicity,#11A3FF,Stretched
1.7417417417417418,0.4922723210066633,Har18,Harrison & Pearce (2018),harmonicity,#11A3FF,Stretched
1.7567567567567568,0.48521806247592175,Har18,Harrison & Pearce (2018),harmonicity,#11A3FF,Stretched
1.7717717717717718,0.47787018938122233,Har18,Harrison & Pearce (2018),harmonicity,#11A3FF,Stretched
1.7867867867867868,0.47028393004242514,Har18,Harrison & Pearce (2018),harmonicity,#11A3FF,Stretched
1.8018018018018018,0.4625610129796039,Har18,Harrison & Pearce (2018),harmonicity,#11A3FF,Stretched
1.8168168168168168,0.4548561696920644,Har18,Harrison & Pearce (2018),harmonicity,#11A3FF,Stretched
1.8318318318318318,0.44732725332506146,Har18,Harrison & Pearce (2018),harmonicity,#11A3FF,Stretched
1.8468468468468469,0.44010371862759534,Har18,Harrison & Pearce (2018),harmonicity,#11A3FF,Stretched
1.8618618618618619,0.43329046454630804,Har18,Harrison & Pearce (2018),harmonicity,#11A3FF,Stretched
1.8768768768768769,0.42699497178628276,Har18,Harrison & Pearce (2018),harmonicity,#11A3FF,Stretched
1.8918918918918919,0.4213437158001613,Har18,Harrison & Pearce (2018),harmonicity,#11A3FF,Stretched
1.906906906906907,0.4164597077976839,Har18,Harrison & Pearce (2018),harmonicity,#11A3FF,Stretched
1.921921921921922,0.4124136575510979,Har18,Harrison & Pearce (2018),harmonicity,#11A3FF,Stretched
1.936936936936937,0.4091914857380713,Har18,Harrison & Pearce (2018),harmonicity,#11A3FF,Stretched
1.951951951951952,0.4067163602819202,Har18,Harrison & Pearce (2018),harmonicity,#11A3FF,Stretched
1.966966966966967,0.4049191765001966,Har18,Harrison & Pearce (2018),harmonicity,#11A3FF,Stretched
1.981981981981982,0.4037915721408079,Har18,Harrison & Pearce (2018),harmonicity,#11A3FF,Stretched
1.996996996996997,0.40336843656721066,Har18,Harrison & Pearce (2018),harmonicity,#11A3FF,Stretched
2.012012012012012,0.40367367431328094,Har18,Harrison & Pearce (2018),harmonicity,#11A3FF,Stretched
2.027027027027027,0.40468769844488733,Har18,Harrison & Pearce (2018),harmonicity,#11A3FF,Stretched
2.042042042042042,0.40634386210707474,Har18,Harrison & Pearce (2018),harmonicity,#11A3FF,Stretched
2.057057057057057,0.4085461345327194,Har18,Harrison & Pearce (2018),harmonicity,#11A3FF,Stretched
2.0720720720720722,0.41120402495779307,Har18,Harrison & Pearce (2018),harmonicity,#11A3FF,Stretched
2.0870870870870872,0.41425429635391475,Har18,Harrison & Pearce (2018),harmonicity,#11A3FF,Stretched
2.1021021021021022,0.417647913469075,Har18,Harrison & Pearce (2018),harmonicity,#11A3FF,Stretched
2.1171171171171173,0.4213274200988798,Har18,Harrison & Pearce (2018),harmonicity,#11A3FF,Stretched
2.1321321321321323,0.42522581635481077,Har18,Harrison & Pearce (2018),harmonicity,#11A3FF,Stretched
2.1471471471471473,0.4292854048331672,Har18,Harrison & Pearce (2018),harmonicity,#11A3FF,Stretched
2.1621621621621623,0.4334757795423838,Har18,Harrison & Pearce (2018),harmonicity,#11A3FF,Stretched
2.1771771771771773,0.43779611184894224,Har18,Harrison & Pearce (2018),harmonicity,#11A3FF,Stretched
2.1921921921921923,0.4422591025165964,Har18,Harrison & Pearce (2018),harmonicity,#11A3FF,Stretched
2.2072072072072073,0.446860878194959,Har18,Harrison & Pearce (2018),harmonicity,#11A3FF,Stretched
2.2222222222222223,0.45155464705823284,Har18,Harrison & Pearce (2018),harmonicity,#11A3FF,Stretched
2.2372372372372373,0.4562620081562553,Har18,Harrison & Pearce (2018),harmonicity,#11A3FF,Stretched
2.2522522522522523,0.4609372365582798,Har18,Harrison & Pearce (2018),harmonicity,#11A3FF,Stretched
2.2672672672672673,0.46563899082745935,Har18,Harrison & Pearce (2018),harmonicity,#11A3FF,Stretched
2.2822822822822824,0.4705188445919268,Har18,Harrison & Pearce (2018),harmonicity,#11A3FF,Stretched
2.2972972972972974,0.4756908395112925,Har18,Harrison & Pearce (2018),harmonicity,#11A3FF,Stretched
2.3123123123123124,0.4810927437019585,Har18,Harrison & Pearce (2018),harmonicity,#11A3FF,Stretched
2.3273273273273274,0.4865004758283052,Har18,Harrison & Pearce (2018),harmonicity,#11A3FF,Stretched
2.3423423423423424,0.4916879126733165,Har18,Harrison & Pearce (2018),harmonicity,#11A3FF,Stretched
2.3573573573573574,0.49654905159134066,Har18,Harrison & Pearce (2018),harmonicity,#11A3FF,Stretched
2.3723723723723724,0.5010610718895889,Har18,Harrison & Pearce (2018),harmonicity,#11A3FF,Stretched
2.3873873873873874,0.5051522134657789,Har18,Harrison & Pearce (2018),harmonicity,#11A3FF,Stretched
2.4024024024024024,0.5086185879170642,Har18,Harrison & Pearce (2018),harmonicity,#11A3FF,Stretched
2.4174174174174174,0.5111914396195668,Har18,Harrison & Pearce (2018),harmonicity,#11A3FF,Stretched
2.4324324324324325,0.5127526254076271,Har18,Harrison & Pearce (2018),harmonicity,#11A3FF,Stretched
2.4474474474474475,0.5135062148003378,Har18,Harrison & Pearce (2018),harmonicity,#11A3FF,Stretched
2.4624624624624625,0.5138092484701748,Har18,Harrison & Pearce (2018),harmonicity,#11A3FF,Stretched
2.4774774774774775,0.5137453141195645,Har18,Harrison & Pearce (2018),harmonicity,#11A3FF,Stretched
2.4924924924924925,0.5130490697969089,Har18,Harrison & Pearce (2018),harmonicity,#11A3FF,Stretched
2.5075075075075075,0.5115950719434784,Har18,Harrison & Pearce (2018),harmonicity,#11A3FF,Stretched
2.5225225225225225,0.5097066027776291,Har18,Harrison & Pearce (2018),harmonicity,#11A3FF,Stretched
2.5375375375375375,0.5077427783995282,Har18,Harrison & Pearce (2018),harmonicity,#11A3FF,Stretched
2.5525525525525525,0.505593921583402,Har18,Harrison & Pearce (2018),harmonicity,#11A3FF,Stretched
2.5675675675675675,0.502826519130919,Har18,Harrison & Pearce (2018),harmonicity,#11A3FF,Stretched
2.5825825825825826,0.4991805563382097,Har18,Harrison & Pearce (2018),harmonicity,#11A3FF,Stretched
2.5975975975975976,0.49474635673499856,Har18,Harrison & Pearce (2018),harmonicity,#11A3FF,Stretched
2.6126126126126126,0.4897754680117842,Har18,Harrison & Pearce (2018),harmonicity,#11A3FF,Stretched
2.6276276276276276,0.4845023143630539,Har18,Harrison & Pearce (2018),harmonicity,#11A3FF,Stretched
2.6426426426426426,0.47913457141276045,Har18,Harrison & Pearce (2018),harmonicity,#11A3FF,Stretched
2.6576576576576576,0.47388290678150496,Har18,Harrison & Pearce (2018),harmonicity,#11A3FF,Stretched
2.6726726726726726,0.46891926653845384,Har18,Harrison & Pearce (2018),harmonicity,#11A3FF,Stretched
2.6876876876876876,0.46431108450690484,Har18,Harrison & Pearce (2018),harmonicity,#11A3FF,Stretched
2.7027027027027026,0.46002732352400183,Har18,Harrison & Pearce (2018),harmonicity,#11A3FF,Stretched
2.7177177177177176,0.4560263232587252,Har18,Harrison & Pearce (2018),harmonicity,#11A3FF,Stretched
2.7327327327327327,0.45233785072817745,Har18,Harrison & Pearce (2018),harmonicity,#11A3FF,Stretched
2.7477477477477477,0.44905501505072953,Har18,Harrison & Pearce (2018),harmonicity,#11A3FF,Stretched
2.7627627627627627,0.4462543195153377,Har18,Harrison & Pearce (2018),harmonicity,#11A3FF,Stretched
2.7777777777777777,0.4439368309490276,Har18,Harrison & Pearce (2018),harmonicity,#11A3FF,Stretched
2.7927927927927927,0.44204264728159565,Har18,Harrison & Pearce (2018),harmonicity,#11A3FF,Stretched
2.8078078078078077,0.44050448014586246,Har18,Harrison & Pearce (2018),harmonicity,#11A3FF,Stretched
2.8228228228228227,0.439282246470479,Har18,Harrison & Pearce (2018),harmonicity,#11A3FF,Stretched
2.8378378378378377,0.4383650679896007,Har18,Harrison & Pearce (2018),harmonicity,#11A3FF,Stretched
2.8528528528528527,0.437761008660085,Har18,Harrison & Pearce (2018),harmonicity,#11A3FF,Stretched
2.8678678678678677,0.43748026324155054,Har18,Harrison & Pearce (2018),harmonicity,#11A3FF,Stretched
2.8828828828828827,0.43751253566432263,Har18,Harrison & Pearce (2018),harmonicity,#11A3FF,Stretched
2.8978978978978978,0.43782244034391293,Har18,Harrison & Pearce (2018),harmonicity,#11A3FF,Stretched
2.9129129129129128,0.4383684295848254,Har18,Harrison & Pearce (2018),harmonicity,#11A3FF,Stretched
2.9279279279279278,0.4391116640318432,Har18,Harrison & Pearce (2018),harmonicity,#11A3FF,Stretched
2.942942942942943,0.44000702413334847,Har18,Harrison & Pearce (2018),harmonicity,#11A3FF,Stretched
2.957957957957958,0.4410066429745692,Har18,Harrison & Pearce (2018),harmonicity,#11A3FF,Stretched
2.972972972972973,0.44207850792271586,Har18,Harrison & Pearce (2018),harmonicity,#11A3FF,Stretched
2.987987987987988,0.44321264823616435,Har18,Harrison & Pearce (2018),harmonicity,#11A3FF,Stretched
3.003003003003003,0.4444101515914738,Har18,Harrison & Pearce (2018),harmonicity,#11A3FF,Stretched
3.018018018018018,0.44567387379490986,Har18,Harrison & Pearce (2018),harmonicity,#11A3FF,Stretched
3.033033033033033,0.4470087817012198,Har18,Harrison & Pearce (2018),harmonicity,#11A3FF,Stretched
3.048048048048048,0.44842278025007054,Har18,Harrison & Pearce (2018),harmonicity,#11A3FF,Stretched
3.063063063063063,0.4499206695239448,Har18,Harrison & Pearce (2018),harmonicity,#11A3FF,Stretched
3.078078078078078,0.4514958474170931,Har18,Harrison & Pearce (2018),harmonicity,#11A3FF,Stretched
3.093093093093093,0.4531285738321062,Har18,Harrison & Pearce (2018),harmonicity,#11A3FF,Stretched
3.108108108108108,0.45479463903470907,Har18,Harrison & Pearce (2018),harmonicity,#11A3FF,Stretched
3.123123123123123,0.45648053221331814,Har18,Harrison & Pearce (2018),harmonicity,#11A3FF,Stretched
3.138138138138138,0.4581921373928415,Har18,Harrison & Pearce (2018),harmonicity,#11A3FF,Stretched
3.153153153153153,0.45994349544255686,Har18,Harrison & Pearce (2018),harmonicity,#11A3FF,Stretched
3.168168168168168,0.461730803364903,Har18,Harrison & Pearce (2018),harmonicity,#11A3FF,Stretched
3.183183183183183,0.46351897275634396,Har18,Harrison & Pearce (2018),harmonicity,#11A3FF,Stretched
3.198198198198198,0.4652619398503062,Har18,Harrison & Pearce (2018),harmonicity,#11A3FF,Stretched
3.2132132132132134,0.4669373330260954,Har18,Harrison & Pearce (2018),harmonicity,#11A3FF,Stretched
3.2282282282282284,0.46855179555524556,Har18,Harrison & Pearce (2018),harmonicity,#11A3FF,Stretched
3.2432432432432434,0.4701123295765426,Har18,Harrison & Pearce (2018),harmonicity,#11A3FF,Stretched
3.2582582582582584,0.47160713593828163,Har18,Harrison & Pearce (2018),harmonicity,#11A3FF,Stretched
3.2732732732732734,0.47302401890829554,Har18,Harrison & Pearce (2018),harmonicity,#11A3FF,Stretched
3.2882882882882885,0.47439137569010253,Har18,Harrison & Pearce (2018),harmonicity,#11A3FF,Stretched
3.3033033033033035,0.47580404602822624,Har18,Harrison & Pearce (2018),harmonicity,#11A3FF,Stretched
3.3183183183183185,0.4773787752367658,Har18,Harrison & Pearce (2018),harmonicity,#11A3FF,Stretched
3.3333333333333335,0.47911226752670205,Har18,Harrison & Pearce (2018),harmonicity,#11A3FF,Stretched
3.3483483483483485,0.4807602872249588,Har18,Harrison & Pearce (2018),harmonicity,#11A3FF,Stretched
3.3633633633633635,0.48195888098721795,Har18,Harrison & Pearce (2018),harmonicity,#11A3FF,Stretched
3.3783783783783785,0.4825695915374795,Har18,Harrison & Pearce (2018),harmonicity,#11A3FF,Stretched
3.3933933933933935,0.4828653722282632,Har18,Harrison & Pearce (2018),harmonicity,#11A3FF,Stretched
3.4084084084084085,0.4833153282765537,Har18,Harrison & Pearce (2018),harmonicity,#11A3FF,Stretched
3.4234234234234235,0.4842387365265842,Har18,Harrison & Pearce (2018),harmonicity,#11A3FF,Stretched
3.4384384384384385,0.4856884374370084,Har18,Harrison & Pearce (2018),harmonicity,#11A3FF,Stretched
3.4534534534534536,0.48757166158333576,Har18,Harrison & Pearce (2018),harmonicity,#11A3FF,Stretched
3.4684684684684686,0.48981387066817533,Har18,Harrison & Pearce (2018),harmonicity,#11A3FF,Stretched
3.4834834834834836,0.49242496541638003,Har18,Harrison & Pearce (2018),harmonicity,#11A3FF,Stretched
3.4984984984984986,0.4954440972006622,Har18,Harrison & Pearce (2018),harmonicity,#11A3FF,Stretched
3.5135135135135136,0.49885294180269346,Har18,Harrison & Pearce (2018),harmonicity,#11A3FF,Stretched
3.5285285285285286,0.5025653218157919,Har18,Harrison & Pearce (2018),harmonicity,#11A3FF,Stretched
3.5435435435435436,0.5064896921292749,Har18,Harrison & Pearce (2018),harmonicity,#11A3FF,Stretched
3.5585585585585586,0.5105768938096327,Har18,Harrison & Pearce (2018),harmonicity,#11A3FF,Stretched
3.5735735735735736,0.5148117287732308,Har18,Harrison & Pearce (2018),harmonicity,#11A3FF,Stretched
3.5885885885885886,0.5191828263676317,Har18,Harrison & Pearce (2018),harmonicity,#11A3FF,Stretched
3.6036036036036037,0.5236420574851472,Har18,Harrison & Pearce (2018),harmonicity,#11A3FF,Stretched
3.6186186186186187,0.5280080980377735,Har18,Harrison & Pearce (2018),harmonicity,#11A3FF,Stretched
3.6336336336336337,0.5318740792544596,Har18,Harrison & Pearce (2018),harmonicity,#11A3FF,Stretched
3.6486486486486487,0.5347385286105101,Har18,Harrison & Pearce (2018),harmonicity,#11A3FF,Stretched
3.6636636636636637,0.5363712721745687,Har18,Harrison & Pearce (2018),harmonicity,#11A3FF,Stretched
3.6786786786786787,0.5370018936772961,Har18,Harrison & Pearce (2018),harmonicity,#11A3FF,Stretched
3.6936936936936937,0.537052597271522,Har18,Harrison & Pearce (2018),harmonicity,#11A3FF,Stretched
3.7087087087087087,0.5367522114232113,Har18,Harrison & Pearce (2018),harmonicity,#11A3FF,Stretched
3.7237237237237237,0.5360737796491862,Har18,Harrison & Pearce (2018),harmonicity,#11A3FF,Stretched
3.7387387387387387,0.5349359806860776,Har18,Harrison & Pearce (2018),harmonicity,#11A3FF,Stretched
3.7537537537537538,0.5333458314308674,Har18,Harrison & Pearce (2018),harmonicity,#11A3FF,Stretched
3.7687687687687688,0.531380557501323,Har18,Harrison & Pearce (2018),harmonicity,#11A3FF,Stretched
3.7837837837837838,0.5291278635605378,Har18,Harrison & Pearce (2018),harmonicity,#11A3FF,Stretched
3.798798798798799,0.5266650688246939,Har18,Harrison & Pearce (2018),harmonicity,#11A3FF,Stretched
3.813813813813814,0.5240537466191135,Har18,Harrison & Pearce (2018),harmonicity,#11A3FF,Stretched
3.828828828828829,0.5213382132717976,Har18,Harrison & Pearce (2018),harmonicity,#11A3FF,Stretched
3.843843843843844,0.5185667921566525,Har18,Harrison & Pearce (2018),harmonicity,#11A3FF,Stretched
3.858858858858859,0.5158180586521391,Har18,Harrison & Pearce (2018),harmonicity,#11A3FF,Stretched
3.873873873873874,0.513199848040464,Har18,Harrison & Pearce (2018),harmonicity,#11A3FF,Stretched
3.888888888888889,0.5108193753332847,Har18,Harrison & Pearce (2018),harmonicity,#11A3FF,Stretched
3.903903903903904,0.5087317563938869,Har18,Harrison & Pearce (2018),harmonicity,#11A3FF,Stretched
3.918918918918919,0.5068877988612539,Har18,Harrison & Pearce (2018),harmonicity,#11A3FF,Stretched
3.933933933933934,0.5051425120493349,Har18,Harrison & Pearce (2018),harmonicity,#11A3FF,Stretched
3.948948948948949,0.5033551497965881,Har18,Harrison & Pearce (2018),harmonicity,#11A3FF,Stretched
3.963963963963964,0.5014966820695828,Har18,Harrison & Pearce (2018),harmonicity,#11A3FF,Stretched
3.978978978978979,0.49965419540852307,Har18,Harrison & Pearce (2018),harmonicity,#11A3FF,Stretched
3.993993993993994,0.49794078124896307,Har18,Harrison & Pearce (2018),harmonicity,#11A3FF,Stretched
4.009009009009009,0.4964076551281801,Har18,Harrison & Pearce (2018),harmonicity,#11A3FF,Stretched
4.024024024024024,0.49501577805549074,Har18,Harrison & Pearce (2018),harmonicity,#11A3FF,Stretched
4.039039039039039,0.49365867044116074,Har18,Harrison & Pearce (2018),harmonicity,#11A3FF,Stretched
4.054054054054054,0.492211551127964,Har18,Harrison & Pearce (2018),harmonicity,#11A3FF,Stretched
4.069069069069069,0.49058073562760307,Har18,Harrison & Pearce (2018),harmonicity,#11A3FF,Stretched
4.084084084084084,0.48872625677151205,Har18,Harrison & Pearce (2018),harmonicity,#11A3FF,Stretched
4.099099099099099,0.4866495987265295,Har18,Harrison & Pearce (2018),harmonicity,#11A3FF,Stretched
4.114114114114114,0.48436703445073254,Har18,Harrison & Pearce (2018),harmonicity,#11A3FF,Stretched
4.129129129129129,0.4819014117439285,Har18,Harrison & Pearce (2018),harmonicity,#11A3FF,Stretched
4.1441441441441444,0.4792954740443967,Har18,Harrison & Pearce (2018),harmonicity,#11A3FF,Stretched
4.1591591591591595,0.47660977988692377,Har18,Harrison & Pearce (2018),harmonicity,#11A3FF,Stretched
4.1741741741741745,0.47389821328715953,Har18,Harrison & Pearce (2018),harmonicity,#11A3FF,Stretched
4.1891891891891895,0.47120547298069626,Har18,Harrison & Pearce (2018),harmonicity,#11A3FF,Stretched
4.2042042042042045,0.46859897393976113,Har18,Harrison & Pearce (2018),harmonicity,#11A3FF,Stretched
4.2192192192192195,0.46619063456398796,Har18,Harrison & Pearce (2018),harmonicity,#11A3FF,Stretched
4.2342342342342345,0.46411541152493396,Har18,Harrison & Pearce (2018),harmonicity,#11A3FF,Stretched
4.2492492492492495,0.4624838473982402,Har18,Harrison & Pearce (2018),harmonicity,#11A3FF,Stretched
4.2642642642642645,0.4613532397831292,Har18,Harrison & Pearce (2018),harmonicity,#11A3FF,Stretched
4.2792792792792795,0.46074532680827623,Har18,Harrison & Pearce (2018),harmonicity,#11A3FF,Stretched
4.2942942942942945,0.460694502240687,Har18,Harrison & Pearce (2018),harmonicity,#11A3FF,Stretched
4.3093093093093096,0.4612733308758077,Har18,Harrison & Pearce (2018),harmonicity,#11A3FF,Stretched
4.324324324324325,0.46255489647458986,Har18,Harrison & Pearce (2018),harmonicity,#11A3FF,Stretched
4.33933933933934,0.4645462643319924,Har18,Harrison & Pearce (2018),harmonicity,#11A3FF,Stretched
4.354354354354355,0.46716558367524025,Har18,Harrison & Pearce (2018),harmonicity,#11A3FF,Stretched
4.36936936936937,0.47027430372532397,Har18,Harrison & Pearce (2018),harmonicity,#11A3FF,Stretched
4.384384384384385,0.4737254492538976,Har18,Harrison & Pearce (2018),harmonicity,#11A3FF,Stretched
4.3993993993994,0.47740576551545544,Har18,Harrison & Pearce (2018),harmonicity,#11A3FF,Stretched
4.414414414414415,0.48125545460619285,Har18,Harrison & Pearce (2018),harmonicity,#11A3FF,Stretched
4.42942942942943,0.48522778928337185,Har18,Harrison & Pearce (2018),harmonicity,#11A3FF,Stretched
4.444444444444445,0.48916980208611394,Har18,Harrison & Pearce (2018),harmonicity,#11A3FF,Stretched
4.45945945945946,0.4927192825704738,Har18,Harrison & Pearce (2018),harmonicity,#11A3FF,Stretched
4.474474474474475,0.4954122086437511,Har18,Harrison & Pearce (2018),harmonicity,#11A3FF,Stretched
4.48948948948949,0.4970072933265048,Har18,Harrison & Pearce (2018),harmonicity,#11A3FF,Stretched
4.504504504504505,0.4976838131516804,Har18,Harrison & Pearce (2018),harmonicity,#11A3FF,Stretched
4.51951951951952,0.4978483203119729,Har18,Harrison & Pearce (2018),harmonicity,#11A3FF,Stretched
4.534534534534535,0.49778755673362385,Har18,Harrison & Pearce (2018),harmonicity,#11A3FF,Stretched
4.54954954954955,0.49755668568364164,Har18,Harrison & Pearce (2018),harmonicity,#11A3FF,Stretched
4.564564564564565,0.49710589812747774,Har18,Harrison & Pearce (2018),harmonicity,#11A3FF,Stretched
4.57957957957958,0.49639198899623244,Har18,Harrison & Pearce (2018),harmonicity,#11A3FF,Stretched
4.594594594594595,0.4953969149074832,Har18,Harrison & Pearce (2018),harmonicity,#11A3FF,Stretched
4.60960960960961,0.49415500327372974,Har18,Harrison & Pearce (2018),harmonicity,#11A3FF,Stretched
4.624624624624625,0.49280035957362306,Har18,Harrison & Pearce (2018),harmonicity,#11A3FF,Stretched
4.63963963963964,0.4915406601214554,Har18,Harrison & Pearce (2018),harmonicity,#11A3FF,Stretched
4.654654654654655,0.49055373096536115,Har18,Harrison & Pearce (2018),harmonicity,#11A3FF,Stretched
4.66966966966967,0.489922590838681,Har18,Harrison & Pearce (2018),harmonicity,#11A3FF,Stretched
4.684684684684685,0.4896707678867208,Har18,Harrison & Pearce (2018),harmonicity,#11A3FF,Stretched
4.6996996996997,0.4898297999279293,Har18,Harrison & Pearce (2018),harmonicity,#11A3FF,Stretched
4.714714714714715,0.49046540645113484,Har18,Harrison & Pearce (2018),harmonicity,#11A3FF,Stretched
4.72972972972973,0.49166645987443425,Har18,Harrison & Pearce (2018),harmonicity,#11A3FF,Stretched
4.744744744744745,0.493514466665864,Har18,Harrison & Pearce (2018),harmonicity,#11A3FF,Stretched
4.75975975975976,0.49603101478729067,Har18,Harrison & Pearce (2018),harmonicity,#11A3FF,Stretched
4.774774774774775,0.4991320581612294,Har18,Harrison & Pearce (2018),harmonicity,#11A3FF,Stretched
4.78978978978979,0.5026489637457622,Har18,Harrison & Pearce (2018),harmonicity,#11A3FF,Stretched
4.804804804804805,0.5064182092925659,Har18,Harrison & Pearce (2018),harmonicity,#11A3FF,Stretched
4.81981981981982,0.5103473548290394,Har18,Harrison & Pearce (2018),harmonicity,#11A3FF,Stretched
4.834834834834835,0.5143843523091172,Har18,Harrison & Pearce (2018),harmonicity,#11A3FF,Stretched
4.84984984984985,0.5184435135911903,Har18,Harrison & Pearce (2018),harmonicity,#11A3FF,Stretched
4.864864864864865,0.5223831102542158,Har18,Harrison & Pearce (2018),harmonicity,#11A3FF,Stretched
4.87987987987988,0.5260383198966357,Har18,Harrison & Pearce (2018),harmonicity,#11A3FF,Stretched
4.894894894894895,0.5292518017164781,Har18,Harrison & Pearce (2018),harmonicity,#11A3FF,Stretched
4.90990990990991,0.531880367329315,Har18,Harrison & Pearce (2018),harmonicity,#11A3FF,Stretched
4.924924924924925,0.5337981729709944,Har18,Harrison & Pearce (2018),harmonicity,#11A3FF,Stretched
4.93993993993994,0.5349100431009088,Har18,Harrison & Pearce (2018),harmonicity,#11A3FF,Stretched
4.954954954954955,0.5351642292202506,Har18,Harrison & Pearce (2018),harmonicity,#11A3FF,Stretched
4.96996996996997,0.5345483679316007,Har18,Harrison & Pearce (2018),harmonicity,#11A3FF,Stretched
4.984984984984985,0.5330725377822063,Har18,Harrison & Pearce (2018),harmonicity,#11A3FF,Stretched
5,0.5307649487570956,Har18,Harrison & Pearce (2018),harmonicity,#11A3FF,Stretched
5.015015015015015,0.5276899692416838,Har18,Harrison & Pearce (2018),harmonicity,#11A3FF,Stretched
5.03003003003003,0.5239618030446828,Har18,Harrison & Pearce (2018),harmonicity,#11A3FF,Stretched
5.045045045045045,0.519736655878286,Har18,Harrison & Pearce (2018),harmonicity,#11A3FF,Stretched
5.06006006006006,0.5152008205071397,Har18,Harrison & Pearce (2018),harmonicity,#11A3FF,Stretched
5.075075075075075,0.5105592617687876,Har18,Harrison & Pearce (2018),harmonicity,#11A3FF,Stretched
5.09009009009009,0.5060105094467475,Har18,Harrison & Pearce (2018),harmonicity,#11A3FF,Stretched
5.105105105105105,0.501719500227603,Har18,Harrison & Pearce (2018),harmonicity,#11A3FF,Stretched
5.12012012012012,0.497807651319578,Har18,Harrison & Pearce (2018),harmonicity,#11A3FF,Stretched
5.135135135135135,0.49435250735652925,Har18,Harrison & Pearce (2018),harmonicity,#11A3FF,Stretched
5.15015015015015,0.4913894596957062,Har18,Harrison & Pearce (2018),harmonicity,#11A3FF,Stretched
5.165165165165165,0.4889220559871091,Har18,Harrison & Pearce (2018),harmonicity,#11A3FF,Stretched
5.18018018018018,0.48693478863884726,Har18,Harrison & Pearce (2018),harmonicity,#11A3FF,Stretched
5.195195195195195,0.48539472742894013,Har18,Harrison & Pearce (2018),harmonicity,#11A3FF,Stretched
5.21021021021021,0.4842481403603745,Har18,Harrison & Pearce (2018),harmonicity,#11A3FF,Stretched
5.225225225225225,0.4834327270100821,Har18,Harrison & Pearce (2018),harmonicity,#11A3FF,Stretched
5.24024024024024,0.48291620013427833,Har18,Harrison & Pearce (2018),harmonicity,#11A3FF,Stretched
5.255255255255255,0.4827355755384798,Har18,Harrison & Pearce (2018),harmonicity,#11A3FF,Stretched
5.27027027027027,0.48294938441921215,Har18,Harrison & Pearce (2018),harmonicity,#11A3FF,Stretched
5.285285285285285,0.4834283051385781,Har18,Harrison & Pearce (2018),harmonicity,#11A3FF,Stretched
5.3003003003003,0.48364661344369725,Har18,Harrison & Pearce (2018),harmonicity,#11A3FF,Stretched
5.315315315315315,0.48285510809738097,Har18,Harrison & Pearce (2018),harmonicity,#11A3FF,Stretched
5.33033033033033,0.4806553259021094,Har18,Harrison & Pearce (2018),harmonicity,#11A3FF,Stretched
5.345345345345345,0.4773457977418705,Har18,Harrison & Pearce (2018),harmonicity,#11A3FF,Stretched
5.36036036036036,0.473593562023473,Har18,Harrison & Pearce (2018),harmonicity,#11A3FF,Stretched
5.375375375375375,0.4698663490304168,Har18,Harrison & Pearce (2018),harmonicity,#11A3FF,Stretched
5.39039039039039,0.4662527946338705,Har18,Harrison & Pearce (2018),harmonicity,#11A3FF,Stretched
5.405405405405405,0.462661030409308,Har18,Harrison & Pearce (2018),harmonicity,#11A3FF,Stretched
5.42042042042042,0.45902690465106655,Har18,Harrison & Pearce (2018),harmonicity,#11A3FF,Stretched
5.435435435435435,0.45537425331913334,Har18,Harrison & Pearce (2018),harmonicity,#11A3FF,Stretched
5.45045045045045,0.45179726400321946,Har18,Harrison & Pearce (2018),harmonicity,#11A3FF,Stretched
5.465465465465465,0.4484362078349191,Har18,Harrison & Pearce (2018),harmonicity,#11A3FF,Stretched
5.48048048048048,0.4454535037770344,Har18,Harrison & Pearce (2018),harmonicity,#11A3FF,Stretched
5.495495495495495,0.4430039393553578,Har18,Harrison & Pearce (2018),harmonicity,#11A3FF,Stretched
5.51051051051051,0.4412089882033951,Har18,Harrison & Pearce (2018),harmonicity,#11A3FF,Stretched
5.525525525525525,0.44014959500551964,Har18,Harrison & Pearce (2018),harmonicity,#11A3FF,Stretched
5.54054054054054,0.4398797864651854,Har18,Harrison & Pearce (2018),harmonicity,#11A3FF,Stretched
5.555555555555555,0.44044811166087866,Har18,Harrison & Pearce (2018),harmonicity,#11A3FF,Stretched
5.57057057057057,0.44190630495181904,Har18,Harrison & Pearce (2018),harmonicity,#11A3FF,Stretched
5.585585585585585,0.4442930812282278,Har18,Harrison & Pearce (2018),harmonicity,#11A3FF,Stretched
5.6006006006006,0.44760598763708076,Har18,Harrison & Pearce (2018),harmonicity,#11A3FF,Stretched
5.615615615615615,0.45179066466461487,Har18,Harrison & Pearce (2018),harmonicity,#11A3FF,Stretched
5.63063063063063,0.4567556819180836,Har18,Harrison & Pearce (2018),harmonicity,#11A3FF,Stretched
5.645645645645645,0.4623874243977145,Har18,Harrison & Pearce (2018),harmonicity,#11A3FF,Stretched
5.66066066066066,0.468546065596101,Har18,Harrison & Pearce (2018),harmonicity,#11A3FF,Stretched
5.675675675675675,0.47505910715579774,Har18,Harrison & Pearce (2018),harmonicity,#11A3FF,Stretched
5.6906906906906904,0.4817346638661307,Har18,Harrison & Pearce (2018),harmonicity,#11A3FF,Stretched
5.7057057057057055,0.488386649279681,Har18,Harrison & Pearce (2018),harmonicity,#11A3FF,Stretched
5.7207207207207205,0.4948496042366176,Har18,Harrison & Pearce (2018),harmonicity,#11A3FF,Stretched
5.7357357357357355,0.5009803044239505,Har18,Harrison & Pearce (2018),harmonicity,#11A3FF,Stretched
5.7507507507507505,0.506662720414164,Har18,Harrison & Pearce (2018),harmonicity,#11A3FF,Stretched
5.7657657657657655,0.5118346134380669,Har18,Harrison & Pearce (2018),harmonicity,#11A3FF,Stretched
5.7807807807807805,0.5165258389056439,Har18,Harrison & Pearce (2018),harmonicity,#11A3FF,Stretched
5.7957957957957955,0.5208172512681413,Har18,Harrison & Pearce (2018),harmonicity,#11A3FF,Stretched
5.8108108108108105,0.5246173604552231,Har18,Harrison & Pearce (2018),harmonicity,#11A3FF,Stretched
5.8258258258258255,0.5274229797187441,Har18,Harrison & Pearce (2018),harmonicity,#11A3FF,Stretched
5.8408408408408405,0.5285049570239065,Har18,Harrison & Pearce (2018),harmonicity,#11A3FF,Stretched
5.8558558558558556,0.5275586177653548,Har18,Harrison & Pearce (2018),harmonicity,#11A3FF,Stretched
5.870870870870871,0.5251018135936953,Har18,Harrison & Pearce (2018),harmonicity,#11A3FF,Stretched
5.885885885885886,0.5220949746936965,Har18,Harrison & Pearce (2018),harmonicity,#11A3FF,Stretched
5.900900900900901,0.519265069700836,Har18,Harrison & Pearce (2018),harmonicity,#11A3FF,Stretched
5.915915915915916,0.5168584132689291,Har18,Harrison & Pearce (2018),harmonicity,#11A3FF,Stretched
5.930930930930931,0.5148488793212439,Har18,Harrison & Pearce (2018),harmonicity,#11A3FF,Stretched
5.945945945945946,0.513197547863707,Har18,Harrison & Pearce (2018),harmonicity,#11A3FF,Stretched
5.960960960960961,0.5119391893305055,Har18,Harrison & Pearce (2018),harmonicity,#11A3FF,Stretched
5.975975975975976,0.5111348720367004,Har18,Harrison & Pearce (2018),harmonicity,#11A3FF,Stretched
5.990990990990991,0.5108136574788991,Har18,Harrison & Pearce (2018),harmonicity,#11A3FF,Stretched
6.006006006006006,0.5109739954441919,Har18,Harrison & Pearce (2018),harmonicity,#11A3FF,Stretched
6.021021021021021,0.5116162421463468,Har18,Harrison & Pearce (2018),harmonicity,#11A3FF,Stretched
6.036036036036036,0.5127406929622644,Har18,Harrison & Pearce (2018),harmonicity,#11A3FF,Stretched
6.051051051051051,0.514303825455114,Har18,Harrison & Pearce (2018),harmonicity,#11A3FF,Stretched
6.066066066066066,0.5161855361769495,Har18,Harrison & Pearce (2018),harmonicity,#11A3FF,Stretched
6.081081081081081,0.5182040494687932,Har18,Harrison & Pearce (2018),harmonicity,#11A3FF,Stretched
6.096096096096096,0.5201599027499686,Har18,Harrison & Pearce (2018),harmonicity,#11A3FF,Stretched
6.111111111111111,0.5218675223508713,Har18,Harrison & Pearce (2018),harmonicity,#11A3FF,Stretched
6.126126126126126,0.523157459103669,Har18,Harrison & Pearce (2018),harmonicity,#11A3FF,Stretched
6.141141141141141,0.5238666551194853,Har18,Harrison & Pearce (2018),harmonicity,#11A3FF,Stretched
6.156156156156156,0.5238403619964305,Har18,Harrison & Pearce (2018),harmonicity,#11A3FF,Stretched
6.171171171171171,0.5229504997426194,Har18,Harrison & Pearce (2018),harmonicity,#11A3FF,Stretched
6.186186186186186,0.5211173037003838,Har18,Harrison & Pearce (2018),harmonicity,#11A3FF,Stretched
6.201201201201201,0.5183183801970676,Har18,Harrison & Pearce (2018),harmonicity,#11A3FF,Stretched
6.216216216216216,0.5145818194029156,Har18,Harrison & Pearce (2018),harmonicity,#11A3FF,Stretched
6.231231231231231,0.5099744648867562,Har18,Harrison & Pearce (2018),harmonicity,#11A3FF,Stretched
6.246246246246246,0.5045956661963823,Har18,Harrison & Pearce (2018),harmonicity,#11A3FF,Stretched
6.261261261261261,0.4985745331960201,Har18,Harrison & Pearce (2018),harmonicity,#11A3FF,Stretched
6.276276276276276,0.49206376448786115,Har18,Harrison & Pearce (2018),harmonicity,#11A3FF,Stretched
6.291291291291291,0.4852317488290685,Har18,Harrison & Pearce (2018),harmonicity,#11A3FF,Stretched
6.306306306306306,0.4782628945884577,Har18,Harrison & Pearce (2018),harmonicity,#11A3FF,Stretched
6.321321321321321,0.47136554748391574,Har18,Harrison & Pearce (2018),harmonicity,#11A3FF,Stretched
6.336336336336336,0.4647643732801154,Har18,Harrison & Pearce (2018),harmonicity,#11A3FF,Stretched
6.351351351351351,0.45866023608413964,Har18,Harrison & Pearce (2018),harmonicity,#11A3FF,Stretched
6.366366366366366,0.4531873115479824,Har18,Harrison & Pearce (2018),harmonicity,#11A3FF,Stretched
6.381381381381381,0.4484194180435354,Har18,Harrison & Pearce (2018),harmonicity,#11A3FF,Stretched
6.396396396396396,0.4444251754878094,Har18,Harrison & Pearce (2018),harmonicity,#11A3FF,Stretched
6.411411411411412,0.4413059430624724,Har18,Harrison & Pearce (2018),harmonicity,#11A3FF,Stretched
6.426426426426427,0.4391620106340198,Har18,Harrison & Pearce (2018),harmonicity,#11A3FF,Stretched
6.441441441441442,0.4380163921196908,Har18,Harrison & Pearce (2018),harmonicity,#11A3FF,Stretched
6.456456456456457,0.4377851473753845,Har18,Harrison & Pearce (2018),harmonicity,#11A3FF,Stretched
6.471471471471472,0.4383361230451306,Har18,Harrison & Pearce (2018),harmonicity,#11A3FF,Stretched
6.486486486486487,0.4395727860483318,Har18,Harrison & Pearce (2018),harmonicity,#11A3FF,Stretched
6.501501501501502,0.44145289807622556,Har18,Harrison & Pearce (2018),harmonicity,#11A3FF,Stretched
6.516516516516517,0.4439351329643668,Har18,Harrison & Pearce (2018),harmonicity,#11A3FF,Stretched
6.531531531531532,0.4469258438575118,Har18,Harrison & Pearce (2018),harmonicity,#11A3FF,Stretched
6.546546546546547,0.4502833664974471,Har18,Harrison & Pearce (2018),harmonicity,#11A3FF,Stretched
6.561561561561562,0.4538715342954063,Har18,Harrison & Pearce (2018),harmonicity,#11A3FF,Stretched
6.576576576576577,0.45761983806294043,Har18,Harrison & Pearce (2018),harmonicity,#11A3FF,Stretched
6.591591591591592,0.46154567870110763,Har18,Harrison & Pearce (2018),harmonicity,#11A3FF,Stretched
6.606606606606607,0.46568654150500965,Har18,Harrison & Pearce (2018),harmonicity,#11A3FF,Stretched
6.621621621621622,0.4699225551417148,Har18,Harrison & Pearce (2018),harmonicity,#11A3FF,Stretched
6.636636636636637,0.4738279466281181,Har18,Harrison & Pearce (2018),harmonicity,#11A3FF,Stretched
6.651651651651652,0.47681566120962965,Har18,Harrison & Pearce (2018),harmonicity,#11A3FF,Stretched
6.666666666666667,0.4785722967564638,Har18,Harrison & Pearce (2018),harmonicity,#11A3FF,Stretched
6.681681681681682,0.47932452301933165,Har18,Harrison & Pearce (2018),harmonicity,#11A3FF,Stretched
6.696696696696697,0.4796092882777203,Har18,Harrison & Pearce (2018),harmonicity,#11A3FF,Stretched
6.711711711711712,0.4798519540242924,Har18,Harrison & Pearce (2018),harmonicity,#11A3FF,Stretched
6.726726726726727,0.48020704892954413,Har18,Harrison & Pearce (2018),harmonicity,#11A3FF,Stretched
6.741741741741742,0.4806749918214141,Har18,Harrison & Pearce (2018),harmonicity,#11A3FF,Stretched
6.756756756756757,0.48124983345421457,Har18,Harrison & Pearce (2018),harmonicity,#11A3FF,Stretched
6.771771771771772,0.48198126013026327,Har18,Harrison & Pearce (2018),harmonicity,#11A3FF,Stretched
6.786786786786787,0.48297036938347243,Har18,Harrison & Pearce (2018),harmonicity,#11A3FF,Stretched
6.801801801801802,0.4843283138607975,Har18,Harrison & Pearce (2018),harmonicity,#11A3FF,Stretched
6.816816816816817,0.4861257453495822,Har18,Harrison & Pearce (2018),harmonicity,#11A3FF,Stretched
6.831831831831832,0.4883723128912135,Har18,Harrison & Pearce (2018),harmonicity,#11A3FF,Stretched
6.846846846846847,0.4910431265157903,Har18,Harrison & Pearce (2018),harmonicity,#11A3FF,Stretched
6.861861861861862,0.49412492604393604,Har18,Harrison & Pearce (2018),harmonicity,#11A3FF,Stretched
6.876876876876877,0.49763298286078594,Har18,Harrison & Pearce (2018),harmonicity,#11A3FF,Stretched
6.891891891891892,0.5015760551540484,Har18,Harrison & Pearce (2018),harmonicity,#11A3FF,Stretched
6.906906906906907,0.50590065058366,Har18,Harrison & Pearce (2018),harmonicity,#11A3FF,Stretched
6.921921921921922,0.5104674049996119,Har18,Harrison & Pearce (2018),harmonicity,#11A3FF,Stretched
6.936936936936937,0.5150785728136669,Har18,Harrison & Pearce (2018),harmonicity,#11A3FF,Stretched
6.951951951951952,0.5195296057080407,Har18,Harrison & Pearce (2018),harmonicity,#11A3FF,Stretched
6.966966966966967,0.523644505195183,Har18,Harrison & Pearce (2018),harmonicity,#11A3FF,Stretched
6.981981981981982,0.5272790332386786,Har18,Harrison & Pearce (2018),harmonicity,#11A3FF,Stretched
6.996996996996997,0.5303070486436124,Har18,Harrison & Pearce (2018),harmonicity,#11A3FF,Stretched
7.012012012012012,0.5326118127500072,Har18,Harrison & Pearce (2018),harmonicity,#11A3FF,Stretched
7.027027027027027,0.5340917720732824,Har18,Harrison & Pearce (2018),harmonicity,#11A3FF,Stretched
7.042042042042042,0.5346777794692552,Har18,Harrison & Pearce (2018),harmonicity,#11A3FF,Stretched
7.057057057057057,0.5343505215598289,Har18,Harrison & Pearce (2018),harmonicity,#11A3FF,Stretched
7.072072072072072,0.5331461097056905,Har18,Harrison & Pearce (2018),harmonicity,#11A3FF,Stretched
7.087087087087087,0.5311449079919793,Har18,Harrison & Pearce (2018),harmonicity,#11A3FF,Stretched
7.102102102102102,0.528450139418251,Har18,Harrison & Pearce (2018),harmonicity,#11A3FF,Stretched
7.117117117117117,0.5251715766089297,Har18,Harrison & Pearce (2018),harmonicity,#11A3FF,Stretched
7.132132132132132,0.5214248241822941,Har18,Harrison & Pearce (2018),harmonicity,#11A3FF,Stretched
7.147147147147147,0.517345566603602,Har18,Harrison & Pearce (2018),harmonicity,#11A3FF,Stretched
7.162162162162162,0.5131106325212214,Har18,Harrison & Pearce (2018),harmonicity,#11A3FF,Stretched
7.177177177177177,0.5089421768058081,Har18,Harrison & Pearce (2018),harmonicity,#11A3FF,Stretched
7.192192192192192,0.5050667602311226,Har18,Harrison & Pearce (2018),harmonicity,#11A3FF,Stretched
7.207207207207207,0.5016470768981572,Har18,Harrison & Pearce (2018),harmonicity,#11A3FF,Stretched
7.222222222222222,0.4987510011351465,Har18,Harrison & Pearce (2018),harmonicity,#11A3FF,Stretched
7.237237237237237,0.4963863125128786,Har18,Harrison & Pearce (2018),harmonicity,#11A3FF,Stretched
7.252252252252252,0.49455607326618883,Har18,Harrison & Pearce (2018),harmonicity,#11A3FF,Stretched
7.267267267267267,0.49328025996476776,Har18,Harrison & Pearce (2018),harmonicity,#11A3FF,Stretched
7.282282282282282,0.49257178431833976,Har18,Harrison & Pearce (2018),harmonicity,#11A3FF,Stretched
7.297297297297297,0.49239308992575037,Har18,Harrison & Pearce (2018),harmonicity,#11A3FF,Stretched
7.312312312312312,0.49264472270207144,Har18,Harrison & Pearce (2018),harmonicity,#11A3FF,Stretched
7.327327327327327,0.4932217687888666,Har18,Harrison & Pearce (2018),harmonicity,#11A3FF,Stretched
7.342342342342342,0.49408787744510985,Har18,Harrison & Pearce (2018),harmonicity,#11A3FF,Stretched
7.357357357357357,0.49525681774046026,Har18,Harrison & Pearce (2018),harmonicity,#11A3FF,Stretched
7.372372372372372,0.49667264497003144,Har18,Harrison & Pearce (2018),harmonicity,#11A3FF,Stretched
7.387387387387387,0.4981372589909355,Har18,Harrison & Pearce (2018),harmonicity,#11A3FF,Stretched
7.402402402402402,0.49939841356490366,Har18,Harrison & Pearce (2018),harmonicity,#11A3FF,Stretched
7.4174174174174174,0.5003080238464661,Har18,Harrison & Pearce (2018),harmonicity,#11A3FF,Stretched
7.4324324324324325,0.5008657219731432,Har18,Harrison & Pearce (2018),harmonicity,#11A3FF,Stretched
7.4474474474474475,0.5010906733153234,Har18,Harrison & Pearce (2018),harmonicity,#11A3FF,Stretched
7.4624624624624625,0.5008651519289986,Har18,Harrison & Pearce (2018),harmonicity,#11A3FF,Stretched
7.4774774774774775,0.4999472207343781,Har18,Harrison & Pearce (2018),harmonicity,#11A3FF,Stretched
7.4924924924924925,0.4981861246476609,Har18,Harrison & Pearce (2018),harmonicity,#11A3FF,Stretched
7.5075075075075075,0.49573573658520725,Har18,Harrison & Pearce (2018),harmonicity,#11A3FF,Stretched
7.5225225225225225,0.4929928880872049,Har18,Harrison & Pearce (2018),harmonicity,#11A3FF,Stretched
7.5375375375375375,0.4902612088565642,Har18,Harrison & Pearce (2018),harmonicity,#11A3FF,Stretched
7.5525525525525525,0.4875111482084301,Har18,Harrison & Pearce (2018),harmonicity,#11A3FF,Stretched
7.5675675675675675,0.4845105710657278,Har18,Harrison & Pearce (2018),harmonicity,#11A3FF,Stretched
7.5825825825825826,0.4811243483658702,Har18,Harrison & Pearce (2018),harmonicity,#11A3FF,Stretched
7.597597597597598,0.47744805093245934,Har18,Harrison & Pearce (2018),harmonicity,#11A3FF,Stretched
7.612612612612613,0.473734478027968,Har18,Harrison & Pearce (2018),harmonicity,#11A3FF,Stretched
7.627627627627628,0.4702578092488197,Har18,Harrison & Pearce (2018),harmonicity,#11A3FF,Stretched
7.642642642642643,0.46721446738633654,Har18,Harrison & Pearce (2018),harmonicity,#11A3FF,Stretched
7.657657657657658,0.46469279525708396,Har18,Harrison & Pearce (2018),harmonicity,#11A3FF,Stretched
7.672672672672673,0.46270118131611165,Har18,Harrison & Pearce (2018),harmonicity,#11A3FF,Stretched
7.687687687687688,0.4612204822255845,Har18,Harrison & Pearce (2018),harmonicity,#11A3FF,Stretched
7.702702702702703,0.46025794966419525,Har18,Harrison & Pearce (2018),harmonicity,#11A3FF,Stretched
7.717717717717718,0.45987543218914956,Har18,Harrison & Pearce (2018),harmonicity,#11A3FF,Stretched
7.732732732732733,0.4601544534108764,Har18,Harrison & Pearce (2018),harmonicity,#11A3FF,Stretched
7.747747747747748,0.4611147063112935,Har18,Harrison & Pearce (2018),harmonicity,#11A3FF,Stretched
7.762762762762763,0.46266788577851137,Har18,Harrison & Pearce (2018),harmonicity,#11A3FF,Stretched
7.777777777777778,0.4646660824050064,Har18,Harrison & Pearce (2018),harmonicity,#11A3FF,Stretched
7.792792792792793,0.46700484261708947,Har18,Harrison & Pearce (2018),harmonicity,#11A3FF,Stretched
7.807807807807808,0.4696607481950176,Har18,Harrison & Pearce (2018),harmonicity,#11A3FF,Stretched
7.822822822822823,0.472590585959838,Har18,Harrison & Pearce (2018),harmonicity,#11A3FF,Stretched
7.837837837837838,0.4755985827202938,Har18,Harrison & Pearce (2018),harmonicity,#11A3FF,Stretched
7.852852852852853,0.4783761124758699,Har18,Harrison & Pearce (2018),harmonicity,#11A3FF,Stretched
7.867867867867868,0.48071876362815763,Har18,Harrison & Pearce (2018),harmonicity,#11A3FF,Stretched
7.882882882882883,0.4826551910855892,Har18,Harrison & Pearce (2018),harmonicity,#11A3FF,Stretched
7.897897897897898,0.48433815882677045,Har18,Harrison & Pearce (2018),harmonicity,#11A3FF,Stretched
7.912912912912913,0.4858880016477373,Har18,Harrison & Pearce (2018),harmonicity,#11A3FF,Stretched
7.927927927927928,0.4873710676706509,Har18,Harrison & Pearce (2018),harmonicity,#11A3FF,Stretched
7.942942942942943,0.4888344368276811,Har18,Harrison & Pearce (2018),harmonicity,#11A3FF,Stretched
7.957957957957958,0.4902928000421356,Har18,Harrison & Pearce (2018),harmonicity,#11A3FF,Stretched
7.972972972972973,0.4917157310340158,Har18,Harrison & Pearce (2018),harmonicity,#11A3FF,Stretched
7.987987987987988,0.4930741488485218,Har18,Harrison & Pearce (2018),harmonicity,#11A3FF,Stretched
8.003003003003004,0.49440497764596897,Har18,Harrison & Pearce (2018),harmonicity,#11A3FF,Stretched
8.018018018018019,0.49582239523100086,Har18,Harrison & Pearce (2018),harmonicity,#11A3FF,Stretched
8.033033033033034,0.4974563042674615,Har18,Harrison & Pearce (2018),harmonicity,#11A3FF,Stretched
8.048048048048049,0.4993656124727942,Har18,Harrison & Pearce (2018),harmonicity,#11A3FF,Stretched
8.063063063063064,0.501506308770279,Har18,Harrison & Pearce (2018),harmonicity,#11A3FF,Stretched
8.078078078078079,0.5037930146557015,Har18,Harrison & Pearce (2018),harmonicity,#11A3FF,Stretched
8.093093093093094,0.5062009694292318,Har18,Harrison & Pearce (2018),harmonicity,#11A3FF,Stretched
8.108108108108109,0.5088034701845073,Har18,Harrison & Pearce (2018),harmonicity,#11A3FF,Stretched
8.123123123123124,0.5116882950747339,Har18,Harrison & Pearce (2018),harmonicity,#11A3FF,Stretched
8.138138138138139,0.5148257013978048,Har18,Harrison & Pearce (2018),harmonicity,#11A3FF,Stretched
8.153153153153154,0.5180440691997763,Har18,Harrison & Pearce (2018),harmonicity,#11A3FF,Stretched
8.168168168168169,0.5211680891443944,Har18,Harrison & Pearce (2018),harmonicity,#11A3FF,Stretched
8.183183183183184,0.5241700628475208,Har18,Harrison & Pearce (2018),harmonicity,#11A3FF,Stretched
8.198198198198199,0.5271400185224402,Har18,Harrison & Pearce (2018),harmonicity,#11A3FF,Stretched
8.213213213213214,0.5300927517519616,Har18,Harrison & Pearce (2018),harmonicity,#11A3FF,Stretched
8.228228228228229,0.5328485122127303,Har18,Harrison & Pearce (2018),harmonicity,#11A3FF,Stretched
8.243243243243244,0.5351364076566322,Har18,Harrison & Pearce (2018),harmonicity,#11A3FF,Stretched
8.258258258258259,0.5367949047019854,Har18,Harrison & Pearce (2018),harmonicity,#11A3FF,Stretched
8.273273273273274,0.5378687130420785,Har18,Harrison & Pearce (2018),harmonicity,#11A3FF,Stretched
8.288288288288289,0.5385459825972683,Har18,Harrison & Pearce (2018),harmonicity,#11A3FF,Stretched
8.303303303303304,0.5389874164370152,Har18,Harrison & Pearce (2018),harmonicity,#11A3FF,Stretched
8.318318318318319,0.5391263644480366,Har18,Harrison & Pearce (2018),harmonicity,#11A3FF,Stretched
8.333333333333334,0.538584887736416,Har18,Harrison & Pearce (2018),harmonicity,#11A3FF,Stretched
8.348348348348349,0.5368836606728402,Har18,Harrison & Pearce (2018),harmonicity,#11A3FF,Stretched
8.363363363363364,0.5338637363546329,Har18,Harrison & Pearce (2018),harmonicity,#11A3FF,Stretched
8.378378378378379,0.5298748462748856,Har18,Harrison & Pearce (2018),harmonicity,#11A3FF,Stretched
8.393393393393394,0.5254862776470326,Har18,Harrison & Pearce (2018),harmonicity,#11A3FF,Stretched
8.408408408408409,0.521085472056711,Har18,Harrison & Pearce (2018),harmonicity,#11A3FF,Stretched
8.423423423423424,0.5167875231213854,Har18,Harrison & Pearce (2018),harmonicity,#11A3FF,Stretched
8.438438438438439,0.5125866387463183,Har18,Harrison & Pearce (2018),harmonicity,#11A3FF,Stretched
8.453453453453454,0.5084786660460717,Har18,Harrison & Pearce (2018),harmonicity,#11A3FF,Stretched
8.468468468468469,0.5044909745512877,Har18,Harrison & Pearce (2018),harmonicity,#11A3FF,Stretched
8.483483483483484,0.5006906223670651,Har18,Harrison & Pearce (2018),harmonicity,#11A3FF,Stretched
8.498498498498499,0.49717869994154223,Har18,Harrison & Pearce (2018),harmonicity,#11A3FF,Stretched
8.513513513513514,0.4940394155711092,Har18,Harrison & Pearce (2018),harmonicity,#11A3FF,Stretched
8.528528528528529,0.491283297880228,Har18,Harrison & Pearce (2018),harmonicity,#11A3FF,Stretched
8.543543543543544,0.4888558023567366,Har18,Harrison & Pearce (2018),harmonicity,#11A3FF,Stretched
8.558558558558559,0.48669873041053013,Har18,Harrison & Pearce (2018),harmonicity,#11A3FF,Stretched
8.573573573573574,0.48479126877221906,Har18,Harrison & Pearce (2018),harmonicity,#11A3FF,Stretched
8.588588588588589,0.4831429649085138,Har18,Harrison & Pearce (2018),harmonicity,#11A3FF,Stretched
8.603603603603604,0.48176838860397514,Har18,Harrison & Pearce (2018),harmonicity,#11A3FF,Stretched
8.618618618618619,0.48067442106398506,Har18,Harrison & Pearce (2018),harmonicity,#11A3FF,Stretched
8.633633633633634,0.479861254313331,Har18,Harrison & Pearce (2018),harmonicity,#11A3FF,Stretched
8.64864864864865,0.47930645141872896,Har18,Harrison & Pearce (2018),harmonicity,#11A3FF,Stretched
8.663663663663664,0.4789022284896731,Har18,Harrison & Pearce (2018),harmonicity,#11A3FF,Stretched
8.67867867867868,0.47839642293838697,Har18,Harrison & Pearce (2018),harmonicity,#11A3FF,Stretched
8.693693693693694,0.4774671811485523,Har18,Harrison & Pearce (2018),harmonicity,#11A3FF,Stretched
8.70870870870871,0.47593785469158806,Har18,Harrison & Pearce (2018),harmonicity,#11A3FF,Stretched
8.723723723723724,0.47390754945203584,Har18,Harrison & Pearce (2018),harmonicity,#11A3FF,Stretched
8.73873873873874,0.471642196572712,Har18,Harrison & Pearce (2018),harmonicity,#11A3FF,Stretched
8.753753753753754,0.4693824848860037,Har18,Harrison & Pearce (2018),harmonicity,#11A3FF,Stretched
8.76876876876877,0.4672675319308649,Har18,Harrison & Pearce (2018),harmonicity,#11A3FF,Stretched
8.783783783783784,0.46534836664603246,Har18,Harrison & Pearce (2018),harmonicity,#11A3FF,Stretched
8.7987987987988,0.4635971579594042,Har18,Harrison & Pearce (2018),harmonicity,#11A3FF,Stretched
8.813813813813814,0.46192755155773135,Har18,Harrison & Pearce (2018),harmonicity,#11A3FF,Stretched
8.82882882882883,0.4602629057386034,Har18,Harrison & Pearce (2018),harmonicity,#11A3FF,Stretched
8.843843843843844,0.4586049344007908,Har18,Harrison & Pearce (2018),harmonicity,#11A3FF,Stretched
8.85885885885886,0.45703001259211806,Har18,Harrison & Pearce (2018),harmonicity,#11A3FF,Stretched
8.873873873873874,0.4556127287583424,Har18,Harrison & Pearce (2018),harmonicity,#11A3FF,Stretched
8.88888888888889,0.4543523961212817,Har18,Harrison & Pearce (2018),harmonicity,#11A3FF,Stretched
8.903903903903904,0.45317731394104516,Har18,Harrison & Pearce (2018),harmonicity,#11A3FF,Stretched
8.91891891891892,0.4520201851267282,Har18,Harrison & Pearce (2018),harmonicity,#11A3FF,Stretched
8.933933933933934,0.4508815114555343,Har18,Harrison & Pearce (2018),harmonicity,#11A3FF,Stretched
8.94894894894895,0.4498142511312863,Har18,Harrison & Pearce (2018),harmonicity,#11A3FF,Stretched
8.963963963963964,0.4488513642047267,Har18,Harrison & Pearce (2018),harmonicity,#11A3FF,Stretched
8.97897897897898,0.4479587447999452,Har18,Harrison & Pearce (2018),harmonicity,#11A3FF,Stretched
8.993993993993994,0.44706192226474284,Har18,Harrison & Pearce (2018),harmonicity,#11A3FF,Stretched
9.00900900900901,0.4461126137334697,Har18,Harrison & Pearce (2018),harmonicity,#11A3FF,Stretched
9.024024024024024,0.4451295818590398,Har18,Harrison & Pearce (2018),harmonicity,#11A3FF,Stretched
9.03903903903904,0.4441713228534388,Har18,Harrison & Pearce (2018),harmonicity,#11A3FF,Stretched
9.054054054054054,0.4432428505666153,Har18,Harrison & Pearce (2018),harmonicity,#11A3FF,Stretched
9.06906906906907,0.4422164075297857,Har18,Harrison & Pearce (2018),harmonicity,#11A3FF,Stretched
9.084084084084084,0.44089592383366294,Har18,Harrison & Pearce (2018),harmonicity,#11A3FF,Stretched
9.0990990990991,0.4392502458196054,Har18,Harrison & Pearce (2018),harmonicity,#11A3FF,Stretched
9.114114114114114,0.4375772919096843,Har18,Harrison & Pearce (2018),harmonicity,#11A3FF,Stretched
9.12912912912913,0.4362708238639944,Har18,Harrison & Pearce (2018),harmonicity,#11A3FF,Stretched
9.144144144144144,0.4353705383536961,Har18,Harrison & Pearce (2018),harmonicity,#11A3FF,Stretched
9.15915915915916,0.43464001998236773,Har18,Harrison & Pearce (2018),harmonicity,#11A3FF,Stretched
9.174174174174174,0.43427385163772053,Har18,Harrison & Pearce (2018),harmonicity,#11A3FF,Stretched
9.18918918918919,0.43511753656921026,Har18,Harrison & Pearce (2018),harmonicity,#11A3FF,Stretched
9.204204204204204,0.4377848564693142,Har18,Harrison & Pearce (2018),harmonicity,#11A3FF,Stretched
9.21921921921922,0.4418401046651654,Har18,Harrison & Pearce (2018),harmonicity,#11A3FF,Stretched
9.234234234234235,0.44621850430094095,Har18,Harrison & Pearce (2018),harmonicity,#11A3FF,Stretched
9.24924924924925,0.4502352962740043,Har18,Harrison & Pearce (2018),harmonicity,#11A3FF,Stretched
9.264264264264265,0.4539296646052175,Har18,Harrison & Pearce (2018),harmonicity,#11A3FF,Stretched
9.27927927927928,0.45766498463048527,Har18,Harrison & Pearce (2018),harmonicity,#11A3FF,Stretched
9.294294294294295,0.46169597570903403,Har18,Harrison & Pearce (2018),harmonicity,#11A3FF,Stretched
9.30930930930931,0.4660671657831259,Har18,Harrison & Pearce (2018),harmonicity,#11A3FF,Stretched
9.324324324324325,0.47071735607673626,Har18,Harrison & Pearce (2018),harmonicity,#11A3FF,Stretched
9.33933933933934,0.4755829058609196,Har18,Harrison & Pearce (2018),harmonicity,#11A3FF,Stretched
9.354354354354355,0.4806178018126366,Har18,Harrison & Pearce (2018),harmonicity,#11A3FF,Stretched
9.36936936936937,0.4857589268578865,Har18,Harrison & Pearce (2018),harmonicity,#11A3FF,Stretched
9.384384384384385,0.49089815808835063,Har18,Harrison & Pearce (2018),harmonicity,#11A3FF,Stretched
9.3993993993994,0.4958909197289683,Har18,Harrison & Pearce (2018),harmonicity,#11A3FF,Stretched
9.414414414414415,0.5005864401225885,Har18,Harrison & Pearce (2018),harmonicity,#11A3FF,Stretched
9.42942942942943,0.5048508838458031,Har18,Harrison & Pearce (2018),harmonicity,#11A3FF,Stretched
9.444444444444445,0.5085690553947516,Har18,Harrison & Pearce (2018),harmonicity,#11A3FF,Stretched
9.45945945945946,0.5116322596687954,Har18,Harrison & Pearce (2018),harmonicity,#11A3FF,Stretched
9.474474474474475,0.5139356832018813,Har18,Harrison & Pearce (2018),harmonicity,#11A3FF,Stretched
9.48948948948949,0.515402395141471,Har18,Harrison & Pearce (2018),harmonicity,#11A3FF,Stretched
9.504504504504505,0.516019397084987,Har18,Harrison & Pearce (2018),harmonicity,#11A3FF,Stretched
9.51951951951952,0.5158474901142874,Har18,Harrison & Pearce (2018),harmonicity,#11A3FF,Stretched
9.534534534534535,0.5149818902915672,Har18,Harrison & Pearce (2018),harmonicity,#11A3FF,Stretched
9.54954954954955,0.5134898281605571,Har18,Harrison & Pearce (2018),harmonicity,#11A3FF,Stretched
9.564564564564565,0.5113871853629625,Har18,Harrison & Pearce (2018),harmonicity,#11A3FF,Stretched
9.57957957957958,0.5086780066249148,Har18,Harrison & Pearce (2018),harmonicity,#11A3FF,Stretched
9.594594594594595,0.5054078701707517,Har18,Harrison & Pearce (2018),harmonicity,#11A3FF,Stretched
9.60960960960961,0.5016740681569533,Har18,Harrison & Pearce (2018),harmonicity,#11A3FF,Stretched
9.624624624624625,0.49758448739161276,Har18,Harrison & Pearce (2018),harmonicity,#11A3FF,Stretched
9.63963963963964,0.493206097334165,Har18,Harrison & Pearce (2018),harmonicity,#11A3FF,Stretched
9.654654654654655,0.4885643855350626,Har18,Harrison & Pearce (2018),harmonicity,#11A3FF,Stretched
9.66966966966967,0.4837025126706032,Har18,Harrison & Pearce (2018),harmonicity,#11A3FF,Stretched
9.684684684684685,0.4787251006422202,Har18,Harrison & Pearce (2018),harmonicity,#11A3FF,Stretched
9.6996996996997,0.4737627060557782,Har18,Harrison & Pearce (2018),harmonicity,#11A3FF,Stretched
9.714714714714715,0.468893366561464,Har18,Harrison & Pearce (2018),harmonicity,#11A3FF,Stretched
9.72972972972973,0.46411391754538,Har18,Harrison & Pearce (2018),harmonicity,#11A3FF,Stretched
9.744744744744745,0.4593952536562649,Har18,Harrison & Pearce (2018),harmonicity,#11A3FF,Stretched
9.75975975975976,0.4547476697126921,Har18,Harrison & Pearce (2018),harmonicity,#11A3FF,Stretched
9.774774774774775,0.450196739848543,Har18,Harrison & Pearce (2018),harmonicity,#11A3FF,Stretched
9.78978978978979,0.44568781615611724,Har18,Harrison & Pearce (2018),harmonicity,#11A3FF,Stretched
9.804804804804805,0.4410766500366778,Har18,Harrison & Pearce (2018),harmonicity,#11A3FF,Stretched
9.81981981981982,0.4362847455243912,Har18,Harrison & Pearce (2018),harmonicity,#11A3FF,Stretched
9.834834834834835,0.43143721721380074,Har18,Harrison & Pearce (2018),harmonicity,#11A3FF,Stretched
9.84984984984985,0.42678123106766624,Har18,Harrison & Pearce (2018),harmonicity,#11A3FF,Stretched
9.864864864864865,0.4224859367639857,Har18,Harrison & Pearce (2018),harmonicity,#11A3FF,Stretched
9.87987987987988,0.4185644307813248,Har18,Harrison & Pearce (2018),harmonicity,#11A3FF,Stretched
9.894894894894895,0.4149590722340748,Har18,Harrison & Pearce (2018),harmonicity,#11A3FF,Stretched
9.90990990990991,0.4116522723065458,Har18,Harrison & Pearce (2018),harmonicity,#11A3FF,Stretched
9.924924924924925,0.4087010186329053,Har18,Harrison & Pearce (2018),harmonicity,#11A3FF,Stretched
9.93993993993994,0.40619962893928574,Har18,Harrison & Pearce (2018),harmonicity,#11A3FF,Stretched
9.954954954954955,0.4042228894091238,Har18,Harrison & Pearce (2018),harmonicity,#11A3FF,Stretched
9.96996996996997,0.4027982036755443,Har18,Harrison & Pearce (2018),harmonicity,#11A3FF,Stretched
9.984984984984985,0.4019305617198517,Har18,Harrison & Pearce (2018),harmonicity,#11A3FF,Stretched
10,0.40165958137532165,Har18,Harrison & Pearce (2018),harmonicity,#11A3FF,Stretched
10.015015015015015,0.40208903161387494,Har18,Harrison & Pearce (2018),harmonicity,#11A3FF,Stretched
10.03003003003003,0.40334713485806406,Har18,Harrison & Pearce (2018),harmonicity,#11A3FF,Stretched
10.045045045045045,0.40550560720735784,Har18,Harrison & Pearce (2018),harmonicity,#11A3FF,Stretched
10.06006006006006,0.40853643567279685,Har18,Harrison & Pearce (2018),harmonicity,#11A3FF,Stretched
10.075075075075075,0.412354048244348,Har18,Harrison & Pearce (2018),harmonicity,#11A3FF,Stretched
10.09009009009009,0.41689650401193257,Har18,Harrison & Pearce (2018),harmonicity,#11A3FF,Stretched
10.105105105105105,0.42215588560129635,Har18,Harrison & Pearce (2018),harmonicity,#11A3FF,Stretched
10.12012012012012,0.4281324053572731,Har18,Harrison & Pearce (2018),harmonicity,#11A3FF,Stretched
10.135135135135135,0.43476922380510274,Har18,Harrison & Pearce (2018),harmonicity,#11A3FF,Stretched
10.15015015015015,0.4419344521704852,Har18,Harrison & Pearce (2018),harmonicity,#11A3FF,Stretched
10.165165165165165,0.44946177707927465,Har18,Harrison & Pearce (2018),harmonicity,#11A3FF,Stretched
10.18018018018018,0.45720092017918407,Har18,Harrison & Pearce (2018),harmonicity,#11A3FF,Stretched
10.195195195195195,0.46502235195596314,Har18,Harrison & Pearce (2018),harmonicity,#11A3FF,Stretched
10.21021021021021,0.4727772831628404,Har18,Harrison & Pearce (2018),harmonicity,#11A3FF,Stretched
10.225225225225225,0.48027032913719414,Har18,Harrison & Pearce (2018),harmonicity,#11A3FF,Stretched
10.24024024024024,0.48728476592265396,Har18,Harrison & Pearce (2018),harmonicity,#11A3FF,Stretched
10.255255255255255,0.4936311667897672,Har18,Harrison & Pearce (2018),harmonicity,#11A3FF,Stretched
10.27027027027027,0.4991674813142036,Har18,Harrison & Pearce (2018),harmonicity,#11A3FF,Stretched
10.285285285285285,0.503783521375567,Har18,Harrison & Pearce (2018),harmonicity,#11A3FF,Stretched
10.3003003003003,0.5073800197730278,Har18,Harrison & Pearce (2018),harmonicity,#11A3FF,Stretched
10.315315315315315,0.5098654611920128,Har18,Harrison & Pearce (2018),harmonicity,#11A3FF,Stretched
10.33033033033033,0.5111719028467493,Har18,Harrison & Pearce (2018),harmonicity,#11A3FF,Stretched
10.345345345345345,0.5112741264086844,Har18,Harrison & Pearce (2018),harmonicity,#11A3FF,Stretched
10.36036036036036,0.5101926565780265,Har18,Harrison & Pearce (2018),harmonicity,#11A3FF,Stretched
10.375375375375375,0.5079804149191561,Har18,Harrison & Pearce (2018),harmonicity,#11A3FF,Stretched
10.39039039039039,0.5047125362085118,Har18,Harrison & Pearce (2018),harmonicity,#11A3FF,Stretched
10.405405405405405,0.5004866060344981,Har18,Harrison & Pearce (2018),harmonicity,#11A3FF,Stretched
10.42042042042042,0.49542091752709516,Har18,Harrison & Pearce (2018),harmonicity,#11A3FF,Stretched
10.435435435435435,0.4896514243796638,Har18,Harrison & Pearce (2018),harmonicity,#11A3FF,Stretched
10.45045045045045,0.48333996715324995,Har18,Harrison & Pearce (2018),harmonicity,#11A3FF,Stretched
10.465465465465465,0.47667908682260535,Har18,Harrison & Pearce (2018),harmonicity,#11A3FF,Stretched
10.48048048048048,0.46986852337395707,Har18,Harrison & Pearce (2018),harmonicity,#11A3FF,Stretched
10.495495495495495,0.46307963507662225,Har18,Harrison & Pearce (2018),harmonicity,#11A3FF,Stretched
10.51051051051051,0.45644480331182047,Har18,Harrison & Pearce (2018),harmonicity,#11A3FF,Stretched
10.525525525525525,0.450076552027053,Har18,Harrison & Pearce (2018),harmonicity,#11A3FF,Stretched
10.54054054054054,0.4440909542925537,Har18,Harrison & Pearce (2018),harmonicity,#11A3FF,Stretched
10.555555555555555,0.4386055499527831,Har18,Harrison & Pearce (2018),harmonicity,#11A3FF,Stretched
10.57057057057057,0.43369354646629277,Har18,Harrison & Pearce (2018),harmonicity,#11A3FF,Stretched
10.585585585585585,0.4293230361228411,Har18,Harrison & Pearce (2018),harmonicity,#11A3FF,Stretched
10.6006006006006,0.42536231303060645,Har18,Harrison & Pearce (2018),harmonicity,#11A3FF,Stretched
10.615615615615615,0.4216811326435063,Har18,Harrison & Pearce (2018),harmonicity,#11A3FF,Stretched
10.63063063063063,0.41825038288249355,Har18,Harrison & Pearce (2018),harmonicity,#11A3FF,Stretched
10.645645645645645,0.41513996048506396,Har18,Harrison & Pearce (2018),harmonicity,#11A3FF,Stretched
10.66066066066066,0.41244889937685064,Har18,Harrison & Pearce (2018),harmonicity,#11A3FF,Stretched
10.675675675675675,0.4102523220980191,Har18,Harrison & Pearce (2018),harmonicity,#11A3FF,Stretched
10.69069069069069,0.40858036079399634,Har18,Harrison & Pearce (2018),harmonicity,#11A3FF,Stretched
10.705705705705705,0.4074156989252139,Har18,Harrison & Pearce (2018),harmonicity,#11A3FF,Stretched
10.72072072072072,0.40671746802871994,Har18,Harrison & Pearce (2018),harmonicity,#11A3FF,Stretched
10.735735735735735,0.40645655669207686,Har18,Harrison & Pearce (2018),harmonicity,#11A3FF,Stretched
10.75075075075075,0.40662509694957366,Har18,Harrison & Pearce (2018),harmonicity,#11A3FF,Stretched
10.765765765765765,0.40722666705027766,Har18,Harrison & Pearce (2018),harmonicity,#11A3FF,Stretched
10.78078078078078,0.4082855668025277,Har18,Harrison & Pearce (2018),harmonicity,#11A3FF,Stretched
10.795795795795796,0.40987068167838575,Har18,Harrison & Pearce (2018),harmonicity,#11A3FF,Stretched
10.81081081081081,0.4120916508163438,Har18,Harrison & Pearce (2018),harmonicity,#11A3FF,Stretched
10.825825825825826,0.41505911685377395,Har18,Harrison & Pearce (2018),harmonicity,#11A3FF,Stretched
10.84084084084084,0.41885302234908933,Har18,Harrison & Pearce (2018),harmonicity,#11A3FF,Stretched
10.855855855855856,0.4235366859286637,Har18,Harrison & Pearce (2018),harmonicity,#11A3FF,Stretched
10.87087087087087,0.42919598392254565,Har18,Harrison & Pearce (2018),harmonicity,#11A3FF,Stretched
10.885885885885886,0.43594784716936,Har18,Harrison & Pearce (2018),harmonicity,#11A3FF,Stretched
10.9009009009009,0.44389753792722303,Har18,Harrison & Pearce (2018),harmonicity,#11A3FF,Stretched
10.915915915915916,0.45308399364213847,Har18,Harrison & Pearce (2018),harmonicity,#11A3FF,Stretched
10.93093093093093,0.4634614127567343,Har18,Harrison & Pearce (2018),harmonicity,#11A3FF,Stretched
10.945945945945946,0.4749231366957209,Har18,Harrison & Pearce (2018),harmonicity,#11A3FF,Stretched
10.96096096096096,0.48733469018612774,Har18,Harrison & Pearce (2018),harmonicity,#11A3FF,Stretched
10.975975975975976,0.5005407694081739,Har18,Harrison & Pearce (2018),harmonicity,#11A3FF,Stretched
10.99099099099099,0.514347592950994,Har18,Harrison & Pearce (2018),harmonicity,#11A3FF,Stretched
11.006006006006006,0.5285128046611011,Har18,Harrison & Pearce (2018),harmonicity,#11A3FF,Stretched
11.02102102102102,0.5427570916439257,Har18,Harrison & Pearce (2018),harmonicity,#11A3FF,Stretched
11.036036036036036,0.5567806614032759,Har18,Harrison & Pearce (2018),harmonicity,#11A3FF,Stretched
11.05105105105105,0.5702723991368024,Har18,Harrison & Pearce (2018),harmonicity,#11A3FF,Stretched
11.066066066066066,0.5829224608497987,Har18,Harrison & Pearce (2018),harmonicity,#11A3FF,Stretched
11.08108108108108,0.594453436586333,Har18,Harrison & Pearce (2018),harmonicity,#11A3FF,Stretched
11.096096096096096,0.6046725802976144,Har18,Harrison & Pearce (2018),harmonicity,#11A3FF,Stretched
11.11111111111111,0.6135163550290159,Har18,Harrison & Pearce (2018),harmonicity,#11A3FF,Stretched
11.126126126126126,0.6209768578771488,Har18,Harrison & Pearce (2018),harmonicity,#11A3FF,Stretched
11.14114114114114,0.6267984722523018,Har18,Harrison & Pearce (2018),harmonicity,#11A3FF,Stretched
11.156156156156156,0.6301755250778546,Har18,Harrison & Pearce (2018),harmonicity,#11A3FF,Stretched
11.17117117117117,0.6300254288572871,Har18,Harrison & Pearce (2018),harmonicity,#11A3FF,Stretched
11.186186186186186,0.625865175322439,Har18,Harrison & Pearce (2018),harmonicity,#11A3FF,Stretched
11.2012012012012,0.6183141517722359,Har18,Harrison & Pearce (2018),harmonicity,#11A3FF,Stretched
11.216216216216216,0.6085413313448207,Har18,Harrison & Pearce (2018),harmonicity,#11A3FF,Stretched
11.23123123123123,0.5973689114242665,Har18,Harrison & Pearce (2018),harmonicity,#11A3FF,Stretched
11.246246246246246,0.5850305506083904,Har18,Harrison & Pearce (2018),harmonicity,#11A3FF,Stretched
11.26126126126126,0.5715353310190106,Har18,Harrison & Pearce (2018),harmonicity,#11A3FF,Stretched
11.276276276276276,0.5570077911992656,Har18,Harrison & Pearce (2018),harmonicity,#11A3FF,Stretched
11.29129129129129,0.5417416083850298,Har18,Harrison & Pearce (2018),harmonicity,#11A3FF,Stretched
11.306306306306306,0.5260941112538214,Har18,Harrison & Pearce (2018),harmonicity,#11A3FF,Stretched
11.32132132132132,0.5103767489451274,Har18,Harrison & Pearce (2018),harmonicity,#11A3FF,Stretched
11.336336336336336,0.4948223105081659,Har18,Harrison & Pearce (2018),harmonicity,#11A3FF,Stretched
11.35135135135135,0.4796370746899903,Har18,Harrison & Pearce (2018),harmonicity,#11A3FF,Stretched
11.366366366366366,0.465061315600801,Har18,Harrison & Pearce (2018),harmonicity,#11A3FF,Stretched
11.381381381381381,0.4513623951444008,Har18,Harrison & Pearce (2018),harmonicity,#11A3FF,Stretched
11.396396396396396,0.4387723129255556,Har18,Harrison & Pearce (2018),harmonicity,#11A3FF,Stretched
11.411411411411411,0.4274213241658975,Har18,Harrison & Pearce (2018),harmonicity,#11A3FF,Stretched
11.426426426426426,0.4173034022183565,Har18,Harrison & Pearce (2018),harmonicity,#11A3FF,Stretched
11.441441441441441,0.40831471829628974,Har18,Harrison & Pearce (2018),harmonicity,#11A3FF,Stretched
11.456456456456456,0.400371776346798,Har18,Harrison & Pearce (2018),harmonicity,#11A3FF,Stretched
11.471471471471471,0.39350890283273204,Har18,Harrison & Pearce (2018),harmonicity,#11A3FF,Stretched
11.486486486486486,0.38785074623359683,Har18,Harrison & Pearce (2018),harmonicity,#11A3FF,Stretched
11.501501501501501,0.38350742269189303,Har18,Harrison & Pearce (2018),harmonicity,#11A3FF,Stretched
11.516516516516516,0.38051781699933823,Har18,Harrison & Pearce (2018),harmonicity,#11A3FF,Stretched
11.531531531531531,0.37887088947633596,Har18,Harrison & Pearce (2018),harmonicity,#11A3FF,Stretched
11.546546546546546,0.37854316279878514,Har18,Harrison & Pearce (2018),harmonicity,#11A3FF,Stretched
11.561561561561561,0.3795126405439584,Har18,Harrison & Pearce (2018),harmonicity,#11A3FF,Stretched
11.576576576576576,0.3817618790813716,Har18,Harrison & Pearce (2018),harmonicity,#11A3FF,Stretched
11.591591591591591,0.3852868004595416,Har18,Harrison & Pearce (2018),harmonicity,#11A3FF,Stretched
11.606606606606606,0.3901058825386913,Har18,Harrison & Pearce (2018),harmonicity,#11A3FF,Stretched
11.621621621621621,0.396259525058074,Har18,Harrison & Pearce (2018),harmonicity,#11A3FF,Stretched
11.636636636636636,0.403799905585398,Har18,Harrison & Pearce (2018),harmonicity,#11A3FF,Stretched
11.651651651651651,0.41277760922027357,Har18,Harrison & Pearce (2018),harmonicity,#11A3FF,Stretched
11.666666666666666,0.4232312587932076,Har18,Harrison & Pearce (2018),harmonicity,#11A3FF,Stretched
11.681681681681681,0.43518884363039745,Har18,Harrison & Pearce (2018),harmonicity,#11A3FF,Stretched
11.696696696696696,0.44868981331733354,Har18,Harrison & Pearce (2018),harmonicity,#11A3FF,Stretched
11.711711711711711,0.4638141352202275,Har18,Harrison & Pearce (2018),harmonicity,#11A3FF,Stretched
11.726726726726726,0.4806708468021432,Har18,Harrison & Pearce (2018),harmonicity,#11A3FF,Stretched
11.741741741741741,0.4993260746429515,Har18,Harrison & Pearce (2018),harmonicity,#11A3FF,Stretched
11.756756756756756,0.5197362647198602,Har18,Harrison & Pearce (2018),harmonicity,#11A3FF,Stretched
11.771771771771771,0.5417599896996113,Har18,Harrison & Pearce (2018),harmonicity,#11A3FF,Stretched
11.786786786786786,0.5652182950558363,Har18,Harrison & Pearce (2018),harmonicity,#11A3FF,Stretched
11.801801801801801,0.5899200527765247,Har18,Harrison & Pearce (2018),harmonicity,#11A3FF,Stretched
11.816816816816816,0.6156375263712336,Har18,Harrison & Pearce (2018),harmonicity,#11A3FF,Stretched
11.831831831831831,0.642078547470396,Har18,Harrison & Pearce (2018),harmonicity,#11A3FF,Stretched
11.846846846846846,0.6688726854846172,Har18,Harrison & Pearce (2018),harmonicity,#11A3FF,Stretched
11.861861861861861,0.6955599782213865,Har18,Harrison & Pearce (2018),harmonicity,#11A3FF,Stretched
11.876876876876876,0.721604830361738,Har18,Harrison & Pearce (2018),harmonicity,#11A3FF,Stretched
11.891891891891891,0.7464725196524739,Har18,Harrison & Pearce (2018),harmonicity,#11A3FF,Stretched
11.906906906906906,0.7697473666004101,Har18,Harrison & Pearce (2018),harmonicity,#11A3FF,Stretched
11.921921921921921,0.7912020220862299,Har18,Harrison & Pearce (2018),harmonicity,#11A3FF,Stretched
11.936936936936936,0.8107020153255833,Har18,Harrison & Pearce (2018),harmonicity,#11A3FF,Stretched
11.951951951951951,0.8278920189286528,Har18,Harrison & Pearce (2018),harmonicity,#11A3FF,Stretched
11.966966966966966,0.8418437308945435,Har18,Harrison & Pearce (2018),harmonicity,#11A3FF,Stretched
11.981981981981981,0.8510882160625115,Har18,Harrison & Pearce (2018),harmonicity,#11A3FF,Stretched
11.996996996996996,0.8542352563363953,Har18,Harrison & Pearce (2018),harmonicity,#11A3FF,Stretched
12.012012012012011,0.8507697066999166,Har18,Harrison & Pearce (2018),harmonicity,#11A3FF,Stretched
12.027027027027026,0.8413750519265643,Har18,Harrison & Pearce (2018),harmonicity,#11A3FF,Stretched
12.042042042042041,0.8275094247922105,Har18,Harrison & Pearce (2018),harmonicity,#11A3FF,Stretched
12.057057057057056,0.8105524926060962,Har18,Harrison & Pearce (2018),harmonicity,#11A3FF,Stretched
12.072072072072071,0.7912283805994544,Har18,Harrison & Pearce (2018),harmonicity,#11A3FF,Stretched
12.087087087087086,0.7697298813329582,Har18,Harrison & Pearce (2018),harmonicity,#11A3FF,Stretched
12.102102102102101,0.7462222677936602,Har18,Harrison & Pearce (2018),harmonicity,#11A3FF,Stretched
12.117117117117116,0.721132736197106,Har18,Harrison & Pearce (2018),harmonicity,#11A3FF,Stretched
12.132132132132131,0.6950588401467946,Har18,Harrison & Pearce (2018),harmonicity,#11A3FF,Stretched
12.147147147147146,0.6685514499573373,Har18,Harrison & Pearce (2018),harmonicity,#11A3FF,Stretched
12.162162162162161,0.6420210411880372,Har18,Harrison & Pearce (2018),harmonicity,#11A3FF,Stretched
12.177177177177176,0.6157956643366465,Har18,Harrison & Pearce (2018),harmonicity,#11A3FF,Stretched
12.192192192192191,0.5902137614546406,Har18,Harrison & Pearce (2018),harmonicity,#11A3FF,Stretched
12.207207207207206,0.5656410777670925,Har18,Harrison & Pearce (2018),harmonicity,#11A3FF,Stretched
12.222222222222221,0.5424088870870781,Har18,Harrison & Pearce (2018),harmonicity,#11A3FF,Stretched
12.237237237237236,0.5207527965914954,Har18,Harrison & Pearce (2018),harmonicity,#11A3FF,Stretched
12.252252252252251,0.5007974940591867,Har18,Harrison & Pearce (2018),harmonicity,#11A3FF,Stretched
12.267267267267266,0.48256688724314134,Har18,Harrison & Pearce (2018),harmonicity,#11A3FF,Stretched
12.282282282282281,0.4660071566124194,Har18,Harrison & Pearce (2018),harmonicity,#11A3FF,Stretched
12.297297297297296,0.45103654940406335,Har18,Harrison & Pearce (2018),harmonicity,#11A3FF,Stretched
12.312312312312311,0.43760048133242946,Har18,Harrison & Pearce (2018),harmonicity,#11A3FF,Stretched
12.327327327327327,0.4256812268072486,Har18,Harrison & Pearce (2018),harmonicity,#11A3FF,Stretched
12.342342342342342,0.41526496533400553,Har18,Harrison & Pearce (2018),harmonicity,#11A3FF,Stretched
12.357357357357357,0.4063209683053018,Har18,Harrison & Pearce (2018),harmonicity,#11A3FF,Stretched
12.372372372372372,0.39880968666991884,Har18,Harrison & Pearce (2018),harmonicity,#11A3FF,Stretched
12.387387387387387,0.3926883522110852,Har18,Harrison & Pearce (2018),harmonicity,#11A3FF,Stretched
12.402402402402402,0.38790451640777834,Har18,Harrison & Pearce (2018),harmonicity,#11A3FF,Stretched
12.417417417417417,0.3843993695831319,Har18,Harrison & Pearce (2018),harmonicity,#11A3FF,Stretched
12.432432432432432,0.38212950006478424,Har18,Harrison & Pearce (2018),harmonicity,#11A3FF,Stretched
12.447447447447447,0.38108766283881257,Har18,Harrison & Pearce (2018),harmonicity,#11A3FF,Stretched
12.462462462462462,0.3812964041087242,Har18,Harrison & Pearce (2018),harmonicity,#11A3FF,Stretched
12.477477477477477,0.3827741384928699,Har18,Harrison & Pearce (2018),harmonicity,#11A3FF,Stretched
12.492492492492492,0.38550506303673293,Har18,Harrison & Pearce (2018),harmonicity,#11A3FF,Stretched
12.507507507507507,0.3894394341888317,Har18,Harrison & Pearce (2018),harmonicity,#11A3FF,Stretched
12.522522522522522,0.3945235476812818,Har18,Harrison & Pearce (2018),harmonicity,#11A3FF,Stretched
12.537537537537537,0.40075050619822694,Har18,Harrison & Pearce (2018),harmonicity,#11A3FF,Stretched
12.552552552552552,0.40820744579049745,Har18,Harrison & Pearce (2018),harmonicity,#11A3FF,Stretched
12.567567567567567,0.41705230389772224,Har18,Harrison & Pearce (2018),harmonicity,#11A3FF,Stretched
12.582582582582582,0.4273876217056644,Har18,Harrison & Pearce (2018),harmonicity,#11A3FF,Stretched
12.597597597597597,0.43914112023095936,Har18,Harrison & Pearce (2018),harmonicity,#11A3FF,Stretched
12.612612612612612,0.45208977278361084,Har18,Harrison & Pearce (2018),harmonicity,#11A3FF,Stretched
12.627627627627627,0.46598252037923277,Har18,Harrison & Pearce (2018),harmonicity,#11A3FF,Stretched
12.642642642642642,0.4806101645204405,Har18,Harrison & Pearce (2018),harmonicity,#11A3FF,Stretched
12.657657657657657,0.49578680815233994,Har18,Harrison & Pearce (2018),harmonicity,#11A3FF,Stretched
12.672672672672672,0.5113134574017815,Har18,Harrison & Pearce (2018),harmonicity,#11A3FF,Stretched
12.687687687687687,0.526960392719629,Har18,Harrison & Pearce (2018),harmonicity,#11A3FF,Stretched
12.702702702702702,0.5424578408096477,Har18,Harrison & Pearce (2018),harmonicity,#11A3FF,Stretched
12.717717717717717,0.5574901653368314,Har18,Harrison & Pearce (2018),harmonicity,#11A3FF,Stretched
12.732732732732732,0.5717026063311794,Har18,Harrison & Pearce (2018),harmonicity,#11A3FF,Stretched
12.747747747747747,0.5847321898894344,Har18,Harrison & Pearce (2018),harmonicity,#11A3FF,Stretched
12.762762762762762,0.5962557714170336,Har18,Harrison & Pearce (2018),harmonicity,#11A3FF,Stretched
12.777777777777777,0.6060162416203585,Har18,Harrison & Pearce (2018),harmonicity,#11A3FF,Stretched
12.792792792792792,0.6137988398535238,Har18,Harrison & Pearce (2018),harmonicity,#11A3FF,Stretched
12.807807807807807,0.6193877717852377,Har18,Harrison & Pearce (2018),harmonicity,#11A3FF,Stretched
12.822822822822824,0.622564872381688,Har18,Harrison & Pearce (2018),harmonicity,#11A3FF,Stretched
12.837837837837839,0.6231752118655524,Har18,Harrison & Pearce (2018),harmonicity,#11A3FF,Stretched
12.852852852852854,0.6212095065777462,Har18,Harrison & Pearce (2018),harmonicity,#11A3FF,Stretched
12.867867867867869,0.6168190821910369,Har18,Harrison & Pearce (2018),harmonicity,#11A3FF,Stretched
12.882882882882884,0.6102429969153027,Har18,Harrison & Pearce (2018),harmonicity,#11A3FF,Stretched
12.897897897897899,0.6017190380012327,Har18,Harrison & Pearce (2018),harmonicity,#11A3FF,Stretched
12.912912912912914,0.5914581313292104,Har18,Harrison & Pearce (2018),harmonicity,#11A3FF,Stretched
12.927927927927929,0.579691066183807,Har18,Harrison & Pearce (2018),harmonicity,#11A3FF,Stretched
12.942942942942944,0.5667264976581777,Har18,Harrison & Pearce (2018),harmonicity,#11A3FF,Stretched
12.957957957957959,0.5529504431623914,Har18,Harrison & Pearce (2018),harmonicity,#11A3FF,Stretched
12.972972972972974,0.5387640760002561,Har18,Harrison & Pearce (2018),harmonicity,#11A3FF,Stretched
12.987987987987989,0.5245234424437146,Har18,Harrison & Pearce (2018),harmonicity,#11A3FF,Stretched
13.003003003003004,0.5105272116977889,Har18,Harrison & Pearce (2018),harmonicity,#11A3FF,Stretched
13.018018018018019,0.49703576760629004,Har18,Harrison & Pearce (2018),harmonicity,#11A3FF,Stretched
13.033033033033034,0.4842812445510013,Har18,Harrison & Pearce (2018),harmonicity,#11A3FF,Stretched
13.048048048048049,0.4724476032312652,Har18,Harrison & Pearce (2018),harmonicity,#11A3FF,Stretched
13.063063063063064,0.4616339771279564,Har18,Harrison & Pearce (2018),harmonicity,#11A3FF,Stretched
13.078078078078079,0.4518475048165797,Har18,Harrison & Pearce (2018),harmonicity,#11A3FF,Stretched
13.093093093093094,0.4430579467478667,Har18,Harrison & Pearce (2018),harmonicity,#11A3FF,Stretched
13.108108108108109,0.4352678473987544,Har18,Harrison & Pearce (2018),harmonicity,#11A3FF,Stretched
13.123123123123124,0.4285157391785277,Har18,Harrison & Pearce (2018),harmonicity,#11A3FF,Stretched
13.138138138138139,0.42281659067483257,Har18,Harrison & Pearce (2018),harmonicity,#11A3FF,Stretched
13.153153153153154,0.4181260977430763,Har18,Harrison & Pearce (2018),harmonicity,#11A3FF,Stretched
13.168168168168169,0.4143629938305986,Har18,Harrison & Pearce (2018),harmonicity,#11A3FF,Stretched
13.183183183183184,0.4114389496245089,Har18,Harrison & Pearce (2018),harmonicity,#11A3FF,Stretched
13.198198198198199,0.40926246510825626,Har18,Harrison & Pearce (2018),harmonicity,#11A3FF,Stretched
13.213213213213214,0.40773834642408524,Har18,Harrison & Pearce (2018),harmonicity,#11A3FF,Stretched
13.228228228228229,0.40677754104961245,Har18,Harrison & Pearce (2018),harmonicity,#11A3FF,Stretched
13.243243243243244,0.4063029315414778,Har18,Harrison & Pearce (2018),harmonicity,#11A3FF,Stretched
13.258258258258259,0.4062475815608647,Har18,Harrison & Pearce (2018),harmonicity,#11A3FF,Stretched
13.273273273273274,0.4065583518017407,Har18,Harrison & Pearce (2018),harmonicity,#11A3FF,Stretched
13.288288288288289,0.40720398580569406,Har18,Harrison & Pearce (2018),harmonicity,#11A3FF,Stretched
13.303303303303304,0.40817570663009783,Har18,Harrison & Pearce (2018),harmonicity,#11A3FF,Stretched
13.318318318318319,0.40948094818923214,Har18,Harrison & Pearce (2018),harmonicity,#11A3FF,Stretched
13.333333333333334,0.41114095851471616,Har18,Harrison & Pearce (2018),harmonicity,#11A3FF,Stretched
13.348348348348349,0.4131939824059799,Har18,Harrison & Pearce (2018),harmonicity,#11A3FF,Stretched
13.363363363363364,0.4156909345272013,Har18,Harrison & Pearce (2018),harmonicity,#11A3FF,Stretched
13.378378378378379,0.41867153640340965,Har18,Harrison & Pearce (2018),harmonicity,#11A3FF,Stretched
13.393393393393394,0.4221347861444682,Har18,Harrison & Pearce (2018),harmonicity,#11A3FF,Stretched
13.408408408408409,0.4260447774699974,Har18,Harrison & Pearce (2018),harmonicity,#11A3FF,Stretched
13.423423423423424,0.4303906749342287,Har18,Harrison & Pearce (2018),harmonicity,#11A3FF,Stretched
13.438438438438439,0.4352400040166941,Har18,Harrison & Pearce (2018),harmonicity,#11A3FF,Stretched
13.453453453453454,0.4406931555854616,Har18,Harrison & Pearce (2018),harmonicity,#11A3FF,Stretched
13.468468468468469,0.44675908869051717,Har18,Harrison & Pearce (2018),harmonicity,#11A3FF,Stretched
13.483483483483484,0.4532913944043121,Har18,Harrison & Pearce (2018),harmonicity,#11A3FF,Stretched
13.498498498498499,0.4600560554259378,Har18,Harrison & Pearce (2018),harmonicity,#11A3FF,Stretched
13.513513513513514,0.46684866935088,Har18,Harrison & Pearce (2018),harmonicity,#11A3FF,Stretched
13.528528528528529,0.4735509929658098,Har18,Harrison & Pearce (2018),harmonicity,#11A3FF,Stretched
13.543543543543544,0.48009635245566024,Har18,Harrison & Pearce (2018),harmonicity,#11A3FF,Stretched
13.558558558558559,0.48638846117895135,Har18,Harrison & Pearce (2018),harmonicity,#11A3FF,Stretched
13.573573573573574,0.49225231715778583,Har18,Harrison & Pearce (2018),harmonicity,#11A3FF,Stretched
13.588588588588589,0.4974697145157742,Har18,Harrison & Pearce (2018),harmonicity,#11A3FF,Stretched
13.603603603603604,0.5018711231588304,Har18,Harrison & Pearce (2018),harmonicity,#11A3FF,Stretched
13.618618618618619,0.5053926285784935,Har18,Harrison & Pearce (2018),harmonicity,#11A3FF,Stretched
13.633633633633634,0.5080325026536184,Har18,Harrison & Pearce (2018),harmonicity,#11A3FF,Stretched
13.64864864864865,0.5097356513232738,Har18,Harrison & Pearce (2018),harmonicity,#11A3FF,Stretched
13.663663663663664,0.5103151696060092,Har18,Harrison & Pearce (2018),harmonicity,#11A3FF,Stretched
13.67867867867868,0.5095225481837019,Har18,Harrison & Pearce (2018),harmonicity,#11A3FF,Stretched
13.693693693693694,0.5072417376205156,Har18,Harrison & Pearce (2018),harmonicity,#11A3FF,Stretched
13.70870870870871,0.5036043889046555,Har18,Harrison & Pearce (2018),harmonicity,#11A3FF,Stretched
13.723723723723724,0.4988898795755434,Har18,Harrison & Pearce (2018),harmonicity,#11A3FF,Stretched
13.73873873873874,0.49334460330875585,Har18,Harrison & Pearce (2018),harmonicity,#11A3FF,Stretched
13.753753753753754,0.48711654142673994,Har18,Harrison & Pearce (2018),harmonicity,#11A3FF,Stretched
13.76876876876877,0.48030693761179416,Har18,Harrison & Pearce (2018),harmonicity,#11A3FF,Stretched
13.783783783783784,0.4730350926503225,Har18,Harrison & Pearce (2018),harmonicity,#11A3FF,Stretched
13.7987987987988,0.46546833034373036,Har18,Harrison & Pearce (2018),harmonicity,#11A3FF,Stretched
13.813813813813814,0.4578122958754294,Har18,Harrison & Pearce (2018),harmonicity,#11A3FF,Stretched
13.82882882882883,0.4502647105634848,Har18,Harrison & Pearce (2018),harmonicity,#11A3FF,Stretched
13.843843843843844,0.4429685271779091,Har18,Harrison & Pearce (2018),harmonicity,#11A3FF,Stretched
13.85885885885886,0.4360142270161178,Har18,Harrison & Pearce (2018),harmonicity,#11A3FF,Stretched
13.873873873873874,0.429490975689957,Har18,Harrison & Pearce (2018),harmonicity,#11A3FF,Stretched
13.88888888888889,0.42352853893211023,Har18,Harrison & Pearce (2018),harmonicity,#11A3FF,Stretched
13.903903903903904,0.4182793962569329,Har18,Harrison & Pearce (2018),harmonicity,#11A3FF,Stretched
13.91891891891892,0.41385559425169643,Har18,Harrison & Pearce (2018),harmonicity,#11A3FF,Stretched
13.933933933933934,0.41028404902369814,Har18,Harrison & Pearce (2018),harmonicity,#11A3FF,Stretched
13.94894894894895,0.40752398840617876,Har18,Harrison & Pearce (2018),harmonicity,#11A3FF,Stretched
13.963963963963964,0.40552103196626693,Har18,Harrison & Pearce (2018),harmonicity,#11A3FF,Stretched
13.97897897897898,0.4042352441782937,Har18,Harrison & Pearce (2018),harmonicity,#11A3FF,Stretched
13.993993993993994,0.4036292777996501,Har18,Harrison & Pearce (2018),harmonicity,#11A3FF,Stretched
14.00900900900901,0.40366157903433925,Har18,Harrison & Pearce (2018),harmonicity,#11A3FF,Stretched
14.024024024024024,0.40430422578873465,Har18,Harrison & Pearce (2018),harmonicity,#11A3FF,Stretched
14.03903903903904,0.4055570684744981,Har18,Harrison & Pearce (2018),harmonicity,#11A3FF,Stretched
14.054054054054054,0.40743611681731207,Har18,Harrison & Pearce (2018),harmonicity,#11A3FF,Stretched
14.06906906906907,0.40993409453002333,Har18,Harrison & Pearce (2018),harmonicity,#11A3FF,Stretched
14.084084084084084,0.4129748324474331,Har18,Harrison & Pearce (2018),harmonicity,#11A3FF,Stretched
14.0990990990991,0.41641476991122967,Har18,Harrison & Pearce (2018),harmonicity,#11A3FF,Stretched
14.114114114114114,0.42010727880673954,Har18,Harrison & Pearce (2018),harmonicity,#11A3FF,Stretched
14.12912912912913,0.4239639942396478,Har18,Harrison & Pearce (2018),harmonicity,#11A3FF,Stretched
14.144144144144144,0.4279566092294813,Har18,Harrison & Pearce (2018),harmonicity,#11A3FF,Stretched
14.15915915915916,0.43208246270000233,Har18,Harrison & Pearce (2018),harmonicity,#11A3FF,Stretched
14.174174174174174,0.43634054355570684,Har18,Harrison & Pearce (2018),harmonicity,#11A3FF,Stretched
14.18918918918919,0.4407253535447335,Har18,Harrison & Pearce (2018),harmonicity,#11A3FF,Stretched
14.204204204204204,0.4452210341516222,Har18,Harrison & Pearce (2018),harmonicity,#11A3FF,Stretched
14.21921921921922,0.4497939794079711,Har18,Harrison & Pearce (2018),harmonicity,#11A3FF,Stretched
14.234234234234235,0.4544068388804964,Har18,Harrison & Pearce (2018),harmonicity,#11A3FF,Stretched
14.24924924924925,0.4590616448830897,Har18,Harrison & Pearce (2018),harmonicity,#11A3FF,Stretched
14.264264264264265,0.4638248814122816,Har18,Harrison & Pearce (2018),harmonicity,#11A3FF,Stretched
14.27927927927928,0.46878065358538246,Har18,Harrison & Pearce (2018),harmonicity,#11A3FF,Stretched
14.294294294294295,0.47394876750847337,Har18,Harrison & Pearce (2018),harmonicity,#11A3FF,Stretched
14.30930930930931,0.47926315037299233,Har18,Harrison & Pearce (2018),harmonicity,#11A3FF,Stretched
14.324324324324325,0.484617404058705,Har18,Harrison & Pearce (2018),harmonicity,#11A3FF,Stretched
14.33933933933934,0.4898959382651309,Har18,Harrison & Pearce (2018),harmonicity,#11A3FF,Stretched
14.354354354354355,0.49497006690756984,Har18,Harrison & Pearce (2018),harmonicity,#11A3FF,Stretched
14.36936936936937,0.499700973777601,Har18,Harrison & Pearce (2018),harmonicity,#11A3FF,Stretched
14.384384384384385,0.5039378875802559,Har18,Harrison & Pearce (2018),harmonicity,#11A3FF,Stretched
14.3993993993994,0.507489487554102,Har18,Harrison & Pearce (2018),harmonicity,#11A3FF,Stretched
14.414414414414415,0.5101506491904692,Har18,Harrison & Pearce (2018),harmonicity,#11A3FF,Stretched
14.42942942942943,0.51186955922361,Har18,Harrison & Pearce (2018),harmonicity,#11A3FF,Stretched
14.444444444444445,0.5128950905096987,Har18,Harrison & Pearce (2018),harmonicity,#11A3FF,Stretched
14.45945945945946,0.5135822926679461,Har18,Harrison & Pearce (2018),harmonicity,#11A3FF,Stretched
14.474474474474475,0.513957775534054,Har18,Harrison & Pearce (2018),harmonicity,#11A3FF,Stretched
14.48948948948949,0.5136989176902093,Har18,Harrison & Pearce (2018),harmonicity,#11A3FF,Stretched
14.504504504504505,0.5126960798492831,Har18,Harrison & Pearce (2018),harmonicity,#11A3FF,Stretched
14.51951951951952,0.5113287165738363,Har18,Harrison & Pearce (2018),harmonicity,#11A3FF,Stretched
14.534534534534535,0.5099119866094132,Har18,Harrison & Pearce (2018),harmonicity,#11A3FF,Stretched
14.54954954954955,0.5081509181155589,Har18,Harrison & Pearce (2018),harmonicity,#11A3FF,Stretched
14.564564564564565,0.505462645196932,Har18,Harrison & Pearce (2018),harmonicity,#11A3FF,Stretched
14.57957957957958,0.5016489729889059,Har18,Harrison & Pearce (2018),harmonicity,#11A3FF,Stretched
14.594594594594595,0.4970009895691733,Har18,Harrison & Pearce (2018),harmonicity,#11A3FF,Stretched
14.60960960960961,0.4919041823582982,Har18,Harrison & Pearce (2018),harmonicity,#11A3FF,Stretched
14.624624624624625,0.4865803356745771,Har18,Harrison & Pearce (2018),harmonicity,#11A3FF,Stretched
14.63963963963964,0.48115475306405836,Har18,Harrison & Pearce (2018),harmonicity,#11A3FF,Stretched
14.654654654654655,0.475779234755847,Har18,Harrison & Pearce (2018),harmonicity,#11A3FF,Stretched
14.66966966966967,0.47062401700639156,Har18,Harrison & Pearce (2018),harmonicity,#11A3FF,Stretched
14.684684684684685,0.4658020271070939,Har18,Harrison & Pearce (2018),harmonicity,#11A3FF,Stretched
14.6996996996997,0.46134047969297254,Har18,Harrison & Pearce (2018),harmonicity,#11A3FF,Stretched
14.714714714714715,0.4572228121427089,Har18,Harrison & Pearce (2018),harmonicity,#11A3FF,Stretched
14.72972972972973,0.45345045405691836,Har18,Harrison & Pearce (2018),harmonicity,#11A3FF,Stretched
14.744744744744745,0.4500644207600112,Har18,Harrison & Pearce (2018),harmonicity,#11A3FF,Stretched
14.75975975975976,0.4471133366854568,Har18,Harrison & Pearce (2018),harmonicity,#11A3FF,Stretched
14.774774774774775,0.4446123563081893,Har18,Harrison & Pearce (2018),harmonicity,#11A3FF,Stretched
14.78978978978979,0.4425383988114814,Har18,Harrison & Pearce (2018),harmonicity,#11A3FF,Stretched
14.804804804804805,0.44085991735688596,Har18,Harrison & Pearce (2018),harmonicity,#11A3FF,Stretched
14.81981981981982,0.43956589863475626,Har18,Harrison & Pearce (2018),harmonicity,#11A3FF,Stretched
14.834834834834835,0.4386611977582128,Har18,Harrison & Pearce (2018),harmonicity,#11A3FF,Stretched
14.84984984984985,0.4381297976356212,Har18,Harrison & Pearce (2018),harmonicity,#11A3FF,Stretched
14.864864864864865,0.43791038860246756,Har18,Harrison & Pearce (2018),harmonicity,#11A3FF,Stretched
14.87987987987988,0.4379220808564499,Har18,Harrison & Pearce (2018),harmonicity,#11A3FF,Stretched
14.894894894894895,0.43811457252885433,Har18,Harrison & Pearce (2018),harmonicity,#11A3FF,Stretched
14.90990990990991,0.4384818994752116,Har18,Harrison & Pearce (2018),harmonicity,#11A3FF,Stretched
14.924924924924925,0.439027526273503,Har18,Harrison & Pearce (2018),harmonicity,#11A3FF,Stretched
14.93993993993994,0.43972801300708436,Har18,Harrison & Pearce (2018),harmonicity,#11A3FF,Stretched
14.954954954954955,0.4405256803674079,Har18,Harrison & Pearce (2018),harmonicity,#11A3FF,Stretched
14.96996996996997,0.44134016055809233,Har18,Harrison & Pearce (2018),harmonicity,#11A3FF,Stretched
14.984984984984985,0.442092310989019,Har18,Harrison & Pearce (2018),harmonicity,#11A3FF,Stretched
15,0.442731736953227,Har18,Harrison & Pearce (2018),harmonicity,#11A3FF,Stretched
