<?xml version="1.0" encoding="UTF-8" standalone="no"?>
<svg width="354.331px" height="425.196px" viewBox="0 0 354.331 425.196"
 xmlns="http://www.w3.org/2000/svg" xmlns:xlink="http://www.w3.org/1999/xlink" version="1.2" baseProfile="tiny">
<title>60-72</title>
<desc>Generated by MuseScore 3.6.2</desc>
<polyline class="StaffLines" fill="none" stroke="#000000" stroke-width="2.00" stroke-linejoin="bevel" points="0,175.011 354.331,175.011"/>
<polyline class="StaffLines" fill="none" stroke="#000000" stroke-width="2.00" stroke-linejoin="bevel" points="0,200.013 354.331,200.013"/>
<polyline class="StaffLines" fill="none" stroke="#000000" stroke-width="2.00" stroke-linejoin="bevel" points="0,225.014 354.331,225.014"/>
<polyline class="StaffLines" fill="none" stroke="#000000" stroke-width="2.00" stroke-linejoin="bevel" points="0,250.016 354.331,250.016"/>
<polyline class="StaffLines" fill="none" stroke="#000000" stroke-width="2.00" stroke-linejoin="bevel" points="0,275.017 354.331,275.017"/>
<path class="Note" d="M225.354,305.488 C228.218,309.329 231.897,311.249 236.389,311.249 C240.881,311.249 243.127,308.222 243.127,302.167 C243.127,299.303 242.313,296.764 240.686,294.55 C237.886,290.709 234.11,288.788 229.358,288.788 C227.274,288.788 225.679,289.651 224.572,291.376 C223.466,293.102 222.912,295.331 222.912,298.066 C222.912,300.8 223.726,303.274 225.354,305.488 M215.686,290.253 C220.569,287.584 226.444,286.249 233.313,286.249 C240.181,286.249 245.975,287.617 250.696,290.351 C255.416,293.085 257.776,296.341 257.776,300.117 C257.776,303.893 255.334,307.115 250.451,309.785 C245.569,312.454 239.725,313.788 232.922,313.788 C226.119,313.788 220.308,312.421 215.49,309.687 C210.673,306.952 208.264,303.665 208.264,299.824 C208.264,295.982 210.738,292.792 215.686,290.253"/>
<path class="Note" d="M225.354,217.982 C228.218,221.823 231.897,223.744 236.389,223.744 C240.881,223.744 243.127,220.717 243.127,214.662 C243.127,211.797 242.313,209.258 240.686,207.045 C237.886,203.203 234.11,201.283 229.358,201.283 C227.274,201.283 225.679,202.146 224.572,203.871 C223.466,205.596 222.912,207.826 222.912,210.56 C222.912,213.295 223.726,215.769 225.354,217.982 M215.686,202.748 C220.569,200.078 226.444,198.744 233.313,198.744 C240.181,198.744 245.975,200.111 250.696,202.845 C255.416,205.58 257.776,208.835 257.776,212.611 C257.776,216.387 255.334,219.61 250.451,222.279 C245.569,224.948 239.725,226.283 232.922,226.283 C226.119,226.283 220.308,224.916 215.49,222.181 C210.673,219.447 208.264,216.159 208.264,212.318 C208.264,208.477 210.738,205.287 215.686,202.748"/>
<polyline class="LedgerLine" fill="none" stroke="#000000" stroke-width="4.00" stroke-linejoin="bevel" points="198.763,300.019 267.283,300.019"/>
<path class="Clef" d="M61.8958,282.145 L61.8958,279.996 C61.8307,278.889 61.6679,277.164 61.4075,274.82 C58.1523,275.341 55.2552,275.602 52.7161,275.602 C43.6015,275.602 35.8704,272.005 29.5227,264.811 C23.1751,257.617 20.0013,249.039 20.0013,239.078 C20.0013,236.409 20.5221,233.203 21.5638,229.459 C22.6054,225.716 23.5657,223.209 24.4446,221.94 C25.3235,220.67 26.6419,218.44 28.3997,215.25 C28.9205,214.274 30.6132,212.125 33.4778,208.805 C33.9987,208.089 34.4544,207.503 34.845,207.047 C35.2356,206.591 35.8704,205.777 36.7493,204.606 C37.6282,203.434 38.5722,202.343 39.5813,201.334 C40.5905,200.325 41.4856,199.348 42.2669,198.404 C43.0481,197.46 43.7643,196.663 44.4153,196.012 C42.0716,188.264 40.6393,182.307 40.1184,178.141 C39.5976,173.974 39.3372,168.863 39.3372,162.809 C39.3372,156.754 40.6393,151.253 43.2434,146.305 C45.7825,141.162 49.3307,136.962 53.888,133.707 C54.1484,133.512 54.4902,133.414 54.9134,133.414 C55.3365,133.414 55.6458,133.512 55.8411,133.707 C59.3567,137.939 62.4003,143.44 64.972,150.211 C67.5436,156.982 68.8294,163.313 68.8294,169.205 C68.8294,175.097 67.332,180.777 64.3372,186.246 C60.9518,192.04 56.5898,198.03 51.2513,204.215 C52.6184,208.512 54.4414,215.25 56.72,224.43 L57.3059,224.43 C57.5664,224.365 57.7942,224.332 57.9895,224.332 C65.3463,224.332 71.3522,226.92 76.0071,232.096 C80.6621,237.272 82.9895,243.245 82.9895,250.016 C82.9895,258.414 79.5065,265.185 72.5403,270.328 C70.5221,271.826 68.1458,272.998 65.4114,273.844 C65.7369,278.076 65.8997,280.891 65.8997,282.291 C65.8997,283.691 65.8346,286.181 65.7044,289.762 C65.6393,295.882 63.5559,301.123 59.4544,305.484 C55.3528,309.846 50.6653,312.027 45.3919,312.027 C40.1184,312.027 35.6263,310.156 31.9153,306.412 C28.2044,302.669 26.3489,298.128 26.3489,292.789 C26.3489,289.99 27.4231,287.613 29.5716,285.66 C31.7851,283.707 34.2753,282.731 37.0423,282.731 C39.8092,282.731 42.0716,283.74 43.8294,285.758 C45.6523,287.646 46.5638,289.925 46.5638,292.594 C46.5638,295.263 45.6523,297.509 43.8294,299.332 C42.0065,301.155 39.8255,302.067 37.2864,302.067 C36.2447,302.067 35.2356,301.871 34.2591,301.481 C37.1237,305.712 40.802,307.828 45.2942,307.828 C49.7864,307.828 53.6276,305.973 56.8177,302.262 C60.0078,298.551 61.6028,294.189 61.6028,289.176 L61.8958,282.145 M65.0208,269.84 C68.4062,268.603 71.0918,266.406 73.0774,263.248 C75.0631,260.091 76.0559,256.949 76.0559,253.824 C76.0559,249.202 74.4609,245.068 71.2708,241.422 C68.0807,237.776 64.0442,235.725 59.1614,235.27 C61.9609,249.007 63.914,260.53 65.0208,269.84 M27.2278,247.281 C27.2278,253.727 29.7994,259.358 34.9427,264.176 C40.0859,268.994 46.108,271.402 53.0091,271.402 C55.7434,271.402 58.4127,271.207 61.0169,270.817 C59.9752,260.921 57.9244,249.072 54.8645,235.27 C51.0234,235.66 48.0449,236.979 45.929,239.225 C43.8131,241.471 42.7552,244.026 42.7552,246.891 C42.7552,251.839 45.3919,255.843 50.6653,258.902 C51.1211,259.163 51.3489,259.602 51.3489,260.221 C51.3489,260.839 51.1373,261.376 50.7142,261.832 C50.291,262.288 49.9166,262.516 49.5911,262.516 C49.2656,262.516 48.8424,262.451 48.3216,262.32 C40.7044,258.154 36.8958,251.871 36.8958,243.473 C36.8958,239.501 38.2955,235.693 41.095,232.047 C44.0247,228.401 47.8333,226.057 52.5208,225.016 C50.6979,217.724 49.2005,212.027 48.0286,207.926 C39.1093,217.952 33.5755,225.374 31.427,230.192 C28.6276,236.442 27.2278,242.138 27.2278,247.281 M59.845,147.965 C54.9622,150.374 51.1048,153.857 48.2727,158.414 C45.4407,162.971 44.0247,167.757 44.0247,172.77 C44.0247,177.783 45.1966,184.261 47.5403,192.203 C52.2278,186.539 55.776,181.233 58.1849,176.285 C60.5937,171.337 61.7981,166.438 61.7981,161.588 C61.7981,156.738 61.1471,152.197 59.845,147.965"/>
</svg>
