interval,output,model_id,model_label,model_theory,model_colour,timbre_label
0,-0,Vass01,Vassilakis (2001),interference,#B50000,Pure
0.015015015015015015,-0.004977218354775714,Vass01,Vassilakis (2001),interference,#B50000,Pure
0.03003003003003003,-0.009856282269165906,Vass01,Vassilakis (2001),interference,#B50000,Pure
0.04504504504504504,-0.014638543991301822,Vass01,Vassilakis (2001),interference,#B50000,Pure
0.06006006006006006,-0.01932534056595503,Vass01,Vassilakis (2001),interference,#B50000,Pure
0.07507507507507508,-0.023917993978396224,Vass01,Vassilakis (2001),interference,#B50000,Pure
0.09009009009009009,-0.02841781129711618,Vass01,Vassilakis (2001),interference,#B50000,Pure
0.10510510510510511,-0.03282608481541738,Vass01,Vassilakis (2001),interference,#B50000,Pure
0.12012012012012012,-0.037144092191903844,Vass01,Vassilakis (2001),interference,#B50000,Pure
0.13513513513513514,-0.04137309658986377,Vass01,Vassilakis (2001),interference,#B50000,Pure
0.15015015015015015,-0.04551434681553845,Vass01,Vassilakis (2001),interference,#B50000,Pure
0.16516516516516516,-0.049569077455311916,Vass01,Vassilakis (2001),interference,#B50000,Pure
0.18018018018018017,-0.053538509011800905,Vass01,Vassilakis (2001),interference,#B50000,Pure
0.19519519519519518,-0.05742384803887468,Vass01,Vassilakis (2001),interference,#B50000,Pure
0.21021021021021022,-0.06122628727559576,Vass01,Vassilakis (2001),interference,#B50000,Pure
0.22522522522522523,-0.06494700577909063,Vass01,Vassilakis (2001),interference,#B50000,Pure
0.24024024024024024,-0.0685871690563612,Vass01,Vassilakis (2001),interference,#B50000,Pure
0.2552552552552553,-0.07214792919505264,Vass01,Vassilakis (2001),interference,#B50000,Pure
0.2702702702702703,-0.07563042499315376,Vass01,Vassilakis (2001),interference,#B50000,Pure
0.2852852852852853,-0.07903578208767625,Vass01,Vassilakis (2001),interference,#B50000,Pure
0.3003003003003003,-0.08236511308227912,Vass01,Vassilakis (2001),interference,#B50000,Pure
0.3153153153153153,-0.08561951767389164,Vass01,Vassilakis (2001),interference,#B50000,Pure
0.3303303303303303,-0.08880008277828588,Vass01,Vassilakis (2001),interference,#B50000,Pure
0.34534534534534533,-0.091907882654655,Vass01,Vassilakis (2001),interference,#B50000,Pure
0.36036036036036034,-0.09494397902917084,Vass01,Vassilakis (2001),interference,#B50000,Pure
0.37537537537537535,-0.09790942121754864,Vass01,Vassilakis (2001),interference,#B50000,Pure
0.39039039039039036,-0.10080524624660869,Vass01,Vassilakis (2001),interference,#B50000,Pure
0.40540540540540543,-0.10363247897485106,Vass01,Vassilakis (2001),interference,#B50000,Pure
0.42042042042042044,-0.10639213221204202,Vass01,Vassilakis (2001),interference,#B50000,Pure
0.43543543543543545,-0.10908520683783696,Vass01,Vassilakis (2001),interference,#B50000,Pure
0.45045045045045046,-0.11171269191941713,Vass01,Vassilakis (2001),interference,#B50000,Pure
0.46546546546546547,-0.11427556482817014,Vass01,Vassilakis (2001),interference,#B50000,Pure
0.4804804804804805,-0.11677479135540825,Vass01,Vassilakis (2001),interference,#B50000,Pure
0.4954954954954955,-0.11921132582714067,Vass01,Vassilakis (2001),interference,#B50000,Pure
0.5105105105105106,-0.12158626734312372,Vass01,Vassilakis (2001),interference,#B50000,Pure
0.5255255255255256,-0.12390023136916128,Vass01,Vassilakis (2001),interference,#B50000,Pure
0.5405405405405406,-0.12615429872036021,Vass01,Vassilakis (2001),interference,#B50000,Pure
0.5555555555555556,-0.12834937898963206,Vass01,Vassilakis (2001),interference,#B50000,Pure
0.5705705705705706,-0.13048637086436154,Vass01,Vassilakis (2001),interference,#B50000,Pure
0.5855855855855856,-0.1325661622355946,Vass01,Vassilakis (2001),interference,#B50000,Pure
0.6006006006006006,-0.13458963030631133,Vass01,Vassilakis (2001),interference,#B50000,Pure
0.6156156156156156,-0.13655764169879392,Vass01,Vassilakis (2001),interference,#B50000,Pure
0.6306306306306306,-0.13847105256110048,Vass01,Vassilakis (2001),interference,#B50000,Pure
0.6456456456456456,-0.14033070867264774,Vass01,Vassilakis (2001),interference,#B50000,Pure
0.6606606606606606,-0.14213744554890528,Vass01,Vassilakis (2001),interference,#B50000,Pure
0.6756756756756757,-0.14389208854521207,Vass01,Vassilakis (2001),interference,#B50000,Pure
0.6906906906906907,-0.14559545295971432,Vass01,Vassilakis (2001),interference,#B50000,Pure
0.7057057057057057,-0.1472483441354422,Vass01,Vassilakis (2001),interference,#B50000,Pure
0.7207207207207207,-0.14885155756151858,Vass01,Vassilakis (2001),interference,#B50000,Pure
0.7357357357357357,-0.15040587897351487,Vass01,Vassilakis (2001),interference,#B50000,Pure
0.7507507507507507,-0.1519120844529478,Vass01,Vassilakis (2001),interference,#B50000,Pure
0.7657657657657657,-0.1533709405259458,Vass01,Vassilakis (2001),interference,#B50000,Pure
0.7807807807807807,-0.1547832042610603,Vass01,Vassilakis (2001),interference,#B50000,Pure
0.7957957957957957,-0.15614962336625343,Vass01,Vassilakis (2001),interference,#B50000,Pure
0.8108108108108109,-0.1574709362850506,Vass01,Vassilakis (2001),interference,#B50000,Pure
0.8258258258258259,-0.15874787229187826,Vass01,Vassilakis (2001),interference,#B50000,Pure
0.8408408408408409,-0.15998115158657655,Vass01,Vassilakis (2001),interference,#B50000,Pure
0.8558558558558559,-0.16117148538810627,Vass01,Vassilakis (2001),interference,#B50000,Pure
0.8708708708708709,-0.1623195760274454,Vass01,Vassilakis (2001),interference,#B50000,Pure
0.8858858858858859,-0.16342611703969084,Vass01,Vassilakis (2001),interference,#B50000,Pure
0.9009009009009009,-0.16449179325535979,Vass01,Vassilakis (2001),interference,#B50000,Pure
0.9159159159159159,-0.16551728089090484,Vass01,Vassilakis (2001),interference,#B50000,Pure
0.9309309309309309,-0.16650324763844254,Vass01,Vassilakis (2001),interference,#B50000,Pure
0.9459459459459459,-0.1674503527547076,Vass01,Vassilakis (2001),interference,#B50000,Pure
0.960960960960961,-0.1683592471492289,Vass01,Vassilakis (2001),interference,#B50000,Pure
0.975975975975976,-0.16923057347174236,Vass01,Vassilakis (2001),interference,#B50000,Pure
0.990990990990991,-0.17006496619883538,Vass01,Vassilakis (2001),interference,#B50000,Pure
1.006006006006006,-0.1708630517198415,Vass01,Vassilakis (2001),interference,#B50000,Pure
1.021021021021021,-0.17162544842197697,Vass01,Vassilakis (2001),interference,#B50000,Pure
1.0360360360360361,-0.17235276677473393,Vass01,Vassilakis (2001),interference,#B50000,Pure
1.0510510510510511,-0.1730456094135298,Vass01,Vassilakis (2001),interference,#B50000,Pure
1.0660660660660661,-0.1737045712226245,Vass01,Vassilakis (2001),interference,#B50000,Pure
1.0810810810810811,-0.17433023941730125,Vass01,Vassilakis (2001),interference,#B50000,Pure
1.0960960960960962,-0.17492319362532693,Vass01,Vassilakis (2001),interference,#B50000,Pure
1.1111111111111112,-0.17548400596768626,Vass01,Vassilakis (2001),interference,#B50000,Pure
1.1261261261261262,-0.17601324113860517,Vass01,Vassilakis (2001),interference,#B50000,Pure
1.1411411411411412,-0.17651145648486155,Vass01,Vassilakis (2001),interference,#B50000,Pure
1.1561561561561562,-0.17697920208438994,Vass01,Vassilakis (2001),interference,#B50000,Pure
1.1711711711711712,-0.17741702082418603,Vass01,Vassilakis (2001),interference,#B50000,Pure
1.1861861861861862,-0.17782544847751725,Vass01,Vassilakis (2001),interference,#B50000,Pure
1.2012012012012012,-0.17820501378044135,Vass01,Vassilakis (2001),interference,#B50000,Pure
1.2162162162162162,-0.17855623850763974,Vass01,Vassilakis (2001),interference,#B50000,Pure
1.2312312312312312,-0.1788796375475704,Vass01,Vassilakis (2001),interference,#B50000,Pure
1.2462462462462462,-0.17917571897694512,Vass01,Vassilakis (2001),interference,#B50000,Pure
1.2612612612612613,-0.17944498413453652,Vass01,Vassilakis (2001),interference,#B50000,Pure
1.2762762762762763,-0.17968792769431807,Vass01,Vassilakis (2001),interference,#B50000,Pure
1.2912912912912913,-0.17990503773794375,Vass01,Vassilakis (2001),interference,#B50000,Pure
1.3063063063063063,-0.1800967958265715,Vass01,Vassilakis (2001),interference,#B50000,Pure
1.3213213213213213,-0.1802636770720346,Vass01,Vassilakis (2001),interference,#B50000,Pure
1.3363363363363363,-0.18040615020736694,Vass01,Vassilakis (2001),interference,#B50000,Pure
1.3513513513513513,-0.18052467765668595,Vass01,Vassilakis (2001),interference,#B50000,Pure
1.3663663663663663,-0.18061971560443812,Vass01,Vassilakis (2001),interference,#B50000,Pure
1.3813813813813813,-0.18069171406401224,Vass01,Vassilakis (2001),interference,#B50000,Pure
1.3963963963963963,-0.18074111694572498,Vass01,Vassilakis (2001),interference,#B50000,Pure
1.4114114114114114,-0.18076836212418168,Vass01,Vassilakis (2001),interference,#B50000,Pure
1.4264264264264264,-0.1807738815050205,Vass01,Vassilakis (2001),interference,#B50000,Pure
1.4414414414414414,-0.18075810109104107,Vass01,Vassilakis (2001),interference,#B50000,Pure
1.4564564564564564,-0.1807214410477237,Vass01,Vassilakis (2001),interference,#B50000,Pure
1.4714714714714714,-0.18066431576814435,Vass01,Vassilakis (2001),interference,#B50000,Pure
1.4864864864864864,-0.1805871339372883,Vass01,Vassilakis (2001),interference,#B50000,Pure
1.5015015015015014,-0.18049029150087714,Vass01,Vassilakis (2001),interference,#B50000,Pure
1.5165165165165164,-0.1803741988387183,Vass01,Vassilakis (2001),interference,#B50000,Pure
1.5315315315315314,-0.180239242091842,Vass01,Vassilakis (2001),interference,#B50000,Pure
1.5465465465465464,-0.18008580774379584,Vass01,Vassilakis (2001),interference,#B50000,Pure
1.5615615615615615,-0.1799142768827595,Vass01,Vassilakis (2001),interference,#B50000,Pure
1.5765765765765765,-0.1797250252623493,Vass01,Vassilakis (2001),interference,#B50000,Pure
1.5915915915915915,-0.1795184233618528,Vass01,Vassilakis (2001),interference,#B50000,Pure
1.6066066066066067,-0.17929483644589816,Vass01,Vassilakis (2001),interference,#B50000,Pure
1.6216216216216217,-0.17905462462356286,Vass01,Vassilakis (2001),interference,#B50000,Pure
1.6366366366366367,-0.17879814290692594,Vass01,Vassilakis (2001),interference,#B50000,Pure
1.6516516516516517,-0.17852574126906703,Vass01,Vassilakis (2001),interference,#B50000,Pure
1.6666666666666667,-0.1782377647015176,Vass01,Vassilakis (2001),interference,#B50000,Pure
1.6816816816816818,-0.17793455327116825,Vass01,Vassilakis (2001),interference,#B50000,Pure
1.6966966966966968,-0.17761644217663672,Vass01,Vassilakis (2001),interference,#B50000,Pure
1.7117117117117118,-0.17728376180409852,Vass01,Vassilakis (2001),interference,#B50000,Pure
1.7267267267267268,-0.17693683778258795,Vass01,Vassilakis (2001),interference,#B50000,Pure
1.7417417417417418,-0.17657599103877072,Vass01,Vassilakis (2001),interference,#B50000,Pure
1.7567567567567568,-0.1762015378511935,Vass01,Vassilakis (2001),interference,#B50000,Pure
1.7717717717717718,-0.17581378990401336,Vass01,Vassilakis (2001),interference,#B50000,Pure
1.7867867867867868,-0.17541305434021354,Vass01,Vassilakis (2001),interference,#B50000,Pure
1.8018018018018018,-0.17499963381430667,Vass01,Vassilakis (2001),interference,#B50000,Pure
1.8168168168168168,-0.1745738265445317,Vass01,Vassilakis (2001),interference,#B50000,Pure
1.8318318318318318,-0.17413592636454603,Vass01,Vassilakis (2001),interference,#B50000,Pure
1.8468468468468469,-0.17368622277462054,Vass01,Vassilakis (2001),interference,#B50000,Pure
1.8618618618618619,-0.17322500099233695,Vass01,Vassilakis (2001),interference,#B50000,Pure
1.8768768768768769,-0.17275254200279644,Vass01,Vassilakis (2001),interference,#B50000,Pure
1.8918918918918919,-0.17226912260833677,Vass01,Vassilakis (2001),interference,#B50000,Pure
1.906906906906907,-0.17177501547776972,Vass01,Vassilakis (2001),interference,#B50000,Pure
1.921921921921922,-0.17127048919513546,Vass01,Vassilakis (2001),interference,#B50000,Pure
1.936936936936937,-0.17075580830798373,Vass01,Vassilakis (2001),interference,#B50000,Pure
1.951951951951952,-0.17023123337517931,Vass01,Vassilakis (2001),interference,#B50000,Pure
1.966966966966967,-0.16969702101424117,Vass01,Vassilakis (2001),interference,#B50000,Pure
1.981981981981982,-0.1691534239482169,Vass01,Vassilakis (2001),interference,#B50000,Pure
1.996996996996997,-0.1686006910520955,Vass01,Vassilakis (2001),interference,#B50000,Pure
2.012012012012012,-0.16803906739876154,Vass01,Vassilakis (2001),interference,#B50000,Pure
2.027027027027027,-0.1674687943044981,Vass01,Vassilakis (2001),interference,#B50000,Pure
2.042042042042042,-0.16689010937403706,Vass01,Vassilakis (2001),interference,#B50000,Pure
2.057057057057057,-0.16630324654516587,Vass01,Vassilakis (2001),interference,#B50000,Pure
2.0720720720720722,-0.1657084361328883,Vass01,Vassilakis (2001),interference,#B50000,Pure
2.0870870870870872,-0.1651059048731479,Vass01,Vassilakis (2001),interference,#B50000,Pure
2.1021021021021022,-0.1644958759661152,Vass01,Vassilakis (2001),interference,#B50000,Pure
2.1171171171171173,-0.1638785691190444,Vass01,Vassilakis (2001),interference,#B50000,Pure
2.1321321321321323,-0.16325420058869755,Vass01,Vassilakis (2001),interference,#B50000,Pure
2.1471471471471473,-0.16262298322334817,Vass01,Vassilakis (2001),interference,#B50000,Pure
2.1621621621621623,-0.16198512650435948,Vass01,Vassilakis (2001),interference,#B50000,Pure
2.1771771771771773,-0.16134083658734785,Vass01,Vassilakis (2001),interference,#B50000,Pure
2.1921921921921923,-0.1606903163429287,Vass01,Vassilakis (2001),interference,#B50000,Pure
2.2072072072072073,-0.1600337653970519,Vass01,Vassilakis (2001),interference,#B50000,Pure
2.2222222222222223,-0.15937138017092994,Vass01,Vassilakis (2001),interference,#B50000,Pure
2.2372372372372373,-0.1587033539205623,Vass01,Vassilakis (2001),interference,#B50000,Pure
2.2522522522522523,-0.15802987677585534,Vass01,Vassilakis (2001),interference,#B50000,Pure
2.2672672672672673,-0.15735113577934792,Vass01,Vassilakis (2001),interference,#B50000,Pure
2.2822822822822824,-0.1566673149245402,Vass01,Vassilakis (2001),interference,#B50000,Pure
2.2972972972972974,-0.1559785951938329,Vass01,Vassilakis (2001),interference,#B50000,Pure
2.3123123123123124,-0.15528515459607672,Vass01,Vassilakis (2001),interference,#B50000,Pure
2.3273273273273274,-0.15458716820373836,Vass01,Vassilakis (2001),interference,#B50000,Pure
2.3423423423423424,-0.1538848081896842,Vass01,Vassilakis (2001),interference,#B50000,Pure
2.3573573573573574,-0.15317824386358683,Vass01,Vassilakis (2001),interference,#B50000,Pure
2.3723723723723724,-0.15246764170795474,Vass01,Vassilakis (2001),interference,#B50000,Pure
2.3873873873873874,-0.15175316541379147,Vass01,Vassilakis (2001),interference,#B50000,Pure
2.4024024024024024,-0.15103497591588455,Vass01,Vassilakis (2001),interference,#B50000,Pure
2.4174174174174174,-0.15031323142773212,Vass01,Vassilakis (2001),interference,#B50000,Pure
2.4324324324324325,-0.1495880874761007,Vass01,Vassilakis (2001),interference,#B50000,Pure
2.4474474474474475,-0.1488596969352302,Vass01,Vassilakis (2001),interference,#B50000,Pure
2.4624624624624625,-0.14812821006067747,Vass01,Vassilakis (2001),interference,#B50000,Pure
2.4774774774774775,-0.14739377452281102,Vass01,Vassilakis (2001),interference,#B50000,Pure
2.4924924924924925,-0.14665653543994933,Vass01,Vassilakis (2001),interference,#B50000,Pure
2.5075075075075075,-0.14591658604827526,Vass01,Vassilakis (2001),interference,#B50000,Pure
2.5225225225225225,-0.14517416502253894,Vass01,Vassilakis (2001),interference,#B50000,Pure
2.5375375375375375,-0.14442936082978672,Vass01,Vassilakis (2001),interference,#B50000,Pure
2.5525525525525525,-0.14368230870449883,Vass01,Vassilakis (2001),interference,#B50000,Pure
2.5675675675675675,-0.14293314148966743,Vass01,Vassilakis (2001),interference,#B50000,Pure
2.5825825825825826,-0.14218198966789716,Vass01,Vassilakis (2001),interference,#B50000,Pure
2.5975975975975976,-0.14142898139217747,Vass01,Vassilakis (2001),interference,#B50000,Pure
2.6126126126126126,-0.1406742425163278,Vass01,Vassilakis (2001),interference,#B50000,Pure
2.6276276276276276,-0.13991789662512077,Vass01,Vassilakis (2001),interference,#B50000,Pure
2.6426426426426426,-0.13916006506407833,Vass01,Vassilakis (2001),interference,#B50000,Pure
2.6576576576576576,-0.13840086696895615,Vass01,Vassilakis (2001),interference,#B50000,Pure
2.6726726726726726,-0.13764041929490722,Vass01,Vassilakis (2001),interference,#B50000,Pure
2.6876876876876876,-0.1368788368453382,Vass01,Vassilakis (2001),interference,#B50000,Pure
2.7027027027027026,-0.13611623230044795,Vass01,Vassilakis (2001),interference,#B50000,Pure
2.7177177177177176,-0.13535271624546602,Vass01,Vassilakis (2001),interference,#B50000,Pure
2.7327327327327327,-0.13458839719858245,Vass01,Vassilakis (2001),interference,#B50000,Pure
2.7477477477477477,-0.1338233816385772,Vass01,Vassilakis (2001),interference,#B50000,Pure
2.7627627627627627,-0.13305777403214925,Vass01,Vassilakis (2001),interference,#B50000,Pure
2.7777777777777777,-0.13229167686094942,Vass01,Vassilakis (2001),interference,#B50000,Pure
2.7927927927927927,-0.1315251906483194,Vass01,Vassilakis (2001),interference,#B50000,Pure
2.8078078078078077,-0.1307584139857407,Vass01,Vassilakis (2001),interference,#B50000,Pure
2.8228228228228227,-0.12999144355899173,Vass01,Vassilakis (2001),interference,#B50000,Pure
2.8378378378378377,-0.1292243741740214,Vass01,Vassilakis (2001),interference,#B50000,Pure
2.8528528528528527,-0.12845729878253775,Vass01,Vassilakis (2001),interference,#B50000,Pure
2.8678678678678677,-0.1276903085073176,Vass01,Vassilakis (2001),interference,#B50000,Pure
2.8828828828828827,-0.12692349266723368,Vass01,Vassilakis (2001),interference,#B50000,Pure
2.8978978978978978,-0.12615693880201,Vass01,Vassilakis (2001),interference,#B50000,Pure
2.9129129129129128,-0.12539073269670092,Vass01,Vassilakis (2001),interference,#B50000,Pure
2.9279279279279278,-0.12462495840590149,Vass01,Vassilakis (2001),interference,#B50000,Pure
2.942942942942943,-0.12385969827768631,Vass01,Vassilakis (2001),interference,#B50000,Pure
2.957957957957958,-0.12309503297728472,Vass01,Vassilakis (2001),interference,#B50000,Pure
2.972972972972973,-0.12233104151049112,Vass01,Vassilakis (2001),interference,#B50000,Pure
2.987987987987988,-0.12156780124681517,Vass01,Vassilakis (2001),interference,#B50000,Pure
3.003003003003003,-0.12080538794237156,Vass01,Vassilakis (2001),interference,#B50000,Pure
3.018018018018018,-0.12004387576251319,Vass01,Vassilakis (2001),interference,#B50000,Pure
3.033033033033033,-0.11928333730421267,Vass01,Vassilakis (2001),interference,#B50000,Pure
3.048048048048048,-0.11852384361819002,Vass01,Vassilakis (2001),interference,#B50000,Pure
3.063063063063063,-0.11776546423078951,Vass01,Vassilakis (2001),interference,#B50000,Pure
3.078078078078078,-0.11700826716561288,Vass01,Vassilakis (2001),interference,#B50000,Pure
3.093093093093093,-0.11625231896490383,Vass01,Vassilakis (2001),interference,#B50000,Pure
3.108108108108108,-0.11549768471069491,Vass01,Vassilakis (2001),interference,#B50000,Pure
3.123123123123123,-0.11474442804570756,Vass01,Vassilakis (2001),interference,#B50000,Pure
3.138138138138138,-0.11399261119401881,Vass01,Vassilakis (2001),interference,#B50000,Pure
3.153153153153153,-0.11324229498149092,Vass01,Vassilakis (2001),interference,#B50000,Pure
3.168168168168168,-0.11249353885596756,Vass01,Vassilakis (2001),interference,#B50000,Pure
3.183183183183183,-0.11174640090723659,Vass01,Vassilakis (2001),interference,#B50000,Pure
3.198198198198198,-0.11100093788676522,Vass01,Vassilakis (2001),interference,#B50000,Pure
3.2132132132132134,-0.1102572052272083,Vass01,Vassilakis (2001),interference,#B50000,Pure
3.2282282282282284,-0.10951525706169163,Vass01,Vassilakis (2001),interference,#B50000,Pure
3.2432432432432434,-0.10877514624287014,Vass01,Vassilakis (2001),interference,#B50000,Pure
3.2582582582582584,-0.10803692436176712,Vass01,Vassilakis (2001),interference,#B50000,Pure
3.2732732732732734,-0.10730064176639523,Vass01,Vassilakis (2001),interference,#B50000,Pure
3.2882882882882885,-0.10656634758016091,Vass01,Vassilakis (2001),interference,#B50000,Pure
3.3033033033033035,-0.10583408972005123,Vass01,Vassilakis (2001),interference,#B50000,Pure
3.3183183183183185,-0.10510391491461163,Vass01,Vassilakis (2001),interference,#B50000,Pure
3.3333333333333335,-0.1043758687217124,Vass01,Vassilakis (2001),interference,#B50000,Pure
3.3483483483483485,-0.1036499955461068,Vass01,Vassilakis (2001),interference,#B50000,Pure
3.3633633633633635,-0.10292633865678076,Vass01,Vassilakis (2001),interference,#B50000,Pure
3.3783783783783785,-0.10220494020410001,Vass01,Vassilakis (2001),interference,#B50000,Pure
3.3933933933933935,-0.10148584123675547,Vass01,Vassilakis (2001),interference,#B50000,Pure
3.4084084084084085,-0.10076908171850613,Vass01,Vassilakis (2001),interference,#B50000,Pure
3.4234234234234235,-0.10005470054472419,Vass01,Vassilakis (2001),interference,#B50000,Pure
3.4384384384384385,-0.09934273555874326,Vass01,Vassilakis (2001),interference,#B50000,Pure
3.4534534534534536,-0.09863322356801255,Vass01,Vassilakis (2001),interference,#B50000,Pure
3.4684684684684686,-0.09792620036005795,Vass01,Vassilakis (2001),interference,#B50000,Pure
3.4834834834834836,-0.09722170071825087,Vass01,Vassilakis (2001),interference,#B50000,Pure
3.4984984984984986,-0.09651975843738986,Vass01,Vassilakis (2001),interference,#B50000,Pure
3.5135135135135136,-0.09582035984916851,Vass01,Vassilakis (2001),interference,#B50000,Pure
3.5285285285285286,-0.09512362997275223,Vass01,Vassilakis (2001),interference,#B50000,Pure
3.5435435435435436,-0.09442955306527571,Vass01,Vassilakis (2001),interference,#B50000,Pure
3.5585585585585586,-0.09373815911927239,Vass01,Vassilakis (2001),interference,#B50000,Pure
3.5735735735735736,-0.0930494772138358,Vass01,Vassilakis (2001),interference,#B50000,Pure
3.5885885885885886,-0.09236353552910216,Vass01,Vassilakis (2001),interference,#B50000,Pure
3.6036036036036037,-0.09168036136055929,Vass01,Vassilakis (2001),interference,#B50000,Pure
3.6186186186186187,-0.09099998113317948,Vass01,Vassilakis (2001),interference,#B50000,Pure
3.6336336336336337,-0.0903224204153813,Vass01,Vassilakis (2001),interference,#B50000,Pure
3.6486486486486487,-0.08964770393281637,Vass01,Vassilakis (2001),interference,#B50000,Pure
3.6636636636636637,-0.08897585558199046,Vass01,Vassilakis (2001),interference,#B50000,Pure
3.6786786786786787,-0.08830689844371475,Vass01,Vassilakis (2001),interference,#B50000,Pure
3.6936936936936937,-0.08764085479639255,Vass01,Vassilakis (2001),interference,#B50000,Pure
3.7087087087087087,-0.08697774612913886,Vass01,Vassilakis (2001),interference,#B50000,Pure
3.7237237237237237,-0.08631759315473969,Vass01,Vassilakis (2001),interference,#B50000,Pure
3.7387387387387387,-0.08566041582244889,Vass01,Vassilakis (2001),interference,#B50000,Pure
3.7537537537537538,-0.08500623333062667,Vass01,Vassilakis (2001),interference,#B50000,Pure
3.7687687687687688,-0.08435506413921816,Vass01,Vassilakis (2001),interference,#B50000,Pure
3.7837837837837838,-0.08370692598207775,Vass01,Vassilakis (2001),interference,#B50000,Pure
3.798798798798799,-0.08306183587913732,Vass01,Vassilakis (2001),interference,#B50000,Pure
3.813813813813814,-0.08241981014842258,Vass01,Vassilakis (2001),interference,#B50000,Pure
3.828828828828829,-0.08178086441791639,Vass01,Vassilakis (2001),interference,#B50000,Pure
3.843843843843844,-0.08114501363727264,Vass01,Vassilakis (2001),interference,#B50000,Pure
3.858858858858859,-0.08051227208938228,Vass01,Vassilakis (2001),interference,#B50000,Pure
3.873873873873874,-0.07988265340179272,Vass01,Vassilakis (2001),interference,#B50000,Pure
3.888888888888889,-0.07925617055797879,Vass01,Vassilakis (2001),interference,#B50000,Pure
3.903903903903904,-0.07863283590847382,Vass01,Vassilakis (2001),interference,#B50000,Pure
3.918918918918919,-0.07801266118185514,Vass01,Vassilakis (2001),interference,#B50000,Pure
3.933933933933934,-0.07739565749559148,Vass01,Vassilakis (2001),interference,#B50000,Pure
3.948948948948949,-0.07678183536674771,Vass01,Vassilakis (2001),interference,#B50000,Pure
3.963963963963964,-0.07617120472255319,Vass01,Vassilakis (2001),interference,#B50000,Pure
3.978978978978979,-0.07556377491083431,Vass01,Vassilakis (2001),interference,#B50000,Pure
3.993993993993994,-0.07495955471031045,Vass01,Vassilakis (2001),interference,#B50000,Pure
4.009009009009009,-0.0743585523407561,Vass01,Vassilakis (2001),interference,#B50000,Pure
4.024024024024024,-0.0737607754730327,Vass01,Vassilakis (2001),interference,#B50000,Pure
4.039039039039039,-0.073166231238985,Vass01,Vassilakis (2001),interference,#B50000,Pure
4.054054054054054,-0.0725749262412151,Vass01,Vassilakis (2001),interference,#B50000,Pure
4.069069069069069,-0.07198686656271885,Vass01,Vassilakis (2001),interference,#B50000,Pure
4.084084084084084,-0.0714020577764055,Vass01,Vassilakis (2001),interference,#B50000,Pure
4.099099099099099,-0.070820504954484,Vass01,Vassilakis (2001),interference,#B50000,Pure
4.114114114114114,-0.07024221267772698,Vass01,Vassilakis (2001),interference,#B50000,Pure
4.129129129129129,-0.06966718504461586,Vass01,Vassilakis (2001),interference,#B50000,Pure
4.1441441441441444,-0.0690954256803602,Vass01,Vassilakis (2001),interference,#B50000,Pure
4.1591591591591595,-0.06852693774579546,Vass01,Vassilakis (2001),interference,#B50000,Pure
4.1741741741741745,-0.0679617239461689,Vass01,Vassilakis (2001),interference,#B50000,Pure
4.1891891891891895,-0.0673997865397987,Vass01,Vassilakis (2001),interference,#B50000,Pure
4.2042042042042045,-0.06684112734662448,Vass01,Vassilakis (2001),interference,#B50000,Pure
4.2192192192192195,-0.06628574775663867,Vass01,Vassilakis (2001),interference,#B50000,Pure
4.2342342342342345,-0.06573364873820192,Vass01,Vassilakis (2001),interference,#B50000,Pure
4.2492492492492495,-0.06518483084625301,Vass01,Vassilakis (2001),interference,#B50000,Pure
4.2642642642642645,-0.0646392942304002,Vass01,Vassilakis (2001),interference,#B50000,Pure
4.2792792792792795,-0.0640970386429036,Vass01,Vassilakis (2001),interference,#B50000,Pure
4.2942942942942945,-0.06355806344655433,Vass01,Vassilakis (2001),interference,#B50000,Pure
4.3093093093093096,-0.0630223676224363,Vass01,Vassilakis (2001),interference,#B50000,Pure
4.324324324324325,-0.062489949777590426,Vass01,Vassilakis (2001),interference,#B50000,Pure
4.33933933933934,-0.06196080815256774,Vass01,Vassilakis (2001),interference,#B50000,Pure
4.354354354354355,-0.061434940628878144,Vass01,Vassilakis (2001),interference,#B50000,Pure
4.36936936936937,-0.06091234473634065,Vass01,Vassilakis (2001),interference,#B50000,Pure
4.384384384384385,-0.06039301766032711,Vass01,Vassilakis (2001),interference,#B50000,Pure
4.3993993993994,-0.05987695624890461,Vass01,Vassilakis (2001),interference,#B50000,Pure
4.414414414414415,-0.059364157019883596,Vass01,Vassilakis (2001),interference,#B50000,Pure
4.42942942942943,-0.05885461616775913,Vass01,Vassilakis (2001),interference,#B50000,Pure
4.444444444444445,-0.05834832957056334,Vass01,Vassilakis (2001),interference,#B50000,Pure
4.45945945945946,-0.0578452927966146,Vass01,Vassilakis (2001),interference,#B50000,Pure
4.474474474474475,-0.05734550111117253,Vass01,Vassilakis (2001),interference,#B50000,Pure
4.48948948948949,-0.056848949483003036,Vass01,Vassilakis (2001),interference,#B50000,Pure
4.504504504504505,-0.056355599843508075,Vass01,Vassilakis (2001),interference,#B50000,Pure
4.51951951951952,-0.05586551229731534,Vass01,Vassilakis (2001),interference,#B50000,Pure
4.534534534534535,-0.05537864799954204,Vass01,Vassilakis (2001),interference,#B50000,Pure
4.54954954954955,-0.05489500079672224,Vass01,Vassilakis (2001),interference,#B50000,Pure
4.564564564564565,-0.05441456427032366,Vass01,Vassilakis (2001),interference,#B50000,Pure
4.57957957957958,-0.05393733174276838,Vass01,Vassilakis (2001),interference,#B50000,Pure
4.594594594594595,-0.05346329628336198,Vass01,Vassilakis (2001),interference,#B50000,Pure
4.60960960960961,-0.05299245071413615,Vass01,Vassilakis (2001),interference,#B50000,Pure
4.624624624624625,-0.052524787615611634,Vass01,Vassilakis (2001),interference,#B50000,Pure
4.63963963963964,-0.052060299332468474,Vass01,Vassilakis (2001),interference,#B50000,Pure
4.654654654654655,-0.05159897797914223,Vass01,Vassilakis (2001),interference,#B50000,Pure
4.66966966966967,-0.05114081544533119,Vass01,Vassilakis (2001),interference,#B50000,Pure
4.684684684684685,-0.05068580340142355,Vass01,Vassilakis (2001),interference,#B50000,Pure
4.6996996996997,-0.05023393330384781,Vass01,Vassilakis (2001),interference,#B50000,Pure
4.714714714714715,-0.04978519640033998,Vass01,Vassilakis (2001),interference,#B50000,Pure
4.72972972972973,-0.049339583735131975,Vass01,Vassilakis (2001),interference,#B50000,Pure
4.744744744744745,-0.04889708615406688,Vass01,Vassilakis (2001),interference,#B50000,Pure
4.75975975975976,-0.04845769430963122,Vass01,Vassilakis (2001),interference,#B50000,Pure
4.774774774774775,-0.048021398665917765,Vass01,Vassilakis (2001),interference,#B50000,Pure
4.78978978978979,-0.0475881895035087,Vass01,Vassilakis (2001),interference,#B50000,Pure
4.804804804804805,-0.047158056924285874,Vass01,Vassilakis (2001),interference,#B50000,Pure
4.81981981981982,-0.04673099085617042,Vass01,Vassilakis (2001),interference,#B50000,Pure
4.834834834834835,-0.046306981057787036,Vass01,Vassilakis (2001),interference,#B50000,Pure
4.84984984984985,-0.045886017123056934,Vass01,Vassilakis (2001),interference,#B50000,Pure
4.864864864864865,-0.04546808848572361,Vass01,Vassilakis (2001),interference,#B50000,Pure
4.87987987987988,-0.04505318442380362,Vass01,Vassilakis (2001),interference,#B50000,Pure
4.894894894894895,-0.04464129406397371,Vass01,Vassilakis (2001),interference,#B50000,Pure
4.90990990990991,-0.0442324063858864,Vass01,Vassilakis (2001),interference,#B50000,Pure
4.924924924924925,-0.04382651022641815,Vass01,Vassilakis (2001),interference,#B50000,Pure
4.93993993993994,-0.04342359428385393,Vass01,Vassilakis (2001),interference,#B50000,Pure
4.954954954954955,-0.043023647122004204,Vass01,Vassilakis (2001),interference,#B50000,Pure
4.96996996996997,-0.04262665717425503,Vass01,Vassilakis (2001),interference,#B50000,Pure
4.984984984984985,-0.042232612747559316,Vass01,Vassilakis (2001),interference,#B50000,Pure
5,-0.04184150202635856,Vass01,Vassilakis (2001),interference,#B50000,Pure
5.015015015015015,-0.04145331307644758,Vass01,Vassilakis (2001),interference,#B50000,Pure
5.03003003003003,-0.04106803384877409,Vass01,Vassilakis (2001),interference,#B50000,Pure
5.045045045045045,-0.04068565218317652,Vass01,Vassilakis (2001),interference,#B50000,Pure
5.06006006006006,-0.04030615581206614,Vass01,Vassilakis (2001),interference,#B50000,Pure
5.075075075075075,-0.03992953236404335,Vass01,Vassilakis (2001),interference,#B50000,Pure
5.09009009009009,-0.03955576936746121,Vass01,Vassilakis (2001),interference,#B50000,Pure
5.105105105105105,-0.03918485425392649,Vass01,Vassilakis (2001),interference,#B50000,Pure
5.12012012012012,-0.03881677436174433,Vass01,Vassilakis (2001),interference,#B50000,Pure
5.135135135135135,-0.03845151693930848,Vass01,Vassilakis (2001),interference,#B50000,Pure
5.15015015015015,-0.038089069148432846,Vass01,Vassilakis (2001),interference,#B50000,Pure
5.165165165165165,-0.0377294180676281,Vass01,Vassilakis (2001),interference,#B50000,Pure
5.18018018018018,-0.03737255069532593,Vass01,Vassilakis (2001),interference,#B50000,Pure
5.195195195195195,-0.03701845395304607,Vass01,Vassilakis (2001),interference,#B50000,Pure
5.21021021021021,-0.03666711468851336,Vass01,Vassilakis (2001),interference,#B50000,Pure
5.225225225225225,-0.03631851967872029,Vass01,Vassilakis (2001),interference,#B50000,Pure
5.24024024024024,-0.03597265563293641,Vass01,Vassilakis (2001),interference,#B50000,Pure
5.255255255255255,-0.03562950919567091,Vass01,Vassilakis (2001),interference,#B50000,Pure
5.27027027027027,-0.03528906694957999,Vass01,Vassilakis (2001),interference,#B50000,Pure
5.285285285285285,-0.034951315418325954,Vass01,Vassilakis (2001),interference,#B50000,Pure
5.3003003003003,-0.034616241069388494,Vass01,Vassilakis (2001),interference,#B50000,Pure
5.315315315315315,-0.034283830316824054,Vass01,Vassilakis (2001),interference,#B50000,Pure
5.33033033033033,-0.033954069523980904,Vass01,Vassilakis (2001),interference,#B50000,Pure
5.345345345345345,-0.033626945006163894,Vass01,Vassilakis (2001),interference,#B50000,Pure
5.36036036036036,-0.03330244303325215,Vass01,Vassilakis (2001),interference,#B50000,Pure
5.375375375375375,-0.03298054983227378,Vass01,Vassilakis (2001),interference,#B50000,Pure
5.39039039039039,-0.03266125158993195,Vass01,Vassilakis (2001),interference,#B50000,Pure
5.405405405405405,-0.0323445344550854,Vass01,Vassilakis (2001),interference,#B50000,Pure
5.42042042042042,-0.03203038454118843,Vass01,Vassilakis (2001),interference,#B50000,Pure
5.435435435435435,-0.031718787928681616,Vass01,Vassilakis (2001),interference,#B50000,Pure
5.45045045045045,-0.031409730667344427,Vass01,Vassilakis (2001),interference,#B50000,Pure
5.465465465465465,-0.03110319877860127,Vass01,Vassilakis (2001),interference,#B50000,Pure
5.48048048048048,-0.03079917825778641,Vass01,Vassilakis (2001),interference,#B50000,Pure
5.495495495495495,-0.030497655076368844,Vass01,Vassilakis (2001),interference,#B50000,Pure
5.51051051051051,-0.03019859535044423,Vass01,Vassilakis (2001),interference,#B50000,Pure
5.525525525525525,-0.029902024841616633,Vass01,Vassilakis (2001),interference,#B50000,Pure
5.54054054054054,-0.029607909464080477,Vass01,Vassilakis (2001),interference,#B50000,Pure
5.555555555555555,-0.029316235115261845,Vass01,Vassilakis (2001),interference,#B50000,Pure
5.57057057057057,-0.029026987679232466,Vass01,Vassilakis (2001),interference,#B50000,Pure
5.585585585585585,-0.028740153028696435,Vass01,Vassilakis (2001),interference,#B50000,Pure
5.6006006006006,-0.028455717026936188,Vass01,Vassilakis (2001),interference,#B50000,Pure
5.615615615615615,-0.028173665529721788,Vass01,Vassilakis (2001),interference,#B50000,Pure
5.63063063063063,-0.02789398438718551,Vass01,Vassilakis (2001),interference,#B50000,Pure
5.645645645645645,-0.02761665944565601,Vass01,Vassilakis (2001),interference,#B50000,Pure
5.66066066066066,-0.027341676549460896,Vass01,Vassilakis (2001),interference,#B50000,Pure
5.675675675675675,-0.02706902154269069,Vass01,Vassilakis (2001),interference,#B50000,Pure
5.6906906906906904,-0.02679868027092854,Vass01,Vassilakis (2001),interference,#B50000,Pure
5.7057057057057055,-0.026530638582946967,Vass01,Vassilakis (2001),interference,#B50000,Pure
5.7207207207207205,-0.026264882332369215,Vass01,Vassilakis (2001),interference,#B50000,Pure
5.7357357357357355,-0.026001397379296368,Vass01,Vassilakis (2001),interference,#B50000,Pure
5.7507507507507505,-0.025740169591904415,Vass01,Vassilakis (2001),interference,#B50000,Pure
5.7657657657657655,-0.02548118484800428,Vass01,Vassilakis (2001),interference,#B50000,Pure
5.7807807807807805,-0.0252244290365744,Vass01,Vassilakis (2001),interference,#B50000,Pure
5.7957957957957955,-0.024969888059258184,Vass01,Vassilakis (2001),interference,#B50000,Pure
5.8108108108108105,-0.024717547831830763,Vass01,Vassilakis (2001),interference,#B50000,Pure
5.8258258258258255,-0.02446739428563717,Vass01,Vassilakis (2001),interference,#B50000,Pure
5.8408408408408405,-0.02421941336899728,Vass01,Vassilakis (2001),interference,#B50000,Pure
5.8558558558558556,-0.023973591048581558,Vass01,Vassilakis (2001),interference,#B50000,Pure
5.870870870870871,-0.023729913310759312,Vass01,Vassilakis (2001),interference,#B50000,Pure
5.885885885885886,-0.02348836616291411,Vass01,Vassilakis (2001),interference,#B50000,Pure
5.900900900900901,-0.0232489356347343,Vass01,Vassilakis (2001),interference,#B50000,Pure
5.915915915915916,-0.023011607779472684,Vass01,Vassilakis (2001),interference,#B50000,Pure
5.930930930930931,-0.02277636867517853,Vass01,Vassilakis (2001),interference,#B50000,Pure
5.945945945945946,-0.022543204425903712,Vass01,Vassilakis (2001),interference,#B50000,Pure
5.960960960960961,-0.022312101162880335,Vass01,Vassilakis (2001),interference,#B50000,Pure
5.975975975975976,-0.022083045045670963,Vass01,Vassilakis (2001),interference,#B50000,Pure
5.990990990990991,-0.021856022263295156,Vass01,Vassilakis (2001),interference,#B50000,Pure
6.006006006006006,-0.02163101903532685,Vass01,Vassilakis (2001),interference,#B50000,Pure
6.021021021021021,-0.021408021612969078,Vass01,Vassilakis (2001),interference,#B50000,Pure
6.036036036036036,-0.021187016280101445,Vass01,Vassilakis (2001),interference,#B50000,Pure
6.051051051051051,-0.02096798935430309,Vass01,Vassilakis (2001),interference,#B50000,Pure
6.066066066066066,-0.02075092718785271,Vass01,Vassilakis (2001),interference,#B50000,Pure
6.081081081081081,-0.020535816168702693,Vass01,Vassilakis (2001),interference,#B50000,Pure
6.096096096096096,-0.020322642721429526,Vass01,Vassilakis (2001),interference,#B50000,Pure
6.111111111111111,-0.020111393308163222,Vass01,Vassilakis (2001),interference,#B50000,Pure
6.126126126126126,-0.019902054429489793,Vass01,Vassilakis (2001),interference,#B50000,Pure
6.141141141141141,-0.019694612625335006,Vass01,Vassilakis (2001),interference,#B50000,Pure
6.156156156156156,-0.019489054475823147,Vass01,Vassilakis (2001),interference,#B50000,Pure
6.171171171171171,-0.019285366602113985,Vass01,Vassilakis (2001),interference,#B50000,Pure
6.186186186186186,-0.0190835356672199,Vass01,Vassilakis (2001),interference,#B50000,Pure
6.201201201201201,-0.018883548376799675,Vass01,Vassilakis (2001),interference,#B50000,Pure
6.216216216216216,-0.01868539147993147,Vass01,Vassilakis (2001),interference,#B50000,Pure
6.231231231231231,-0.018489051769866784,Vass01,Vassilakis (2001),interference,#B50000,Pure
6.246246246246246,-0.018294516084761365,Vass01,Vassilakis (2001),interference,#B50000,Pure
6.261261261261261,-0.018101771308388817,Vass01,Vassilakis (2001),interference,#B50000,Pure
6.276276276276276,-0.017910804370832475,Vass01,Vassilakis (2001),interference,#B50000,Pure
6.291291291291291,-0.017721602249157826,Vass01,Vassilakis (2001),interference,#B50000,Pure
6.306306306306306,-0.01753415196806751,Vass01,Vassilakis (2001),interference,#B50000,Pure
6.321321321321321,-0.017348440600535774,Vass01,Vassilakis (2001),interference,#B50000,Pure
6.336336336336336,-0.01716445526842426,Vass01,Vassilakis (2001),interference,#B50000,Pure
6.351351351351351,-0.016982183143081604,Vass01,Vassilakis (2001),interference,#B50000,Pure
6.366366366366366,-0.01680161144592184,Vass01,Vassilakis (2001),interference,#B50000,Pure
6.381381381381381,-0.01662272744898826,Vass01,Vassilakis (2001),interference,#B50000,Pure
6.396396396396396,-0.016445518475497897,Vass01,Vassilakis (2001),interference,#B50000,Pure
6.411411411411412,-0.016269971900368742,Vass01,Vassilakis (2001),interference,#B50000,Pure
6.426426426426427,-0.016096075150732032,Vass01,Vassilakis (2001),interference,#B50000,Pure
6.441441441441442,-0.015923815706425763,Vass01,Vassilakis (2001),interference,#B50000,Pure
6.456456456456457,-0.0157531811004724,Vass01,Vassilakis (2001),interference,#B50000,Pure
6.471471471471472,-0.015584158919542188,Vass01,Vassilakis (2001),interference,#B50000,Pure
6.486486486486487,-0.015416736804397679,Vass01,Vassilakis (2001),interference,#B50000,Pure
6.501501501501502,-0.015250891458350548,Vass01,Vassilakis (2001),interference,#B50000,Pure
6.516516516516517,-0.015086632720099646,Vass01,Vassilakis (2001),interference,#B50000,Pure
6.531531531531532,-0.014923937297901873,Vass01,Vassilakis (2001),interference,#B50000,Pure
6.546546546546547,-0.014762793053051117,Vass01,Vassilakis (2001),interference,#B50000,Pure
6.561561561561562,-0.014603187902937105,Vass01,Vassilakis (2001),interference,#B50000,Pure
6.576576576576577,-0.014445109821401568,Vass01,Vassilakis (2001),interference,#B50000,Pure
6.591591591591592,-0.01428854683908176,Vass01,Vassilakis (2001),interference,#B50000,Pure
6.606606606606607,-0.014133487043738686,Vass01,Vassilakis (2001),interference,#B50000,Pure
6.621621621621622,-0.013979918580571822,Vass01,Vassilakis (2001),interference,#B50000,Pure
6.636636636636637,-0.013827829652521915,Vass01,Vassilakis (2001),interference,#B50000,Pure
6.651651651651652,-0.013677208520558523,Vass01,Vassilakis (2001),interference,#B50000,Pure
6.666666666666667,-0.01352804350395672,Vass01,Vassilakis (2001),interference,#B50000,Pure
6.681681681681682,-0.013380322980559666,Vass01,Vassilakis (2001),interference,#B50000,Pure
6.696696696696697,-0.013234035387028784,Vass01,Vassilakis (2001),interference,#B50000,Pure
6.711711711711712,-0.013089169219082975,Vass01,Vassilakis (2001),interference,#B50000,Pure
6.726726726726727,-0.012945713031724334,Vass01,Vassilakis (2001),interference,#B50000,Pure
6.741741741741742,-0.01280365543945239,Vass01,Vassilakis (2001),interference,#B50000,Pure
6.756756756756757,-0.012662985116467695,Vass01,Vassilakis (2001),interference,#B50000,Pure
6.771771771771772,-0.012523690796862275,Vass01,Vassilakis (2001),interference,#B50000,Pure
6.786786786786787,-0.012385761274800657,Vass01,Vassilakis (2001),interference,#B50000,Pure
6.801801801801802,-0.01224918540468877,Vass01,Vassilakis (2001),interference,#B50000,Pure
6.816816816816817,-0.012113952101331933,Vass01,Vassilakis (2001),interference,#B50000,Pure
6.831831831831832,-0.011980050340083169,Vass01,Vassilakis (2001),interference,#B50000,Pure
6.846846846846847,-0.011847469156980433,Vass01,Vassilakis (2001),interference,#B50000,Pure
6.861861861861862,-0.011716197648873121,Vass01,Vassilakis (2001),interference,#B50000,Pure
6.876876876876877,-0.011586224973540147,Vass01,Vassilakis (2001),interference,#B50000,Pure
6.891891891891892,-0.011457540349795941,Vass01,Vassilakis (2001),interference,#B50000,Pure
6.906906906906907,-0.011330133057588936,Vass01,Vassilakis (2001),interference,#B50000,Pure
6.921921921921922,-0.011203992438089162,Vass01,Vassilakis (2001),interference,#B50000,Pure
6.936936936936937,-0.011079107893766618,Vass01,Vassilakis (2001),interference,#B50000,Pure
6.951951951951952,-0.010955468888461368,Vass01,Vassilakis (2001),interference,#B50000,Pure
6.966966966966967,-0.010833064947443854,Vass01,Vassilakis (2001),interference,#B50000,Pure
6.981981981981982,-0.010711885657466322,Vass01,Vassilakis (2001),interference,#B50000,Pure
6.996996996996997,-0.010591920666806616,Vass01,Vassilakis (2001),interference,#B50000,Pure
7.012012012012012,-0.010473159685302037,Vass01,Vassilakis (2001),interference,#B50000,Pure
7.027027027027027,-0.01035559248437643,Vass01,Vassilakis (2001),interference,#B50000,Pure
7.042042042042042,-0.010239208897057974,Vass01,Vassilakis (2001),interference,#B50000,Pure
7.057057057057057,-0.01012399881798929,Vass01,Vassilakis (2001),interference,#B50000,Pure
7.072072072072072,-0.010009952203430204,Vass01,Vassilakis (2001),interference,#B50000,Pure
7.087087087087087,-0.009897059071252356,Vass01,Vassilakis (2001),interference,#B50000,Pure
7.102102102102102,-0.009785309500926017,Vass01,Vassilakis (2001),interference,#B50000,Pure
7.117117117117117,-0.009674693633500714,Vass01,Vassilakis (2001),interference,#B50000,Pure
7.132132132132132,-0.009565201671576932,Vass01,Vassilakis (2001),interference,#B50000,Pure
7.147147147147147,-0.009456823879272495,Vass01,Vassilakis (2001),interference,#B50000,Pure
7.162162162162162,-0.009349550582180875,Vass01,Vassilakis (2001),interference,#B50000,Pure
7.177177177177177,-0.009243372167322714,Vass01,Vassilakis (2001),interference,#B50000,Pure
7.192192192192192,-0.009138279083091653,Vass01,Vassilakis (2001),interference,#B50000,Pure
7.207207207207207,-0.009034261839192764,Vass01,Vassilakis (2001),interference,#B50000,Pure
7.222222222222222,-0.008931311006574617,Vass01,Vassilakis (2001),interference,#B50000,Pure
7.237237237237237,-0.008829417217356065,Vass01,Vassilakis (2001),interference,#B50000,Pure
7.252252252252252,-0.008728571164745515,Vass01,Vassilakis (2001),interference,#B50000,Pure
7.267267267267267,-0.008628763602955643,Vass01,Vassilakis (2001),interference,#B50000,Pure
7.282282282282282,-0.008529985347111383,Vass01,Vassilakis (2001),interference,#B50000,Pure
7.297297297297297,-0.008432227273152144,Vass01,Vassilakis (2001),interference,#B50000,Pure
7.312312312312312,-0.008335480317729333,Vass01,Vassilakis (2001),interference,#B50000,Pure
7.327327327327327,-0.008239735478097504,Vass01,Vassilakis (2001),interference,#B50000,Pure
7.342342342342342,-0.008144983812000342,Vass01,Vassilakis (2001),interference,#B50000,Pure
7.357357357357357,-0.008051216437552149,Vass01,Vassilakis (2001),interference,#B50000,Pure
7.372372372372372,-0.007958424533113025,Vass01,Vassilakis (2001),interference,#B50000,Pure
7.387387387387387,-0.007866599337160328,Vass01,Vassilakis (2001),interference,#B50000,Pure
7.402402402402402,-0.00777573214815442,Vass01,Vassilakis (2001),interference,#B50000,Pure
7.4174174174174174,-0.0076858143243997215,Vass01,Vassilakis (2001),interference,#B50000,Pure
7.4324324324324325,-0.007596837283901734,Vass01,Vassilakis (2001),interference,#B50000,Pure
7.4474474474474475,-0.007508792504218959,Vass01,Vassilakis (2001),interference,#B50000,Pure
7.4624624624624625,-0.007421671522310341,Vass01,Vassilakis (2001),interference,#B50000,Pure
7.4774774774774775,-0.007335465934379116,Vass01,Vassilakis (2001),interference,#B50000,Pure
7.4924924924924925,-0.0072501673957113995,Vass01,Vassilakis (2001),interference,#B50000,Pure
7.5075075075075075,-0.007165762029229058,Vass01,Vassilakis (2001),interference,#B50000,Pure
7.5225225225225225,-0.0070822528494885115,Vass01,Vassilakis (2001),interference,#B50000,Pure
7.5375375375375375,-0.006999626037158197,Vass01,Vassilakis (2001),interference,#B50000,Pure
7.5525525525525525,-0.006917873482171917,Vass01,Vassilakis (2001),interference,#B50000,Pure
7.5675675675675675,-0.006836987132683334,Vass01,Vassilakis (2001),interference,#B50000,Pure
7.5825825825825826,-0.006756958994881226,Vass01,Vassilakis (2001),interference,#B50000,Pure
7.597597597597598,-0.006677781132802815,Vass01,Vassilakis (2001),interference,#B50000,Pure
7.612612612612613,-0.0065994456681423945,Vass01,Vassilakis (2001),interference,#B50000,Pure
7.627627627627628,-0.006521944780057182,Vass01,Vassilakis (2001),interference,#B50000,Pure
7.642642642642643,-0.006445270704970124,Vass01,Vassilakis (2001),interference,#B50000,Pure
7.657657657657658,-0.006369415736369273,Vass01,Vassilakis (2001),interference,#B50000,Pure
7.672672672672673,-0.006294372224603795,Vass01,Vassilakis (2001),interference,#B50000,Pure
7.687687687687688,-0.006220132576678021,Vass01,Vassilakis (2001),interference,#B50000,Pure
7.702702702702703,-0.006146689256041331,Vass01,Vassilakis (2001),interference,#B50000,Pure
7.717717717717718,-0.006074034782376299,Vass01,Vassilakis (2001),interference,#B50000,Pure
7.732732732732733,-0.006002161731383625,Vass01,Vassilakis (2001),interference,#B50000,Pure
7.747747747747748,-0.005931062734564229,Vass01,Vassilakis (2001),interference,#B50000,Pure
7.762762762762763,-0.0058607304789994414,Vass01,Vassilakis (2001),interference,#B50000,Pure
7.777777777777778,-0.0057911577071281545,Vass01,Vassilakis (2001),interference,#B50000,Pure
7.792792792792793,-0.005722337216521583,Vass01,Vassilakis (2001),interference,#B50000,Pure
7.807807807807808,-0.005654261859656256,Vass01,Vassilakis (2001),interference,#B50000,Pure
7.822822822822823,-0.005586924543683937,Vass01,Vassilakis (2001),interference,#B50000,Pure
7.837837837837838,-0.005520318230200186,Vass01,Vassilakis (2001),interference,#B50000,Pure
7.852852852852853,-0.0054544359350102885,Vass01,Vassilakis (2001),interference,#B50000,Pure
7.867867867867868,-0.005389270727893028,Vass01,Vassilakis (2001),interference,#B50000,Pure
7.882882882882883,-0.005324815732363275,Vass01,Vassilakis (2001),interference,#B50000,Pure
7.897897897897898,-0.005261064125431861,Vass01,Vassilakis (2001),interference,#B50000,Pure
7.912912912912913,-0.0051980091373638095,Vass01,Vassilakis (2001),interference,#B50000,Pure
7.927927927927928,-0.005135644051435362,Vass01,Vassilakis (2001),interference,#B50000,Pure
7.942942942942943,-0.005073962203688401,Vass01,Vassilakis (2001),interference,#B50000,Pure
7.957957957957958,-0.00501295698268412,Vass01,Vassilakis (2001),interference,#B50000,Pure
7.972972972972973,-0.004952621829254651,Vass01,Vassilakis (2001),interference,#B50000,Pure
7.987987987987988,-0.004892950236252969,Vass01,Vassilakis (2001),interference,#B50000,Pure
8.003003003003004,-0.004833935748302123,Vass01,Vassilakis (2001),interference,#B50000,Pure
8.018018018018019,-0.0047755719615424,Vass01,Vassilakis (2001),interference,#B50000,Pure
8.033033033033034,-0.004717852523377221,Vass01,Vassilakis (2001),interference,#B50000,Pure
8.048048048048049,-0.004660771132218364,Vass01,Vassilakis (2001),interference,#B50000,Pure
8.063063063063064,-0.004604321537229117,Vass01,Vassilakis (2001),interference,#B50000,Pure
8.078078078078079,-0.0045484975380671025,Vass01,Vassilakis (2001),interference,#B50000,Pure
8.093093093093094,-0.004493292984625453,Vass01,Vassilakis (2001),interference,#B50000,Pure
8.108108108108109,-0.0044387017767730085,Vass01,Vassilakis (2001),interference,#B50000,Pure
8.123123123123124,-0.004384717864093902,Vass01,Vassilakis (2001),interference,#B50000,Pure
8.138138138138139,-0.004331335245625857,Vass01,Vassilakis (2001),interference,#B50000,Pure
8.153153153153154,-0.004278547969597507,Vass01,Vassilakis (2001),interference,#B50000,Pure
8.168168168168169,-0.0042263501331654425,Vass01,Vassilakis (2001),interference,#B50000,Pure
8.183183183183184,-0.004174735882149678,Vass01,Vassilakis (2001),interference,#B50000,Pure
8.198198198198199,-0.004123699410769214,Vass01,Vassilakis (2001),interference,#B50000,Pure
8.213213213213214,-0.0040732349613763095,Vass01,Vassilakis (2001),interference,#B50000,Pure
8.228228228228229,-0.004023336824190216,Vass01,Vassilakis (2001),interference,#B50000,Pure
8.243243243243244,-0.003973999337030676,Vass01,Vassilakis (2001),interference,#B50000,Pure
8.258258258258259,-0.003925216885050504,Vass01,Vassilakis (2001),interference,#B50000,Pure
8.273273273273274,-0.003876983900467622,Vass01,Vassilakis (2001),interference,#B50000,Pure
8.288288288288289,-0.003829294862297113,Vass01,Vassilakis (2001),interference,#B50000,Pure
8.303303303303304,-0.0037821442960822033,Vass01,Vassilakis (2001),interference,#B50000,Pure
8.318318318318319,-0.003735526773625499,Vass01,Vassilakis (2001),interference,#B50000,Pure
8.333333333333334,-0.0036894369127194425,Vass01,Vassilakis (2001),interference,#B50000,Pure
8.348348348348349,-0.0036438693768765422,Vass01,Vassilakis (2001),interference,#B50000,Pure
8.363363363363364,-0.0035988188750596733,Vass01,Vassilakis (2001),interference,#B50000,Pure
8.378378378378379,-0.003554280161411816,Vass01,Vassilakis (2001),interference,#B50000,Pure
8.393393393393394,-0.003510248034985562,Vass01,Vassilakis (2001),interference,#B50000,Pure
8.408408408408409,-0.003466717339473013,Vass01,Vassilakis (2001),interference,#B50000,Pure
8.423423423423424,-0.003423682962934809,Vass01,Vassilakis (2001),interference,#B50000,Pure
8.438438438438439,-0.0033811398375298528,Vass01,Vassilakis (2001),interference,#B50000,Pure
8.453453453453454,-0.0033390829392444905,Vass01,Vassilakis (2001),interference,#B50000,Pure
8.468468468468469,-0.00329750728762173,Vass01,Vassilakis (2001),interference,#B50000,Pure
8.483483483483484,-0.0032564079454908933,Vass01,Vassilakis (2001),interference,#B50000,Pure
8.498498498498499,-0.0032157800186969096,Vass01,Vassilakis (2001),interference,#B50000,Pure
8.513513513513514,-0.0031756159965110006,Vass01,Vassilakis (2001),interference,#B50000,Pure
8.528528528528529,-0.0031359164192294904,Vass01,Vassilakis (2001),interference,#B50000,Pure
8.543543543543544,-0.0030966738298935756,Vass01,Vassilakis (2001),interference,#B50000,Pure
8.558558558558559,-0.0030578835037104518,Vass01,Vassilakis (2001),interference,#B50000,Pure
8.573573573573574,-0.003019540757552583,Vass01,Vassilakis (2001),interference,#B50000,Pure
8.588588588588589,-0.002981640949687868,Vass01,Vassilakis (2001),interference,#B50000,Pure
8.603603603603604,-0.0029441794795107648,Vass01,Vassilakis (2001),interference,#B50000,Pure
8.618618618618619,-0.0029071517872733153,Vass01,Vassilakis (2001),interference,#B50000,Pure
8.633633633633634,-0.002870553353816507,Vass01,Vassilakis (2001),interference,#B50000,Pure
8.64864864864865,-0.0028343797003023514,Vass01,Vassilakis (2001),interference,#B50000,Pure
8.663663663663664,-0.00279862638794603,Vass01,Vassilakis (2001),interference,#B50000,Pure
8.67867867867868,-0.002763289017748435,Vass01,Vassilakis (2001),interference,#B50000,Pure
8.693693693693694,-0.0027283632302295495,Vass01,Vassilakis (2001),interference,#B50000,Pure
8.70870870870871,-0.0026938447051617206,Vass01,Vassilakis (2001),interference,#B50000,Pure
8.723723723723724,-0.0026597291613039923,Vass01,Vassilakis (2001),interference,#B50000,Pure
8.73873873873874,-0.0026260123561366016,Vass01,Vassilakis (2001),interference,#B50000,Pure
8.753753753753754,-0.002592690085595986,Vass01,Vassilakis (2001),interference,#B50000,Pure
8.76876876876877,-0.00255975818381072,Vass01,Vassilakis (2001),interference,#B50000,Pure
8.783783783783784,-0.0025272125228376343,Vass01,Vassilakis (2001),interference,#B50000,Pure
8.7987987987988,-0.002495049012398667,Vass01,Vassilakis (2001),interference,#B50000,Pure
8.813813813813814,-0.002463263599618558,Vass01,Vassilakis (2001),interference,#B50000,Pure
8.82882882882883,-0.0024318522687627737,Vass01,Vassilakis (2001),interference,#B50000,Pure
8.843843843843844,-0.002400811040976541,Vass01,Vassilakis (2001),interference,#B50000,Pure
8.85885885885886,-0.002370135974024296,Vass01,Vassilakis (2001),interference,#B50000,Pure
8.873873873873874,-0.0023398231620297776,Vass01,Vassilakis (2001),interference,#B50000,Pure
8.88888888888889,-0.002309868735217174,Vass01,Vassilakis (2001),interference,#B50000,Pure
8.903903903903904,-0.0022802688596527125,Vass01,Vassilakis (2001),interference,#B50000,Pure
8.91891891891892,-0.002251019736987019,Vass01,Vassilakis (2001),interference,#B50000,Pure
8.933933933933934,-0.002222117604198534,Vass01,Vassilakis (2001),interference,#B50000,Pure
8.94894894894895,-0.0021935587333373214,Vass01,Vassilakis (2001),interference,#B50000,Pure
8.963963963963964,-0.002165339431270072,Vass01,Vassilakis (2001),interference,#B50000,Pure
8.97897897897898,-0.0021374560394256756,Vass01,Vassilakis (2001),interference,#B50000,Pure
8.993993993993994,-0.002109904933541642,Vass01,Vassilakis (2001),interference,#B50000,Pure
9.00900900900901,-0.002082682523411585,Vass01,Vassilakis (2001),interference,#B50000,Pure
9.024024024024024,-0.0020557852526334034,Vass01,Vassilakis (2001),interference,#B50000,Pure
9.03903903903904,-0.002029209598358262,Vass01,Vassilakis (2001),interference,#B50000,Pure
9.054054054054054,-0.0020029520710407953,Vass01,Vassilakis (2001),interference,#B50000,Pure
9.06906906906907,-0.001977009214189818,Vass01,Vassilakis (2001),interference,#B50000,Pure
9.084084084084084,-0.0019513776041203414,Vass01,Vassilakis (2001),interference,#B50000,Pure
9.0990990990991,-0.0019260538497062674,Vass01,Vassilakis (2001),interference,#B50000,Pure
9.114114114114114,-0.0019010345921340345,Vass01,Vassilakis (2001),interference,#B50000,Pure
9.12912912912913,-0.001876316504657458,Vass01,Vassilakis (2001),interference,#B50000,Pure
9.144144144144144,-0.0018518962923533254,Vass01,Vassilakis (2001),interference,#B50000,Pure
9.15915915915916,-0.0018277706918779463,Vass01,Vassilakis (2001),interference,#B50000,Pure
9.174174174174174,-0.0018039364712249958,Vass01,Vassilakis (2001),interference,#B50000,Pure
9.18918918918919,-0.0017803904294839152,Vass01,Vassilakis (2001),interference,#B50000,Pure
9.204204204204204,-0.0017571293965997802,Vass01,Vassilakis (2001),interference,#B50000,Pure
9.21921921921922,-0.001734150233133904,Vass01,Vassilakis (2001),interference,#B50000,Pure
9.234234234234235,-0.0017114498300254812,Vass01,Vassilakis (2001),interference,#B50000,Pure
9.24924924924925,-0.00168902510835449,Vass01,Vassilakis (2001),interference,#B50000,Pure
9.264264264264265,-0.0016668730191054452,Vass01,Vassilakis (2001),interference,#B50000,Pure
9.27927927927928,-0.0016449905429322179,Vass01,Vassilakis (2001),interference,#B50000,Pure
9.294294294294295,-0.0016233746899241095,Vass01,Vassilakis (2001),interference,#B50000,Pure
9.30930930930931,-0.0016020224993727363,Vass01,Vassilakis (2001),interference,#B50000,Pure
9.324324324324325,-0.0015809310395402607,Vass01,Vassilakis (2001),interference,#B50000,Pure
9.33933933933934,-0.0015600974074285528,Vass01,Vassilakis (2001),interference,#B50000,Pure
9.354354354354355,-0.0015395187285494102,Vass01,Vassilakis (2001),interference,#B50000,Pure
9.36936936936937,-0.0015191921566961061,Vass01,Vassilakis (2001),interference,#B50000,Pure
9.384384384384385,-0.0014991148737158362,Vass01,Vassilakis (2001),interference,#B50000,Pure
9.3993993993994,-0.0014792840892833053,Vass01,Vassilakis (2001),interference,#B50000,Pure
9.414414414414415,-0.0014596970406756293,Vass01,Vassilakis (2001),interference,#B50000,Pure
9.42942942942943,-0.0014403509925480695,Vass01,Vassilakis (2001),interference,#B50000,Pure
9.444444444444445,-0.0014212432367112016,Vass01,Vassilakis (2001),interference,#B50000,Pure
9.45945945945946,-0.0014023710919090222,Vass01,Vassilakis (2001),interference,#B50000,Pure
9.474474474474475,-0.0013837319035982284,Vass01,Vassilakis (2001),interference,#B50000,Pure
9.48948948948949,-0.00136532304372879,Vass01,Vassilakis (2001),interference,#B50000,Pure
9.504504504504505,-0.0013471407071872885,Vass01,Vassilakis (2001),interference,#B50000,Pure
9.51951951951952,-0.0013291847398423672,Vass01,Vassilakis (2001),interference,#B50000,Pure
9.534534534534535,-0.0013114513734009683,Vass01,Vassilakis (2001),interference,#B50000,Pure
9.54954954954955,-0.0012939380836154517,Vass01,Vassilakis (2001),interference,#B50000,Pure
9.564564564564565,-0.0012766423716510811,Vass01,Vassilakis (2001),interference,#B50000,Pure
9.57957957957958,-0.0012595617638735703,Vass01,Vassilakis (2001),interference,#B50000,Pure
9.594594594594595,-0.0012426938116376683,Vass01,Vassilakis (2001),interference,#B50000,Pure
9.60960960960961,-0.0012260360910769322,Vass01,Vassilakis (2001),interference,#B50000,Pure
9.624624624624625,-0.001209586202894835,Vass01,Vassilakis (2001),interference,#B50000,Pure
9.63963963963964,-0.0011933417721568195,Vass01,Vassilakis (2001),interference,#B50000,Pure
9.654654654654655,-0.0011773004480837702,Vass01,Vassilakis (2001),interference,#B50000,Pure
9.66966966966967,-0.0011614599038465337,Vass01,Vassilakis (2001),interference,#B50000,Pure
9.684684684684685,-0.001145817836361615,Vass01,Vassilakis (2001),interference,#B50000,Pure
9.6996996996997,-0.0011303719660882118,Vass01,Vassilakis (2001),interference,#B50000,Pure
9.714714714714715,-0.0011151200368263105,Vass01,Vassilakis (2001),interference,#B50000,Pure
9.72972972972973,-0.001100059815515963,Vass01,Vassilakis (2001),interference,#B50000,Pure
9.744744744744745,-0.001085189092037923,Vass01,Vassilakis (2001),interference,#B50000,Pure
9.75975975975976,-0.0010705056790152568,Vass01,Vassilakis (2001),interference,#B50000,Pure
9.774774774774775,-0.0010560074116163652,Vass01,Vassilakis (2001),interference,#B50000,Pure
9.78978978978979,-0.0010416921473590638,Vass01,Vassilakis (2001),interference,#B50000,Pure
9.804804804804805,-0.0010275577659158636,Vass01,Vassilakis (2001),interference,#B50000,Pure
9.81981981981982,-0.0010136021689205778,Vass01,Vassilakis (2001),interference,#B50000,Pure
9.834834834834835,-9.998232797760066e-4,Vass01,Vassilakis (2001),interference,#B50000,Pure
9.84984984984985,-9.862190434628065e-4,Vass01,Vassilakis (2001),interference,#B50000,Pure
9.864864864864865,-9.727874263497176e-4,Vass01,Vassilakis (2001),interference,#B50000,Pure
9.87987987987988,-9.595264160047704e-4,Vass01,Vassilakis (2001),interference,#B50000,Pure
9.894894894894895,-9.46434021007909e-4,Vass01,Vassilakis (2001),interference,#B50000,Pure
9.90990990990991,-9.33508270764652e-4,Vass01,Vassilakis (2001),interference,#B50000,Pure
9.924924924924925,-9.207472153209868e-4,Vass01,Vassilakis (2001),interference,#B50000,Pure
9.93993993993994,-9.081489251795554e-4,Vass01,Vassilakis (2001),interference,#B50000,Pure
9.954954954954955,-8.957114911169088e-4,Vass01,Vassilakis (2001),interference,#B50000,Pure
9.96996996996997,-8.834330240020005e-4,Vass01,Vassilakis (2001),interference,#B50000,Pure
9.984984984984985,-8.713116546159354e-4,Vass01,Vassilakis (2001),interference,#B50000,Pure
10,-8.593455334727884e-4,Vass01,Vassilakis (2001),interference,#B50000,Pure
10.015015015015015,-8.475328306417479e-4,Vass01,Vassilakis (2001),interference,#B50000,Pure
10.03003003003003,-8.358717355703514e-4,Vass01,Vassilakis (2001),interference,#B50000,Pure
10.045045045045045,-8.243604569089061e-4,Vass01,Vassilakis (2001),interference,#B50000,Pure
10.06006006006006,-8.129972223362053e-4,Vass01,Vassilakis (2001),interference,#B50000,Pure
10.075075075075075,-8.017802783862501e-4,Vass01,Vassilakis (2001),interference,#B50000,Pure
10.09009009009009,-7.907078902763427e-4,Vass01,Vassilakis (2001),interference,#B50000,Pure
10.105105105105105,-7.797783417362296e-4,Vass01,Vassilakis (2001),interference,#B50000,Pure
10.12012012012012,-7.689899348384095e-4,Vass01,Vassilakis (2001),interference,#B50000,Pure
10.135135135135135,-7.583409898297537e-4,Vass01,Vassilakis (2001),interference,#B50000,Pure
10.15015015015015,-7.478298449641412e-4,Vass01,Vassilakis (2001),interference,#B50000,Pure
10.165165165165165,-7.374548563363371e-4,Vass01,Vassilakis (2001),interference,#B50000,Pure
10.18018018018018,-7.27214397717065e-4,Vass01,Vassilakis (2001),interference,#B50000,Pure
10.195195195195195,-7.171068603891427e-4,Vass01,Vassilakis (2001),interference,#B50000,Pure
10.21021021021021,-7.071306529849064e-4,Vass01,Vassilakis (2001),interference,#B50000,Pure
10.225225225225225,-6.972842013246946e-4,Vass01,Vassilakis (2001),interference,#B50000,Pure
10.24024024024024,-6.875659482564904e-4,Vass01,Vassilakis (2001),interference,#B50000,Pure
10.255255255255255,-6.779743534967959e-4,Vass01,Vassilakis (2001),interference,#B50000,Pure
10.27027027027027,-6.685078934725758e-4,Vass01,Vassilakis (2001),interference,#B50000,Pure
10.285285285285285,-6.591650611643511e-4,Vass01,Vassilakis (2001),interference,#B50000,Pure
10.3003003003003,-6.499443659504876e-4,Vass01,Vassilakis (2001),interference,#B50000,Pure
10.315315315315315,-6.408443334525483e-4,Vass01,Vassilakis (2001),interference,#B50000,Pure
10.33033033033033,-6.318635053818581e-4,Vass01,Vassilakis (2001),interference,#B50000,Pure
10.345345345345345,-6.230004393871355e-4,Vass01,Vassilakis (2001),interference,#B50000,Pure
10.36036036036036,-6.142537089032585e-4,Vass01,Vassilakis (2001),interference,#B50000,Pure
10.375375375375375,-6.056219030012007e-4,Vass01,Vassilakis (2001),interference,#B50000,Pure
10.39039039039039,-5.971036262390471e-4,Vass01,Vassilakis (2001),interference,#B50000,Pure
10.405405405405405,-5.886974985140957e-4,Vass01,Vassilakis (2001),interference,#B50000,Pure
10.42042042042042,-5.804021549161638e-4,Vass01,Vassilakis (2001),interference,#B50000,Pure
10.435435435435435,-5.722162455818809e-4,Vass01,Vassilakis (2001),interference,#B50000,Pure
10.45045045045045,-5.641384355502041e-4,Vass01,Vassilakis (2001),interference,#B50000,Pure
10.465465465465465,-5.561674046189454e-4,Vass01,Vassilakis (2001),interference,#B50000,Pure
10.48048048048048,-5.483018472024081e-4,Vass01,Vassilakis (2001),interference,#B50000,Pure
10.495495495495495,-5.405404721901627e-4,Vass01,Vassilakis (2001),interference,#B50000,Pure
10.51051051051051,-5.328814961511713e-4,Vass01,Vassilakis (2001),interference,#B50000,Pure
10.525525525525525,-5.253246765451312e-4,Vass01,Vassilakis (2001),interference,#B50000,Pure
10.54054054054054,-5.178682513845716e-4,Vass01,Vassilakis (2001),interference,#B50000,Pure
10.555555555555555,-5.105109860700575e-4,Vass01,Vassilakis (2001),interference,#B50000,Pure
10.57057057057057,-5.032516597872753e-4,Vass01,Vassilakis (2001),interference,#B50000,Pure
10.585585585585585,-4.960890653722763e-4,Vass01,Vassilakis (2001),interference,#B50000,Pure
10.6006006006006,-4.890220091776906e-4,Vass01,Vassilakis (2001),interference,#B50000,Pure
10.615615615615615,-4.820493109400236e-4,Vass01,Vassilakis (2001),interference,#B50000,Pure
10.63063063063063,-4.751698036480508e-4,Vass01,Vassilakis (2001),interference,#B50000,Pure
10.645645645645645,-4.683823334121577e-4,Vass01,Vassilakis (2001),interference,#B50000,Pure
10.66066066066066,-4.6168575933483273e-4,Vass01,Vassilakis (2001),interference,#B50000,Pure
10.675675675675675,-4.550789533821108e-4,Vass01,Vassilakis (2001),interference,#B50000,Pure
10.69069069069069,-4.4856080025607064e-4,Vass01,Vassilakis (2001),interference,#B50000,Pure
10.705705705705705,-4.421301972683883e-4,Vass01,Vassilakis (2001),interference,#B50000,Pure
10.72072072072072,-4.3578605421487973e-4,Vass01,Vassilakis (2001),interference,#B50000,Pure
10.735735735735735,-4.295272932510422e-4,Vass01,Vassilakis (2001),interference,#B50000,Pure
10.75075075075075,-4.233528487686717e-4,Vass01,Vassilakis (2001),interference,#B50000,Pure
10.765765765765765,-4.1726166727340964e-4,Vass01,Vassilakis (2001),interference,#B50000,Pure
10.78078078078078,-4.1125270726334915e-4,Vass01,Vassilakis (2001),interference,#B50000,Pure
10.795795795795796,-4.053249391086138e-4,Vass01,Vassilakis (2001),interference,#B50000,Pure
10.81081081081081,-3.994773449319013e-4,Vass01,Vassilakis (2001),interference,#B50000,Pure
10.825825825825826,-3.9370891849007647e-4,Vass01,Vassilakis (2001),interference,#B50000,Pure
10.84084084084084,-3.880186650566867e-4,Vass01,Vassilakis (2001),interference,#B50000,Pure
10.855855855855856,-3.824056013054643e-4,Vass01,Vassilakis (2001),interference,#B50000,Pure
10.87087087087087,-3.7686875519483764e-4,Vass01,Vassilakis (2001),interference,#B50000,Pure
10.885885885885886,-3.7140716585334357e-4,Vass01,Vassilakis (2001),interference,#B50000,Pure
10.9009009009009,-3.6601988346606455e-4,Vass01,Vassilakis (2001),interference,#B50000,Pure
10.915915915915916,-3.607059691619772e-4,Vass01,Vassilakis (2001),interference,#B50000,Pure
10.93093093093093,-3.5546449490224917e-4,Vass01,Vassilakis (2001),interference,#B50000,Pure
10.945945945945946,-3.5029454336952273e-4,Vass01,Vassilakis (2001),interference,#B50000,Pure
10.96096096096096,-3.451952078580893e-4,Vass01,Vassilakis (2001),interference,#B50000,Pure
10.975975975975976,-3.401655921650151e-4,Vass01,Vassilakis (2001),interference,#B50000,Pure
10.99099099099099,-3.352048104822167e-4,Vass01,Vassilakis (2001),interference,#B50000,Pure
11.006006006006006,-3.303119872894105e-4,Vass01,Vassilakis (2001),interference,#B50000,Pure
11.02102102102102,-3.2548625724803824e-4,Vass01,Vassilakis (2001),interference,#B50000,Pure
11.036036036036036,-3.2072676509606665e-4,Vass01,Vassilakis (2001),interference,#B50000,Pure
11.05105105105105,-3.160326655436846e-4,Vass01,Vassilakis (2001),interference,#B50000,Pure
11.066066066066066,-3.1140312316995533e-4,Vass01,Vassilakis (2001),interference,#B50000,Pure
11.08108108108108,-3.068373123203095e-4,Vass01,Vassilakis (2001),interference,#B50000,Pure
11.096096096096096,-3.0233441700494384e-4,Vass01,Vassilakis (2001),interference,#B50000,Pure
11.11111111111111,-2.9789363079814096e-4,Vass01,Vassilakis (2001),interference,#B50000,Pure
11.126126126126126,-2.9351415673840896e-4,Vass01,Vassilakis (2001),interference,#B50000,Pure
11.14114114114114,-2.891952072295528e-4,Vass01,Vassilakis (2001),interference,#B50000,Pure
11.156156156156156,-2.8493600394258406e-4,Vass01,Vassilakis (2001),interference,#B50000,Pure
11.17117117117117,-2.807357777184888e-4,Vass01,Vassilakis (2001),interference,#B50000,Pure
11.186186186186186,-2.765937684718856e-4,Vass01,Vassilakis (2001),interference,#B50000,Pure
11.2012012012012,-2.7250922509551665e-4,Vass01,Vassilakis (2001),interference,#B50000,Pure
11.216216216216216,-2.684814053655703e-4,Vass01,Vassilakis (2001),interference,#B50000,Pure
11.23123123123123,-2.645095758478971e-4,Vass01,Vassilakis (2001),interference,#B50000,Pure
11.246246246246246,-2.6059301180499664e-4,Vass01,Vassilakis (2001),interference,#B50000,Pure
11.26126126126126,-2.567309971039026e-4,Vass01,Vassilakis (2001),interference,#B50000,Pure
11.276276276276276,-2.5292282412485125e-4,Vass01,Vassilakis (2001),interference,#B50000,Pure
11.29129129129129,-2.491677936707734e-4,Vass01,Vassilakis (2001),interference,#B50000,Pure
11.306306306306306,-2.454652148776281e-4,Vass01,Vassilakis (2001),interference,#B50000,Pure
11.32132132132132,-0.00024181440512553286,Vass01,Vassilakis (2001),interference,#B50000,Pure
11.336336336336336,-2.3821468995067745e-4,Vass01,Vassilakis (2001),interference,#B50000,Pure
11.35135135135135,-2.346654029580859e-4,Vass01,Vassilakis (2001),interference,#B50000,Pure
11.366366366366366,-2.3116588573511958e-4,Vass01,Vassilakis (2001),interference,#B50000,Pure
11.381381381381381,-2.277154877658169e-4,Vass01,Vassilakis (2001),interference,#B50000,Pure
11.396396396396396,-2.243135663459876e-4,Vass01,Vassilakis (2001),interference,#B50000,Pure
11.411411411411411,-2.2095948649908324e-4,Vass01,Vassilakis (2001),interference,#B50000,Pure
11.426426426426426,-2.176526208928724e-4,Vass01,Vassilakis (2001),interference,#B50000,Pure
11.441441441441441,-2.1439234975685013e-4,Vass01,Vassilakis (2001),interference,#B50000,Pure
11.456456456456456,-2.1117806080041984e-4,Vass01,Vassilakis (2001),interference,#B50000,Pure
11.471471471471471,-2.0800914913185337e-4,Vass01,Vassilakis (2001),interference,#B50000,Pure
11.486486486486486,-2.0488501717796386e-4,Vass01,Vassilakis (2001),interference,#B50000,Pure
11.501501501501501,-2.01804870938807e-4,Vass01,Vassilakis (2001),interference,#B50000,Pure
11.516516516516516,-1.9876853745681724e-4,Vass01,Vassilakis (2001),interference,#B50000,Pure
11.531531531531531,-1.9577523405127592e-4,Vass01,Vassilakis (2001),interference,#B50000,Pure
11.546546546546546,-1.9282439163549858e-4,Vass01,Vassilakis (2001),interference,#B50000,Pure
11.561561561561561,-1.8991544805092674e-4,Vass01,Vassilakis (2001),interference,#B50000,Pure
11.576576576576576,-1.8704784799121907e-4,Vass01,Vassilakis (2001),interference,#B50000,Pure
11.591591591591591,-1.8422104292708337e-4,Vass01,Vassilakis (2001),interference,#B50000,Pure
11.606606606606606,-1.8143449103179252e-4,Vass01,Vassilakis (2001),interference,#B50000,Pure
11.621621621621621,-1.7868765710741041e-4,Vass01,Vassilakis (2001),interference,#B50000,Pure
11.636636636636636,-1.7598001251174062e-4,Vass01,Vassilakis (2001),interference,#B50000,Pure
11.651651651651651,-1.7331103508593022e-4,Vass01,Vassilakis (2001),interference,#B50000,Pure
11.666666666666666,-1.7068020908280834e-4,Vass01,Vassilakis (2001),interference,#B50000,Pure
11.681681681681681,-1.6808702509587748e-4,Vass01,Vassilakis (2001),interference,#B50000,Pure
11.696696696696696,-1.6553097998898812e-4,Vass01,Vassilakis (2001),interference,#B50000,Pure
11.711711711711711,-1.6301157682671187e-4,Vass01,Vassilakis (2001),interference,#B50000,Pure
11.726726726726726,-1.60528324805358e-4,Vass01,Vassilakis (2001),interference,#B50000,Pure
11.741741741741741,-1.5808073918466015e-4,Vass01,Vassilakis (2001),interference,#B50000,Pure
11.756756756756756,-1.5566834122014112e-4,Vass01,Vassilakis (2001),interference,#B50000,Pure
11.771771771771771,-1.532906580961008e-4,Vass01,Vassilakis (2001),interference,#B50000,Pure
11.786786786786786,-1.5094722285929037e-4,Vass01,Vassilakis (2001),interference,#B50000,Pure
11.801801801801801,-1.486375743532036e-4,Vass01,Vassilakis (2001),interference,#B50000,Pure
11.816816816816816,-1.4636125715300962e-4,Vass01,Vassilakis (2001),interference,#B50000,Pure
11.831831831831831,-1.4411782150114462e-4,Vass01,Vassilakis (2001),interference,#B50000,Pure
11.846846846846846,-1.4190682324350637e-4,Vass01,Vassilakis (2001),interference,#B50000,Pure
11.861861861861861,-1.397278237662862e-4,Vass01,Vassilakis (2001),interference,#B50000,Pure
11.876876876876876,-1.3758038993342642e-4,Vass01,Vassilakis (2001),interference,#B50000,Pure
11.891891891891891,-1.3546409402467592e-4,Vass01,Vassilakis (2001),interference,#B50000,Pure
11.906906906906906,-1.333785136742797e-4,Vass01,Vassilakis (2001),interference,#B50000,Pure
11.921921921921921,-1.313232318102586e-4,Vass01,Vassilakis (2001),interference,#B50000,Pure
11.936936936936936,-1.2929783659428425e-4,Vass01,Vassilakis (2001),interference,#B50000,Pure
11.951951951951951,-1.2730192136217473e-4,Vass01,Vassilakis (2001),interference,#B50000,Pure
11.966966966966966,-1.253350845649608e-4,Vass01,Vassilakis (2001),interference,#B50000,Pure
11.981981981981981,-1.2339692971053884e-4,Vass01,Vassilakis (2001),interference,#B50000,Pure
11.996996996996996,-1.2148706530592622e-4,Vass01,Vassilakis (2001),interference,#B50000,Pure
12.012012012012011,-1.1960510480006652e-4,Vass01,Vassilakis (2001),interference,#B50000,Pure
12.027027027027026,-1.1775066652723374e-4,Vass01,Vassilakis (2001),interference,#B50000,Pure
12.042042042042041,-1.1592337365098702e-4,Vass01,Vassilakis (2001),interference,#B50000,Pure
12.057057057057056,-1.1412285410869083e-4,Vass01,Vassilakis (2001),interference,#B50000,Pure
12.072072072072071,-1.1234874055660836e-4,Vass01,Vassilakis (2001),interference,#B50000,Pure
12.087087087087086,-1.1060067031553346e-4,Vass01,Vassilakis (2001),interference,#B50000,Pure
12.102102102102101,-1.0887828531697313e-4,Vass01,Vassilakis (2001),interference,#B50000,Pure
12.117117117117116,-1.0718123204989437e-4,Vass01,Vassilakis (2001),interference,#B50000,Pure
12.132132132132131,-1.0550916150798217e-4,Vass01,Vassilakis (2001),interference,#B50000,Pure
12.147147147147146,-1.0386172913746552e-4,Vass01,Vassilakis (2001),interference,#B50000,Pure
12.162162162162161,-1.0223859478544952e-4,Vass01,Vassilakis (2001),interference,#B50000,Pure
12.177177177177176,-1.006394226487881e-4,Vass01,Vassilakis (2001),interference,#B50000,Pure
12.192192192192191,-9.906388122347976e-5,Vass01,Vassilakis (2001),interference,#B50000,Pure
12.207207207207206,-9.751164325458093e-5,Vass01,Vassilakis (2001),interference,#B50000,Pure
12.222222222222221,-9.598238568662359e-5,Vass01,Vassilakis (2001),interference,#B50000,Pure
12.237237237237236,-9.447578961456581e-5,Vass01,Vassilakis (2001),interference,#B50000,Pure
12.252252252252251,-9.299154023522082e-5,Vass01,Vassilakis (2001),interference,#B50000,Pure
12.267267267267266,-9.152932679921106e-5,Vass01,Vassilakis (2001),interference,#B50000,Pure
12.282282282282281,-9.008884256340652e-5,Vass01,Vassilakis (2001),interference,#B50000,Pure
12.297297297297296,-8.866978474385388e-5,Vass01,Vassilakis (2001),interference,#B50000,Pure
12.312312312312311,-8.727185446920696e-5,Vass01,Vassilakis (2001),interference,#B50000,Pure
12.327327327327327,-8.589475673463204e-5,Vass01,Vassilakis (2001),interference,#B50000,Pure
12.342342342342342,-8.45382003561907e-5,Vass01,Vassilakis (2001),interference,#B50000,Pure
12.357357357357357,-8.320189792571316e-5,Vass01,Vassilakis (2001),interference,#B50000,Pure
12.372372372372372,-8.188556576612483e-5,Vass01,Vassilakis (2001),interference,#B50000,Pure
12.387387387387387,-8.0588923887259e-5,Vass01,Vassilakis (2001),interference,#B50000,Pure
12.402402402402402,-7.93116959421216e-5,Vass01,Vassilakis (2001),interference,#B50000,Pure
12.417417417417417,-7.805360918361582e-5,Vass01,Vassilakis (2001),interference,#B50000,Pure
12.432432432432432,-7.681439442173282e-5,Vass01,Vassilakis (2001),interference,#B50000,Pure
12.447447447447447,-7.55937859811852e-5,Vass01,Vassilakis (2001),interference,#B50000,Pure
12.462462462462462,-7.439152165948486e-5,Vass01,Vassilakis (2001),interference,#B50000,Pure
12.477477477477477,-7.320734268548176e-5,Vass01,Vassilakis (2001),interference,#B50000,Pure
12.492492492492492,-7.204099367832043e-5,Vass01,Vassilakis (2001),interference,#B50000,Pure
12.507507507507507,-7.089214667846585e-5,Vass01,Vassilakis (2001),interference,#B50000,Pure
12.522522522522522,-6.976070596699436e-5,Vass01,Vassilakis (2001),interference,#B50000,Pure
12.537537537537537,-6.864634900155867e-5,Vass01,Vassilakis (2001),interference,#B50000,Pure
12.552552552552552,-6.754883356105362e-5,Vass01,Vassilakis (2001),interference,#B50000,Pure
12.567567567567567,-6.646792061597862e-5,Vass01,Vassilakis (2001),interference,#B50000,Pure
12.582582582582582,-6.540337428995288e-5,Vass01,Vassilakis (2001),interference,#B50000,Pure
12.597597597597597,-6.435496182166318e-5,Vass01,Vassilakis (2001),interference,#B50000,Pure
12.612612612612612,-6.332245352721e-5,Vass01,Vassilakis (2001),interference,#B50000,Pure
12.627627627627627,-6.23056227628571e-5,Vass01,Vassilakis (2001),interference,#B50000,Pure
12.642642642642642,-6.130424588819619e-5,Vass01,Vassilakis (2001),interference,#B50000,Pure
12.657657657657657,-6.031810222969773e-5,Vass01,Vassilakis (2001),interference,#B50000,Pure
12.672672672672672,-5.9346974044656914e-5,Vass01,Vassilakis (2001),interference,#B50000,Pure
12.687687687687687,-5.839064648554173e-5,Vass01,Vassilakis (2001),interference,#B50000,Pure
12.702702702702702,-5.744890756471223e-5,Vass01,Vassilakis (2001),interference,#B50000,Pure
12.717717717717717,-5.652154811954046e-5,Vass01,Vassilakis (2001),interference,#B50000,Pure
12.732732732732732,-5.560836177789851e-5,Vass01,Vassilakis (2001),interference,#B50000,Pure
12.747747747747747,-5.4709144924024686e-5,Vass01,Vassilakis (2001),interference,#B50000,Pure
12.762762762762762,-5.382369666477242e-5,Vass01,Vassilakis (2001),interference,#B50000,Pure
12.777777777777777,-5.2951818796218844e-5,Vass01,Vassilakis (2001),interference,#B50000,Pure
12.792792792792792,-5.209331577064088e-5,Vass01,Vassilakis (2001),interference,#B50000,Pure
12.807807807807807,-5.1247994663862647e-5,Vass01,Vassilakis (2001),interference,#B50000,Pure
12.822822822822824,-5.041566514295003e-5,Vass01,Vassilakis (2001),interference,#B50000,Pure
12.837837837837839,-4.959613943427393e-5,Vass01,Vassilakis (2001),interference,#B50000,Pure
12.852852852852854,-4.878923229191731e-5,Vass01,Vassilakis (2001),interference,#B50000,Pure
12.867867867867869,-4.799476096643275e-5,Vass01,Vassilakis (2001),interference,#B50000,Pure
12.882882882882884,-4.7212545173953475e-5,Vass01,Vassilakis (2001),interference,#B50000,Pure
12.897897897897899,-4.644240706563857e-5,Vass01,Vassilakis (2001),interference,#B50000,Pure
12.912912912912914,-4.568417119746115e-5,Vass01,Vassilakis (2001),interference,#B50000,Pure
12.927927927927929,-4.493766450033572e-5,Vass01,Vassilakis (2001),interference,#B50000,Pure
12.942942942942944,-4.42027162505724e-5,Vass01,Vassilakis (2001),interference,#B50000,Pure
12.957957957957959,-4.347915804066956e-5,Vass01,Vassilakis (2001),interference,#B50000,Pure
12.972972972972974,-4.276682375042548e-5,Vass01,Vassilakis (2001),interference,#B50000,Pure
12.987987987987989,-4.206554951837643e-5,Vass01,Vassilakis (2001),interference,#B50000,Pure
13.003003003003004,-4.1375173713558684e-5,Vass01,Vassilakis (2001),interference,#B50000,Pure
13.018018018018019,-4.069553690758418e-5,Vass01,Vassilakis (2001),interference,#B50000,Pure
13.033033033033034,-4.002648184702875e-5,Vass01,Vassilakis (2001),interference,#B50000,Pure
13.048048048048049,-3.936785342613942e-5,Vass01,Vassilakis (2001),interference,#B50000,Pure
13.063063063063064,-3.871949865984019e-5,Vass01,Vassilakis (2001),interference,#B50000,Pure
13.078078078078079,-3.808126665705271e-5,Vass01,Vassilakis (2001),interference,#B50000,Pure
13.093093093093094,-3.745300859431172e-5,Vass01,Vassilakis (2001),interference,#B50000,Pure
13.108108108108109,-3.683457768968255e-5,Vass01,Vassilakis (2001),interference,#B50000,Pure
13.123123123123124,-3.622582917697846e-5,Vass01,Vassilakis (2001),interference,#B50000,Pure
13.138138138138139,-3.5626620280265974e-5,Vass01,Vassilakis (2001),interference,#B50000,Pure
13.153153153153154,-3.503681018866236e-5,Vass01,Vassilakis (2001),interference,#B50000,Pure
13.168168168168169,-3.4456260031425676e-5,Vass01,Vassilakis (2001),interference,#B50000,Pure
13.183183183183184,-3.388483285332126e-5,Vass01,Vassilakis (2001),interference,#B50000,Pure
13.198198198198199,-3.3322393590279174e-5,Vass01,Vassilakis (2001),interference,#B50000,Pure
13.213213213213214,-3.276880904532401e-5,Vass01,Vassilakis (2001),interference,#B50000,Pure
13.228228228228229,-3.222394786478399e-5,Vass01,Vassilakis (2001),interference,#B50000,Pure
13.243243243243244,-3.16876805147756e-5,Vass01,Vassilakis (2001),interference,#B50000,Pure
13.258258258258259,-3.11598792579562e-5,Vass01,Vassilakis (2001),interference,#B50000,Pure
13.273273273273274,-3.064041813054481e-5,Vass01,Vassilakis (2001),interference,#B50000,Pure
13.288288288288289,-3.0129172919612903e-5,Vass01,Vassilakis (2001),interference,#B50000,Pure
13.303303303303304,-2.962602114063144e-5,Vass01,Vassilakis (2001),interference,#B50000,Pure
13.318318318318319,-2.9130842015284798e-5,Vass01,Vassilakis (2001),interference,#B50000,Pure
13.333333333333334,-2.864351644953837e-5,Vass01,Vassilakis (2001),interference,#B50000,Pure
13.348348348348349,-2.8163927011959956e-5,Vass01,Vassilakis (2001),interference,#B50000,Pure
13.363363363363364,-2.7691957912299584e-5,Vass01,Vassilakis (2001),interference,#B50000,Pure
13.378378378378379,-2.7227494980312582e-5,Vass01,Vassilakis (2001),interference,#B50000,Pure
13.393393393393394,-2.67704256448333e-5,Vass01,Vassilakis (2001),interference,#B50000,Pure
13.408408408408409,-2.6320638913094752e-5,Vass01,Vassilakis (2001),interference,#B50000,Pure
13.423423423423424,-2.5878025350286122e-5,Vass01,Vassilakis (2001),interference,#B50000,Pure
13.438438438438439,-2.5442477059355705e-5,Vass01,Vassilakis (2001),interference,#B50000,Pure
13.453453453453454,-2.5013887661047557e-5,Vass01,Vassilakis (2001),interference,#B50000,Pure
13.468468468468469,-2.4592152274172134e-5,Vass01,Vassilakis (2001),interference,#B50000,Pure
13.483483483483484,-2.4177167496114057e-5,Vass01,Vassilakis (2001),interference,#B50000,Pure
13.498498498498499,-2.376883138356601e-5,Vass01,Vassilakis (2001),interference,#B50000,Pure
13.513513513513514,-2.3367016890246575e-5,Vass01,Vassilakis (2001),interference,#B50000,Pure
13.528528528528529,-2.297167844730507e-5,Vass01,Vassilakis (2001),interference,#B50000,Pure
13.543543543543544,-2.258269140008985e-5,Vass01,Vassilakis (2001),interference,#B50000,Pure
13.558558558558559,-2.2199959454484824e-5,Vass01,Vassilakis (2001),interference,#B50000,Pure
13.573573573573574,-2.1823387682725604e-5,Vass01,Vassilakis (2001),interference,#B50000,Pure
13.588588588588589,-2.1452882505463442e-5,Vass01,Vassilakis (2001),interference,#B50000,Pure
13.603603603603604,-2.108835167404741e-5,Vass01,Vassilakis (2001),interference,#B50000,Pure
13.618618618618619,-2.072970425301521e-5,Vass01,Vassilakis (2001),interference,#B50000,Pure
13.633633633633634,-2.0376850602793475e-5,Vass01,Vassilakis (2001),interference,#B50000,Pure
13.64864864864865,-2.002970236260735e-5,Vass01,Vassilakis (2001),interference,#B50000,Pure
13.663663663663664,-1.968817243359346e-5,Vass01,Vassilakis (2001),interference,#B50000,Pure
13.67867867867868,-1.9352174962114526e-5,Vass01,Vassilakis (2001),interference,#B50000,Pure
13.693693693693694,-1.9021625323278347e-5,Vass01,Vassilakis (2001),interference,#B50000,Pure
13.70870870870871,-1.86964401046505e-5,Vass01,Vassilakis (2001),interference,#B50000,Pure
13.723723723723724,-1.837653709016837e-5,Vass01,Vassilakis (2001),interference,#B50000,Pure
13.73873873873874,-1.8061835244245785e-5,Vass01,Vassilakis (2001),interference,#B50000,Pure
13.753753753753754,-1.7752254696070534e-5,Vass01,Vassilakis (2001),interference,#B50000,Pure
13.76876876876877,-1.7447716724094846e-5,Vass01,Vassilakis (2001),interference,#B50000,Pure
13.783783783783784,-1.7148143740710445e-5,Vass01,Vassilakis (2001),interference,#B50000,Pure
13.7987987987988,-1.6853459277111025e-5,Vass01,Vassilakis (2001),interference,#B50000,Pure
13.813813813813814,-1.6563587968340984e-5,Vass01,Vassilakis (2001),interference,#B50000,Pure
13.82882882882883,-1.6278455538521752e-5,Vass01,Vassilakis (2001),interference,#B50000,Pure
13.843843843843844,-1.5997988786263553e-5,Vass01,Vassilakis (2001),interference,#B50000,Pure
13.85885885885886,-1.5722115570251678e-5,Vass01,Vassilakis (2001),interference,#B50000,Pure
13.873873873873874,-1.545076479500969e-5,Vass01,Vassilakis (2001),interference,#B50000,Pure
13.88888888888889,-1.5183866396838933e-5,Vass01,Vassilakis (2001),interference,#B50000,Pure
13.903903903903904,-1.4921351329928722e-5,Vass01,Vassilakis (2001),interference,#B50000,Pure
13.91891891891892,-1.4663151552636783e-5,Vass01,Vassilakis (2001),interference,#B50000,Pure
13.933933933933934,-1.4409200013940911e-5,Vass01,Vassilakis (2001),interference,#B50000,Pure
13.94894894894895,-1.4159430640054511e-5,Vass01,Vassilakis (2001),interference,#B50000,Pure
13.963963963963964,-1.391377832120984e-5,Vass01,Vassilakis (2001),interference,#B50000,Pure
13.97897897897898,-1.3672178898603138e-5,Vass01,Vassilakis (2001),interference,#B50000,Pure
13.993993993993994,-1.3434569151500635e-5,Vass01,Vassilakis (2001),interference,#B50000,Pure
14.00900900900901,-1.3200886784506596e-5,Vass01,Vassilakis (2001),interference,#B50000,Pure
14.024024024024024,-1.2971070414987018e-5,Vass01,Vassilakis (2001),interference,#B50000,Pure
14.03903903903904,-1.2745059560650343e-5,Vass01,Vassilakis (2001),interference,#B50000,Pure
14.054054054054054,-1.2522794627283505e-5,Vass01,Vassilakis (2001),interference,#B50000,Pure
14.06906906906907,-1.230421689663873e-5,Vass01,Vassilakis (2001),interference,#B50000,Pure
14.084084084084084,-1.2089268514474204e-5,Vass01,Vassilakis (2001),interference,#B50000,Pure
14.0990990990991,-1.1877892478741616e-5,Vass01,Vassilakis (2001),interference,#B50000,Pure
14.114114114114114,-1.167003262792209e-5,Vass01,Vassilakis (2001),interference,#B50000,Pure
14.12912912912913,-1.1465633629509682e-5,Vass01,Vassilakis (2001),interference,#B50000,Pure
14.144144144144144,-1.1264640968637656e-5,Vass01,Vassilakis (2001),interference,#B50000,Pure
14.15915915915916,-1.1067000936847257e-5,Vass01,Vassilakis (2001),interference,#B50000,Pure
14.174174174174174,-1.0872660621000336e-5,Vass01,Vassilakis (2001),interference,#B50000,Pure
14.18918918918919,-1.0681567892327993e-5,Vass01,Vassilakis (2001),interference,#B50000,Pure
14.204204204204204,-1.0493671395620814e-5,Vass01,Vassilakis (2001),interference,#B50000,Pure
14.21921921921922,-1.0308920538553216e-5,Vass01,Vassilakis (2001),interference,#B50000,Pure
14.234234234234235,-1.0127265481142962e-5,Vass01,Vassilakis (2001),interference,#B50000,Pure
14.24924924924925,-9.948657125346157e-6,Vass01,Vassilakis (2001),interference,#B50000,Pure
14.264264264264265,-9.773047104781763e-6,Vass01,Vassilakis (2001),interference,#B50000,Pure
14.27927927927928,-9.600387774587234e-6,Vass01,Vassilakis (2001),interference,#B50000,Pure
14.294294294294295,-9.430632201404653e-6,Vass01,Vassilakis (2001),interference,#B50000,Pure
14.30930930930931,-9.26373415349173e-6,Vass01,Vassilakis (2001),interference,#B50000,Pure
14.324324324324325,-9.099648090961425e-6,Vass01,Vassilakis (2001),interference,#B50000,Pure
14.33933933933934,-8.938329156144357e-6,Vass01,Vassilakis (2001),interference,#B50000,Pure
14.354354354354355,-8.779733164074797e-6,Vass01,Vassilakis (2001),interference,#B50000,Pure
14.36936936936937,-8.623816593099328e-6,Vass01,Vassilakis (2001),interference,#B50000,Pure
14.384384384384385,-8.470536575604868e-6,Vass01,Vassilakis (2001),interference,#B50000,Pure
14.3993993993994,-8.319850888865546e-6,Vass01,Vassilakis (2001),interference,#B50000,Pure
14.414414414414415,-8.1717179460085e-6,Vass01,Vassilakis (2001),interference,#B50000,Pure
14.42942942942943,-8.026096787094087e-6,Vass01,Vassilakis (2001),interference,#B50000,Pure
14.444444444444445,-7.882947070312917e-6,Vass01,Vassilakis (2001),interference,#B50000,Pure
14.45945945945946,-7.7422290632951e-6,Vass01,Vassilakis (2001),interference,#B50000,Pure
14.474474474474475,-7.603903634531643e-6,Vass01,Vassilakis (2001),interference,#B50000,Pure
14.48948948948949,-7.467932244908468e-6,Vass01,Vassilakis (2001),interference,#B50000,Pure
14.504504504504505,-7.334268114193778e-6,Vass01,Vassilakis (2001),interference,#B50000,Pure
14.51951951951952,-7.2028916639364636e-6,Vass01,Vassilakis (2001),interference,#B50000,Pure
14.534534534534535,-7.073757104375915e-6,Vass01,Vassilakis (2001),interference,#B50000,Pure
14.54954954954955,-6.946828183515515e-6,Vass01,Vassilakis (2001),interference,#B50000,Pure
14.564564564564565,-6.822069201036386e-6,Vass01,Vassilakis (2001),interference,#B50000,Pure
14.57957957957958,-6.69944500046984e-6,Vass01,Vassilakis (2001),interference,#B50000,Pure
14.594594594594595,-6.578920961471592e-6,Vass01,Vassilakis (2001),interference,#B50000,Pure
14.60960960960961,-6.460462992196322e-6,Vass01,Vassilakis (2001),interference,#B50000,Pure
14.624624624624625,-6.3440375217736145e-6,Vass01,Vassilakis (2001),interference,#B50000,Pure
14.63963963963964,-6.229611492880708e-6,Vass01,Vassilakis (2001),interference,#B50000,Pure
14.654654654654655,-6.117152354414329e-6,Vass01,Vassilakis (2001),interference,#B50000,Pure
14.66966966966967,-6.006628054257783e-6,Vass01,Vassilakis (2001),interference,#B50000,Pure
14.684684684684685,-5.898007032143223e-6,Vass01,Vassilakis (2001),interference,#B50000,Pure
14.6996996996997,-5.791258212608829e-6,Vass01,Vassilakis (2001),interference,#B50000,Pure
14.714714714714715,-5.686350998048186e-6,Vass01,Vassilakis (2001),interference,#B50000,Pure
14.72972972972973,-5.583255261851075e-6,Vass01,Vassilakis (2001),interference,#B50000,Pure
14.744744744744745,-5.4819413416364164e-06,Vass01,Vassilakis (2001),interference,#B50000,Pure
14.75975975975976,-5.3823800325730795e-6,Vass01,Vassilakis (2001),interference,#B50000,Pure
14.774774774774775,-5.284542580790969e-6,Vass01,Vassilakis (2001),interference,#B50000,Pure
14.78978978978979,-5.1884006768780975e-6,Vass01,Vassilakis (2001),interference,#B50000,Pure
14.804804804804805,-5.0939264494650196e-6,Vass01,Vassilakis (2001),interference,#B50000,Pure
14.81981981981982,-5.001092458894582e-6,Vass01,Vassilakis (2001),interference,#B50000,Pure
14.834834834834835,-4.909871690975762e-6,Vass01,Vassilakis (2001),interference,#B50000,Pure
14.84984984984985,-4.820237550820836e-6,Vass01,Vassilakis (2001),interference,#B50000,Pure
14.864864864864865,-4.732163856765555e-6,Vass01,Vassilakis (2001),interference,#B50000,Pure
14.87987987987988,-4.645624834369608e-6,Vass01,Vassilakis (2001),interference,#B50000,Pure
14.894894894894895,-4.560595110498672e-6,Vass01,Vassilakis (2001),interference,#B50000,Pure
14.90990990990991,-4.477049707484835e-6,Vass01,Vassilakis (2001),interference,#B50000,Pure
14.924924924924925,-4.394964037365873e-6,Vass01,Vassilakis (2001),interference,#B50000,Pure
14.93993993993994,-4.31431389620232e-6,Vass01,Vassilakis (2001),interference,#B50000,Pure
14.954954954954955,-4.235075458470495e-6,Vass01,Vassilakis (2001),interference,#B50000,Pure
14.96996996996997,-4.1572252715313e-6,Vass01,Vassilakis (2001),interference,#B50000,Pure
14.984984984984985,-4.08074025017421e-6,Vass01,Vassilakis (2001),interference,#B50000,Pure
15,-4.005597671233986e-6,Vass01,Vassilakis (2001),interference,#B50000,Pure
