interval,output,model_id,model_label,model_theory,model_colour,timbre_label
0,11.847582308804235,PraatF0,Praat (F0),harmonicity,#11A3FF,Compressed
0.015015015015015015,23.692118714897266,PraatF0,Praat (F0),harmonicity,#11A3FF,Compressed
0.03003003003003003,40.428869803871365,PraatF0,Praat (F0),harmonicity,#11A3FF,Compressed
0.04504504504504504,62.33652938533735,PraatF0,Praat (F0),harmonicity,#11A3FF,Compressed
0.06006006006006006,52.72487165394493,PraatF0,Praat (F0),harmonicity,#11A3FF,Compressed
0.07507507507507508,52.80641522236668,PraatF0,Praat (F0),harmonicity,#11A3FF,Compressed
0.09009009009009009,52.784511213676716,PraatF0,Praat (F0),harmonicity,#11A3FF,Compressed
0.10510510510510511,52.825182378595436,PraatF0,Praat (F0),harmonicity,#11A3FF,Compressed
0.12012012012012012,52.85763375683982,PraatF0,Praat (F0),harmonicity,#11A3FF,Compressed
0.13513513513513514,52.8400159173889,PraatF0,Praat (F0),harmonicity,#11A3FF,Compressed
0.15015015015015015,52.891263251903965,PraatF0,Praat (F0),harmonicity,#11A3FF,Compressed
0.16516516516516516,26.27825343793063,PraatF0,Praat (F0),harmonicity,#11A3FF,Compressed
0.18018018018018017,26.288748433494966,PraatF0,Praat (F0),harmonicity,#11A3FF,Compressed
0.19519519519519518,26.30444972306695,PraatF0,Praat (F0),harmonicity,#11A3FF,Compressed
0.21021021021021022,26.317881796595575,PraatF0,Praat (F0),harmonicity,#11A3FF,Compressed
0.22522522522522523,26.331603432107197,PraatF0,Praat (F0),harmonicity,#11A3FF,Compressed
0.24024024024024024,26.345010331655836,PraatF0,Praat (F0),harmonicity,#11A3FF,Compressed
0.2552552552552553,26.358624434732413,PraatF0,Praat (F0),harmonicity,#11A3FF,Compressed
0.2702702702702703,26.372301242942733,PraatF0,Praat (F0),harmonicity,#11A3FF,Compressed
0.2852852852852853,26.386285623234084,PraatF0,Praat (F0),harmonicity,#11A3FF,Compressed
0.3003003003003003,26.40059720315581,PraatF0,Praat (F0),harmonicity,#11A3FF,Compressed
0.3153153153153153,26.415460924783467,PraatF0,Praat (F0),harmonicity,#11A3FF,Compressed
0.3303303303303303,10.363999237683785,PraatF0,Praat (F0),harmonicity,#11A3FF,Compressed
0.34534534534534533,10.367647004888314,PraatF0,Praat (F0),harmonicity,#11A3FF,Compressed
0.36036036036036034,0,PraatF0,Praat (F0),harmonicity,#11A3FF,Compressed
0.37537537537537535,0,PraatF0,Praat (F0),harmonicity,#11A3FF,Compressed
0.39039039039039036,0,PraatF0,Praat (F0),harmonicity,#11A3FF,Compressed
0.40540540540540543,0,PraatF0,Praat (F0),harmonicity,#11A3FF,Compressed
0.42042042042042044,0,PraatF0,Praat (F0),harmonicity,#11A3FF,Compressed
0.43543543543543545,0,PraatF0,Praat (F0),harmonicity,#11A3FF,Compressed
0.45045045045045046,0,PraatF0,Praat (F0),harmonicity,#11A3FF,Compressed
0.46546546546546547,0,PraatF0,Praat (F0),harmonicity,#11A3FF,Compressed
0.4804804804804805,0,PraatF0,Praat (F0),harmonicity,#11A3FF,Compressed
0.4954954954954955,0,PraatF0,Praat (F0),harmonicity,#11A3FF,Compressed
0.5105105105105106,5.921465986867934,PraatF0,Praat (F0),harmonicity,#11A3FF,Compressed
0.5255255255255256,11.849624251902304,PraatF0,Praat (F0),harmonicity,#11A3FF,Compressed
0.5405405405405406,5.927905376677848,PraatF0,Praat (F0),harmonicity,#11A3FF,Compressed
0.5555555555555556,0,PraatF0,Praat (F0),harmonicity,#11A3FF,Compressed
0.5705705705705706,0,PraatF0,Praat (F0),harmonicity,#11A3FF,Compressed
0.5855855855855856,0,PraatF0,Praat (F0),harmonicity,#11A3FF,Compressed
0.6006006006006006,0,PraatF0,Praat (F0),harmonicity,#11A3FF,Compressed
0.6156156156156156,0,PraatF0,Praat (F0),harmonicity,#11A3FF,Compressed
0.6306306306306306,0,PraatF0,Praat (F0),harmonicity,#11A3FF,Compressed
0.6456456456456456,0,PraatF0,Praat (F0),harmonicity,#11A3FF,Compressed
0.6606606606606606,0,PraatF0,Praat (F0),harmonicity,#11A3FF,Compressed
0.6756756756756757,0,PraatF0,Praat (F0),harmonicity,#11A3FF,Compressed
0.6906906906906907,11.835598911417406,PraatF0,Praat (F0),harmonicity,#11A3FF,Compressed
0.7057057057057057,11.841985466742985,PraatF0,Praat (F0),harmonicity,#11A3FF,Compressed
0.7207207207207207,11.847815327455198,PraatF0,Praat (F0),harmonicity,#11A3FF,Compressed
0.7357357357357357,11.853003789119155,PraatF0,Praat (F0),harmonicity,#11A3FF,Compressed
0.7507507507507507,11.856863015849799,PraatF0,Praat (F0),harmonicity,#11A3FF,Compressed
0.7657657657657657,13.695315146280729,PraatF0,Praat (F0),harmonicity,#11A3FF,Compressed
0.7807807807807807,12.396088197826817,PraatF0,Praat (F0),harmonicity,#11A3FF,Compressed
0.7957957957957957,13.076269427756163,PraatF0,Praat (F0),harmonicity,#11A3FF,Compressed
0.8108108108108109,13.081678724343888,PraatF0,Praat (F0),harmonicity,#11A3FF,Compressed
0.8258258258258259,13.08740449975685,PraatF0,Praat (F0),harmonicity,#11A3FF,Compressed
0.8408408408408409,13.093392714409802,PraatF0,Praat (F0),harmonicity,#11A3FF,Compressed
0.8558558558558559,13.099591790621254,PraatF0,Praat (F0),harmonicity,#11A3FF,Compressed
0.8708708708708709,12.463373986193735,PraatF0,Praat (F0),harmonicity,#11A3FF,Compressed
0.8858858858858859,12.469515730121838,PraatF0,Praat (F0),harmonicity,#11A3FF,Compressed
0.9009009009009009,12.475378515531787,PraatF0,Praat (F0),harmonicity,#11A3FF,Compressed
0.9159159159159159,12.481044549052545,PraatF0,Praat (F0),harmonicity,#11A3FF,Compressed
0.9309309309309309,12.486538763646417,PraatF0,Praat (F0),harmonicity,#11A3FF,Compressed
0.9459459459459459,12.491828206371924,PraatF0,Praat (F0),harmonicity,#11A3FF,Compressed
0.960960960960961,13.102082938736498,PraatF0,Praat (F0),harmonicity,#11A3FF,Compressed
0.975975975975976,13.873681018649552,PraatF0,Praat (F0),harmonicity,#11A3FF,Compressed
0.990990990990991,13.879094829079257,PraatF0,Praat (F0),harmonicity,#11A3FF,Compressed
1.006006006006006,13.884192480578397,PraatF0,Praat (F0),harmonicity,#11A3FF,Compressed
1.021021021021021,13.889223658082404,PraatF0,Praat (F0),harmonicity,#11A3FF,Compressed
1.0360360360360361,13.894250959942365,PraatF0,Praat (F0),harmonicity,#11A3FF,Compressed
1.0510510510510511,15.431561744784581,PraatF0,Praat (F0),harmonicity,#11A3FF,Compressed
1.0660660660660661,15.439310117357797,PraatF0,Praat (F0),harmonicity,#11A3FF,Compressed
1.0810810810810811,15.448026494454457,PraatF0,Praat (F0),harmonicity,#11A3FF,Compressed
1.0960960960960962,15.457785467204566,PraatF0,Praat (F0),harmonicity,#11A3FF,Compressed
1.1111111111111112,15.468654020561896,PraatF0,Praat (F0),harmonicity,#11A3FF,Compressed
1.1261261261261262,15.480258868159162,PraatF0,Praat (F0),harmonicity,#11A3FF,Compressed
1.1411411411411412,15.49166978611624,PraatF0,Praat (F0),harmonicity,#11A3FF,Compressed
1.1561561561561562,15.50223926342377,PraatF0,Praat (F0),harmonicity,#11A3FF,Compressed
1.1711711711711712,16.54028950415924,PraatF0,Praat (F0),harmonicity,#11A3FF,Compressed
1.1861861861861862,21.46908225978614,PraatF0,Praat (F0),harmonicity,#11A3FF,Compressed
1.2012012012012012,21.479898206430757,PraatF0,Praat (F0),harmonicity,#11A3FF,Compressed
1.2162162162162162,18.502045911452573,PraatF0,Praat (F0),harmonicity,#11A3FF,Compressed
1.2312312312312312,18.512497595767016,PraatF0,Praat (F0),harmonicity,#11A3FF,Compressed
1.2462462462462462,18.522389586570352,PraatF0,Praat (F0),harmonicity,#11A3FF,Compressed
1.2612612612612613,18.531954709900617,PraatF0,Praat (F0),harmonicity,#11A3FF,Compressed
1.2762762762762763,18.541339266585297,PraatF0,Praat (F0),harmonicity,#11A3FF,Compressed
1.2912912912912913,23.620397894247873,PraatF0,Praat (F0),harmonicity,#11A3FF,Compressed
1.3063063063063063,23.626752799743784,PraatF0,Praat (F0),harmonicity,#11A3FF,Compressed
1.3213213213213213,20.00960196641759,PraatF0,Praat (F0),harmonicity,#11A3FF,Compressed
1.3363363363363363,20.02074219794254,PraatF0,Praat (F0),harmonicity,#11A3FF,Compressed
1.3513513513513513,20.031530652946834,PraatF0,Praat (F0),harmonicity,#11A3FF,Compressed
1.3663663663663663,20.042142063686516,PraatF0,Praat (F0),harmonicity,#11A3FF,Compressed
1.3813813813813813,20.052710568212635,PraatF0,Praat (F0),harmonicity,#11A3FF,Compressed
1.3963963963963963,23.680962500045915,PraatF0,Praat (F0),harmonicity,#11A3FF,Compressed
1.4114114114114114,23.690746750673966,PraatF0,Praat (F0),harmonicity,#11A3FF,Compressed
1.4264264264264264,23.700366540784366,PraatF0,Praat (F0),harmonicity,#11A3FF,Compressed
1.4414414414414414,23.709640408276265,PraatF0,Praat (F0),harmonicity,#11A3FF,Compressed
1.4564564564564564,21.824458126569557,PraatF0,Praat (F0),harmonicity,#11A3FF,Compressed
1.4714714714714714,21.835442998807668,PraatF0,Praat (F0),harmonicity,#11A3FF,Compressed
1.4864864864864864,21.846595369466634,PraatF0,Praat (F0),harmonicity,#11A3FF,Compressed
1.5015015015015014,21.857999968772976,PraatF0,Praat (F0),harmonicity,#11A3FF,Compressed
1.5165165165165164,21.869746753950817,PraatF0,Praat (F0),harmonicity,#11A3FF,Compressed
1.5315315315315314,21.881965644734688,PraatF0,Praat (F0),harmonicity,#11A3FF,Compressed
1.5465465465465464,25.944198550809574,PraatF0,Praat (F0),harmonicity,#11A3FF,Compressed
1.5615615615615615,25.952505881915158,PraatF0,Praat (F0),harmonicity,#11A3FF,Compressed
1.5765765765765765,25.96098801474745,PraatF0,Praat (F0),harmonicity,#11A3FF,Compressed
1.5915915915915915,25.96950925462721,PraatF0,Praat (F0),harmonicity,#11A3FF,Compressed
1.6066066066066067,25.97812601682636,PraatF0,Praat (F0),harmonicity,#11A3FF,Compressed
1.6216216216216217,25.98662082383619,PraatF0,Praat (F0),harmonicity,#11A3FF,Compressed
1.6366366366366367,25.99319924950685,PraatF0,Praat (F0),harmonicity,#11A3FF,Compressed
1.6516516516516517,26.002311203917756,PraatF0,Praat (F0),harmonicity,#11A3FF,Compressed
1.6666666666666667,26.014192179659453,PraatF0,Praat (F0),harmonicity,#11A3FF,Compressed
1.6816816816816818,26.027378547060103,PraatF0,Praat (F0),harmonicity,#11A3FF,Compressed
1.6966966966966968,13.08177057143086,PraatF0,Praat (F0),harmonicity,#11A3FF,Compressed
1.7117117117117118,13.087370493604404,PraatF0,Praat (F0),harmonicity,#11A3FF,Compressed
1.7267267267267268,13.092966167449902,PraatF0,Praat (F0),harmonicity,#11A3FF,Compressed
1.7417417417417418,13.099404244054003,PraatF0,Praat (F0),harmonicity,#11A3FF,Compressed
1.7567567567567568,13.106937785295319,PraatF0,Praat (F0),harmonicity,#11A3FF,Compressed
1.7717717717717718,13.114147346165884,PraatF0,Praat (F0),harmonicity,#11A3FF,Compressed
1.7867867867867868,14.516677113912031,PraatF0,Praat (F0),harmonicity,#11A3FF,Compressed
1.8018018018018018,14.523762130826194,PraatF0,Praat (F0),harmonicity,#11A3FF,Compressed
1.8168168168168168,26.316258517925547,PraatF0,Praat (F0),harmonicity,#11A3FF,Compressed
1.8318318318318318,26.327132471751426,PraatF0,Praat (F0),harmonicity,#11A3FF,Compressed
1.8468468468468469,26.337854131086726,PraatF0,Praat (F0),harmonicity,#11A3FF,Compressed
1.8618618618618619,28.953003085853233,PraatF0,Praat (F0),harmonicity,#11A3FF,Compressed
1.8768768768768769,28.972606894551234,PraatF0,Praat (F0),harmonicity,#11A3FF,Compressed
1.8918918918918919,28.98986761976527,PraatF0,Praat (F0),harmonicity,#11A3FF,Compressed
1.906906906906907,29.00539529692238,PraatF0,Praat (F0),harmonicity,#11A3FF,Compressed
1.921921921921922,29.02316376657048,PraatF0,Praat (F0),harmonicity,#11A3FF,Compressed
1.936936936936937,29.04145598985322,PraatF0,Praat (F0),harmonicity,#11A3FF,Compressed
1.951951951951952,29.060434602845113,PraatF0,Praat (F0),harmonicity,#11A3FF,Compressed
1.966966966966967,29.08128716984656,PraatF0,Praat (F0),harmonicity,#11A3FF,Compressed
1.981981981981982,29.10516894853293,PraatF0,Praat (F0),harmonicity,#11A3FF,Compressed
1.996996996996997,32.92779179485228,PraatF0,Praat (F0),harmonicity,#11A3FF,Compressed
2.012012012012012,32.946959048092864,PraatF0,Praat (F0),harmonicity,#11A3FF,Compressed
2.027027027027027,29.2137502060448,PraatF0,Praat (F0),harmonicity,#11A3FF,Compressed
2.042042042042042,29.25300134612681,PraatF0,Praat (F0),harmonicity,#11A3FF,Compressed
2.057057057057057,29.283321987021722,PraatF0,Praat (F0),harmonicity,#11A3FF,Compressed
2.0720720720720722,29.30788057470758,PraatF0,Praat (F0),harmonicity,#11A3FF,Compressed
2.0870870870870872,11.842506075551862,PraatF0,Praat (F0),harmonicity,#11A3FF,Compressed
2.1021021021021022,11.848762945969597,PraatF0,Praat (F0),harmonicity,#11A3FF,Compressed
2.1171171171171173,31.093063766377913,PraatF0,Praat (F0),harmonicity,#11A3FF,Compressed
2.1321321321321323,32.83767531616436,PraatF0,Praat (F0),harmonicity,#11A3FF,Compressed
2.1471471471471473,32.85953421403849,PraatF0,Praat (F0),harmonicity,#11A3FF,Compressed
2.1621621621621623,32.86678337992744,PraatF0,Praat (F0),harmonicity,#11A3FF,Compressed
2.1771771771771773,32.881245259841315,PraatF0,Praat (F0),harmonicity,#11A3FF,Compressed
2.1921921921921923,32.901715226844026,PraatF0,Praat (F0),harmonicity,#11A3FF,Compressed
2.2072072072072073,32.92097816627847,PraatF0,Praat (F0),harmonicity,#11A3FF,Compressed
2.2222222222222223,32.94198251830954,PraatF0,Praat (F0),harmonicity,#11A3FF,Compressed
2.2372372372372373,32.96290641933889,PraatF0,Praat (F0),harmonicity,#11A3FF,Compressed
2.2522522522522523,32.985644320383244,PraatF0,Praat (F0),harmonicity,#11A3FF,Compressed
2.2672672672672673,33.010416091143135,PraatF0,Praat (F0),harmonicity,#11A3FF,Compressed
2.2822822822822824,33.03832328048385,PraatF0,Praat (F0),harmonicity,#11A3FF,Compressed
2.2972972972972974,11.840396239444706,PraatF0,Praat (F0),harmonicity,#11A3FF,Compressed
2.3123123123123124,11.847392990324268,PraatF0,Praat (F0),harmonicity,#11A3FF,Compressed
2.3273273273273274,11.854263544675632,PraatF0,Praat (F0),harmonicity,#11A3FF,Compressed
2.3423423423423424,37.71268153149565,PraatF0,Praat (F0),harmonicity,#11A3FF,Compressed
2.3573573573573574,37.74167835947478,PraatF0,Praat (F0),harmonicity,#11A3FF,Compressed
2.3723723723723724,37.76890951874106,PraatF0,Praat (F0),harmonicity,#11A3FF,Compressed
2.3873873873873874,37.79531870660418,PraatF0,Praat (F0),harmonicity,#11A3FF,Compressed
2.4024024024024024,37.82116730726897,PraatF0,Praat (F0),harmonicity,#11A3FF,Compressed
2.4174174174174174,37.84045628086734,PraatF0,Praat (F0),harmonicity,#11A3FF,Compressed
2.4324324324324325,37.87708719969897,PraatF0,Praat (F0),harmonicity,#11A3FF,Compressed
2.4474474474474475,37.90222000329522,PraatF0,Praat (F0),harmonicity,#11A3FF,Compressed
2.4624624624624625,37.95122923236339,PraatF0,Praat (F0),harmonicity,#11A3FF,Compressed
2.4774774774774775,37.95401056719406,PraatF0,Praat (F0),harmonicity,#11A3FF,Compressed
2.4924924924924925,37.97708727146177,PraatF0,Praat (F0),harmonicity,#11A3FF,Compressed
2.5075075075075075,37.970387212665315,PraatF0,Praat (F0),harmonicity,#11A3FF,Compressed
2.5225225225225225,37.987963619074975,PraatF0,Praat (F0),harmonicity,#11A3FF,Compressed
2.5375375375375375,38.014059281497154,PraatF0,Praat (F0),harmonicity,#11A3FF,Compressed
2.5525525525525525,38.02928933591522,PraatF0,Praat (F0),harmonicity,#11A3FF,Compressed
2.5675675675675675,38.047599103754806,PraatF0,Praat (F0),harmonicity,#11A3FF,Compressed
2.5825825825825826,14.492747875986579,PraatF0,Praat (F0),harmonicity,#11A3FF,Compressed
2.5975975975975976,14.499275255285365,PraatF0,Praat (F0),harmonicity,#11A3FF,Compressed
2.6126126126126126,14.505850551593223,PraatF0,Praat (F0),harmonicity,#11A3FF,Compressed
2.6276276276276276,14.512511422431515,PraatF0,Praat (F0),harmonicity,#11A3FF,Compressed
2.6426426426426426,14.519412038451764,PraatF0,Praat (F0),harmonicity,#11A3FF,Compressed
2.6576576576576576,14.526769593939385,PraatF0,Praat (F0),harmonicity,#11A3FF,Compressed
2.6726726726726726,14.535599447776757,PraatF0,Praat (F0),harmonicity,#11A3FF,Compressed
2.6876876876876876,14.553134879985691,PraatF0,Praat (F0),harmonicity,#11A3FF,Compressed
2.7027027027027026,13.86005428930503,PraatF0,Praat (F0),harmonicity,#11A3FF,Compressed
2.7177177177177176,13.871504424945112,PraatF0,Praat (F0),harmonicity,#11A3FF,Compressed
2.7327327327327327,13.879266977641876,PraatF0,Praat (F0),harmonicity,#11A3FF,Compressed
2.7477477477477477,13.885910841789883,PraatF0,Praat (F0),harmonicity,#11A3FF,Compressed
2.7627627627627627,13.891922607570951,PraatF0,Praat (F0),harmonicity,#11A3FF,Compressed
2.7777777777777777,13.897367476792237,PraatF0,Praat (F0),harmonicity,#11A3FF,Compressed
2.7927927927927927,23.599207957052514,PraatF0,Praat (F0),harmonicity,#11A3FF,Compressed
2.8078078078078077,23.610462554675696,PraatF0,Praat (F0),harmonicity,#11A3FF,Compressed
2.8228228228228227,15.430166858455145,PraatF0,Praat (F0),harmonicity,#11A3FF,Compressed
2.8378378378378377,15.437122931220589,PraatF0,Praat (F0),harmonicity,#11A3FF,Compressed
2.8528528528528527,15.446570224750754,PraatF0,Praat (F0),harmonicity,#11A3FF,Compressed
2.8678678678678677,15.45702134837964,PraatF0,Praat (F0),harmonicity,#11A3FF,Compressed
2.8828828828828827,19.572280746219814,PraatF0,Praat (F0),harmonicity,#11A3FF,Compressed
2.8978978978978978,19.58523317366429,PraatF0,Praat (F0),harmonicity,#11A3FF,Compressed
2.9129129129129128,15.49780231649531,PraatF0,Praat (F0),harmonicity,#11A3FF,Compressed
2.9279279279279278,23.706310404491347,PraatF0,Praat (F0),harmonicity,#11A3FF,Compressed
2.942942942942943,34.33145928818701,PraatF0,Praat (F0),harmonicity,#11A3FF,Compressed
2.957957957957958,25.96670900415136,PraatF0,Praat (F0),harmonicity,#11A3FF,Compressed
2.972972972972973,25.97355106472791,PraatF0,Praat (F0),harmonicity,#11A3FF,Compressed
2.987987987987988,25.980839437493934,PraatF0,Praat (F0),harmonicity,#11A3FF,Compressed
3.003003003003003,25.988790201175753,PraatF0,Praat (F0),harmonicity,#11A3FF,Compressed
3.018018018018018,25.99720133651441,PraatF0,Praat (F0),harmonicity,#11A3FF,Compressed
3.033033033033033,26.0055521697471,PraatF0,Praat (F0),harmonicity,#11A3FF,Compressed
3.048048048048048,26.013736545710373,PraatF0,Praat (F0),harmonicity,#11A3FF,Compressed
3.063063063063063,26.021346465204978,PraatF0,Praat (F0),harmonicity,#11A3FF,Compressed
3.078078078078078,18.50376892076698,PraatF0,Praat (F0),harmonicity,#11A3FF,Compressed
3.093093093093093,18.507820223281037,PraatF0,Praat (F0),harmonicity,#11A3FF,Compressed
3.108108108108108,18.511345281698098,PraatF0,Praat (F0),harmonicity,#11A3FF,Compressed
3.123123123123123,18.515767315850404,PraatF0,Praat (F0),harmonicity,#11A3FF,Compressed
3.138138138138138,18.521394596693852,PraatF0,Praat (F0),harmonicity,#11A3FF,Compressed
3.153153153153153,18.528022394564307,PraatF0,Praat (F0),harmonicity,#11A3FF,Compressed
3.168168168168168,18.535421078579667,PraatF0,Praat (F0),harmonicity,#11A3FF,Compressed
3.183183183183183,12.461496427276767,PraatF0,Praat (F0),harmonicity,#11A3FF,Compressed
3.198198198198198,12.469334739958903,PraatF0,Praat (F0),harmonicity,#11A3FF,Compressed
3.2132132132132134,10.494386138682795,PraatF0,Praat (F0),harmonicity,#11A3FF,Compressed
3.2282282282282284,26.341700528783264,PraatF0,Praat (F0),harmonicity,#11A3FF,Compressed
3.2432432432432434,26.351836079518964,PraatF0,Praat (F0),harmonicity,#11A3FF,Compressed
3.2582582582582584,26.362151346449892,PraatF0,Praat (F0),harmonicity,#11A3FF,Compressed
3.2732732732732734,26.372497055055284,PraatF0,Praat (F0),harmonicity,#11A3FF,Compressed
3.2882882882882885,13.090152028301404,PraatF0,Praat (F0),harmonicity,#11A3FF,Compressed
3.3033033033033035,13.096620557978934,PraatF0,Praat (F0),harmonicity,#11A3FF,Compressed
3.3183183183183185,13.1040787772812,PraatF0,Praat (F0),harmonicity,#11A3FF,Compressed
3.3333333333333335,11.831561662099318,PraatF0,Praat (F0),harmonicity,#11A3FF,Compressed
3.3483483483483485,11.839304595819344,PraatF0,Praat (F0),harmonicity,#11A3FF,Compressed
3.3633633633633635,11.846268658827071,PraatF0,Praat (F0),harmonicity,#11A3FF,Compressed
3.3783783783783785,11.852533374745562,PraatF0,Praat (F0),harmonicity,#11A3FF,Compressed
3.3933933933933935,11.8578145429586,PraatF0,Praat (F0),harmonicity,#11A3FF,Compressed
3.4084084084084085,11.859400626666961,PraatF0,Praat (F0),harmonicity,#11A3FF,Compressed
3.4234234234234235,28.903540242440165,PraatF0,Praat (F0),harmonicity,#11A3FF,Compressed
3.4384384384384385,28.92174986774858,PraatF0,Praat (F0),harmonicity,#11A3FF,Compressed
3.4534534534534536,28.938222042798994,PraatF0,Praat (F0),harmonicity,#11A3FF,Compressed
3.4684684684684686,28.95369202862721,PraatF0,Praat (F0),harmonicity,#11A3FF,Compressed
3.4834834834834836,14.498063413458489,PraatF0,Praat (F0),harmonicity,#11A3FF,Compressed
3.4984984984984986,14.505519532046486,PraatF0,Praat (F0),harmonicity,#11A3FF,Compressed
3.5135135135135136,14.51296953578043,PraatF0,Praat (F0),harmonicity,#11A3FF,Compressed
3.5285285285285286,14.520428631447562,PraatF0,Praat (F0),harmonicity,#11A3FF,Compressed
3.5435435435435436,14.531799649680014,PraatF0,Praat (F0),harmonicity,#11A3FF,Compressed
3.5585585585585586,29.034573038606265,PraatF0,Praat (F0),harmonicity,#11A3FF,Compressed
3.5735735735735736,29.04957856953463,PraatF0,Praat (F0),harmonicity,#11A3FF,Compressed
3.5885885885885886,14.580144675536996,PraatF0,Praat (F0),harmonicity,#11A3FF,Compressed
3.6036036036036037,14.58790631075361,PraatF0,Praat (F0),harmonicity,#11A3FF,Compressed
3.6186186186186187,14.604207130682184,PraatF0,Praat (F0),harmonicity,#11A3FF,Compressed
3.6336336336336337,29.177165859374497,PraatF0,Praat (F0),harmonicity,#11A3FF,Compressed
3.6486486486486487,29.24097762963303,PraatF0,Praat (F0),harmonicity,#11A3FF,Compressed
3.6636636636636637,15.42207800643143,PraatF0,Praat (F0),harmonicity,#11A3FF,Compressed
3.6786786786786787,15.430794893472147,PraatF0,Praat (F0),harmonicity,#11A3FF,Compressed
3.6936936936936937,15.439627601798238,PraatF0,Praat (F0),harmonicity,#11A3FF,Compressed
3.7087087087087087,15.448965562514864,PraatF0,Praat (F0),harmonicity,#11A3FF,Compressed
3.7237237237237237,15.459149023010342,PraatF0,Praat (F0),harmonicity,#11A3FF,Compressed
3.7387387387387387,15.470265275507616,PraatF0,Praat (F0),harmonicity,#11A3FF,Compressed
3.7537537537537538,15.481956079173596,PraatF0,Praat (F0),harmonicity,#11A3FF,Compressed
3.7687687687687688,15.49327556295264,PraatF0,Praat (F0),harmonicity,#11A3FF,Compressed
3.7837837837837838,10.487776499658736,PraatF0,Praat (F0),harmonicity,#11A3FF,Compressed
3.798798798798799,10.493481087298726,PraatF0,Praat (F0),harmonicity,#11A3FF,Compressed
3.813813813813814,10.49911338405202,PraatF0,Praat (F0),harmonicity,#11A3FF,Compressed
3.828828828828829,32.86567505915522,PraatF0,Praat (F0),harmonicity,#11A3FF,Compressed
3.843843843843844,32.88712224893955,PraatF0,Praat (F0),harmonicity,#11A3FF,Compressed
3.858858858858859,32.90868857365953,PraatF0,Praat (F0),harmonicity,#11A3FF,Compressed
3.873873873873874,32.93062868172551,PraatF0,Praat (F0),harmonicity,#11A3FF,Compressed
3.888888888888889,32.95324814045962,PraatF0,Praat (F0),harmonicity,#11A3FF,Compressed
3.903903903903904,32.97693175361752,PraatF0,Praat (F0),harmonicity,#11A3FF,Compressed
3.918918918918919,33.002164421831054,PraatF0,Praat (F0),harmonicity,#11A3FF,Compressed
3.933933933933934,32.63365632177161,PraatF0,Praat (F0),harmonicity,#11A3FF,Compressed
3.948948948948949,32.663091444757285,PraatF0,Praat (F0),harmonicity,#11A3FF,Compressed
3.963963963963964,32.69227561837042,PraatF0,Praat (F0),harmonicity,#11A3FF,Compressed
3.978978978978979,32.721098034485735,PraatF0,Praat (F0),harmonicity,#11A3FF,Compressed
3.993993993993994,32.74581009639469,PraatF0,Praat (F0),harmonicity,#11A3FF,Compressed
4.009009009009009,32.77205430846094,PraatF0,Praat (F0),harmonicity,#11A3FF,Compressed
4.024024024024024,32.79688748869507,PraatF0,Praat (F0),harmonicity,#11A3FF,Compressed
4.039039039039039,32.82155577015423,PraatF0,Praat (F0),harmonicity,#11A3FF,Compressed
4.054054054054054,32.84568884043434,PraatF0,Praat (F0),harmonicity,#11A3FF,Compressed
4.069069069069069,32.867924075072935,PraatF0,Praat (F0),harmonicity,#11A3FF,Compressed
4.084084084084084,11.844023115530401,PraatF0,Praat (F0),harmonicity,#11A3FF,Compressed
4.099099099099099,11.85099259177778,PraatF0,Praat (F0),harmonicity,#11A3FF,Compressed
4.114114114114114,11.858174037603108,PraatF0,Praat (F0),harmonicity,#11A3FF,Compressed
4.129129129129129,32.963710838010556,PraatF0,Praat (F0),harmonicity,#11A3FF,Compressed
4.1441441441441444,32.98944355914635,PraatF0,Praat (F0),harmonicity,#11A3FF,Compressed
4.1591591591591595,33.01656889398062,PraatF0,Praat (F0),harmonicity,#11A3FF,Compressed
4.1741741741741745,33.04528549022277,PraatF0,Praat (F0),harmonicity,#11A3FF,Compressed
4.1891891891891895,23.613381103700412,PraatF0,Praat (F0),harmonicity,#11A3FF,Compressed
4.2042042042042045,23.628580829395663,PraatF0,Praat (F0),harmonicity,#11A3FF,Compressed
4.2192192192192195,23.643419012338725,PraatF0,Praat (F0),harmonicity,#11A3FF,Compressed
4.2342342342342345,23.657920189170742,PraatF0,Praat (F0),harmonicity,#11A3FF,Compressed
4.2492492492492495,12.46805975753986,PraatF0,Praat (F0),harmonicity,#11A3FF,Compressed
4.2642642642642645,23.686016177828755,PraatF0,Praat (F0),harmonicity,#11A3FF,Compressed
4.2792792792792795,23.699643767668995,PraatF0,Praat (F0),harmonicity,#11A3FF,Compressed
4.2942942942942945,23.713008721210183,PraatF0,Praat (F0),harmonicity,#11A3FF,Compressed
4.3093093093093096,10.813203875631672,PraatF0,Praat (F0),harmonicity,#11A3FF,Compressed
4.324324324324325,10.818495659480673,PraatF0,Praat (F0),harmonicity,#11A3FF,Compressed
4.33933933933934,10.824538620522954,PraatF0,Praat (F0),harmonicity,#11A3FF,Compressed
4.354354354354355,10.832443662925009,PraatF0,Praat (F0),harmonicity,#11A3FF,Compressed
4.36936936936937,10.845435418413018,PraatF0,Praat (F0),harmonicity,#11A3FF,Compressed
4.384384384384385,10.856446769525867,PraatF0,Praat (F0),harmonicity,#11A3FF,Compressed
4.3993993993994,10.863302630279263,PraatF0,Praat (F0),harmonicity,#11A3FF,Compressed
4.414414414414415,10.869113389072995,PraatF0,Praat (F0),harmonicity,#11A3FF,Compressed
4.42942942942943,25.943823053500935,PraatF0,Praat (F0),harmonicity,#11A3FF,Compressed
4.444444444444445,25.950937476358824,PraatF0,Praat (F0),harmonicity,#11A3FF,Compressed
4.45945945945946,25.959662216554484,PraatF0,Praat (F0),harmonicity,#11A3FF,Compressed
4.474474474474475,25.969258487614532,PraatF0,Praat (F0),harmonicity,#11A3FF,Compressed
4.48948948948949,25.980843336495354,PraatF0,Praat (F0),harmonicity,#11A3FF,Compressed
4.504504504504505,25.991042549310265,PraatF0,Praat (F0),harmonicity,#11A3FF,Compressed
4.51951951951952,26.00052075848989,PraatF0,Praat (F0),harmonicity,#11A3FF,Compressed
4.534534534534535,26.010270037212656,PraatF0,Praat (F0),harmonicity,#11A3FF,Compressed
4.54954954954955,26.00645696432796,PraatF0,Praat (F0),harmonicity,#11A3FF,Compressed
4.564564564564565,15.428679272024077,PraatF0,Praat (F0),harmonicity,#11A3FF,Compressed
4.57957957957958,15.437545307216048,PraatF0,Praat (F0),harmonicity,#11A3FF,Compressed
4.594594594594595,15.44686978025686,PraatF0,Praat (F0),harmonicity,#11A3FF,Compressed
4.60960960960961,15.464542622758819,PraatF0,Praat (F0),harmonicity,#11A3FF,Compressed
4.624624624624625,15.469053310081545,PraatF0,Praat (F0),harmonicity,#11A3FF,Compressed
4.63963963963964,11.844560131591653,PraatF0,Praat (F0),harmonicity,#11A3FF,Compressed
4.654654654654655,11.849686977309808,PraatF0,Praat (F0),harmonicity,#11A3FF,Compressed
4.66966966966967,11.853968285413231,PraatF0,Praat (F0),harmonicity,#11A3FF,Compressed
4.684684684684685,11.860937214835944,PraatF0,Praat (F0),harmonicity,#11A3FF,Compressed
4.6996996996997,38.01937770100008,PraatF0,Praat (F0),harmonicity,#11A3FF,Compressed
4.714714714714715,11.837974866028219,PraatF0,Praat (F0),harmonicity,#11A3FF,Compressed
4.72972972972973,11.844737871928597,PraatF0,Praat (F0),harmonicity,#11A3FF,Compressed
4.744744744744745,11.85159261880398,PraatF0,Praat (F0),harmonicity,#11A3FF,Compressed
4.75975975975976,11.858588441567715,PraatF0,Praat (F0),harmonicity,#11A3FF,Compressed
4.774774774774775,17.246633324001614,PraatF0,Praat (F0),harmonicity,#11A3FF,Compressed
4.78978978978979,26.39052777694126,PraatF0,Praat (F0),harmonicity,#11A3FF,Compressed
4.804804804804805,26.402672619567237,PraatF0,Praat (F0),harmonicity,#11A3FF,Compressed
4.81981981981982,28.94056453587541,PraatF0,Praat (F0),harmonicity,#11A3FF,Compressed
4.834834834834835,28.9514343851721,PraatF0,Praat (F0),harmonicity,#11A3FF,Compressed
4.84984984984985,28.96310689709265,PraatF0,Praat (F0),harmonicity,#11A3FF,Compressed
4.864864864864865,28.97531023464697,PraatF0,Praat (F0),harmonicity,#11A3FF,Compressed
4.87987987987988,28.987961418679156,PraatF0,Praat (F0),harmonicity,#11A3FF,Compressed
4.894894894894895,29.001146704136847,PraatF0,Praat (F0),harmonicity,#11A3FF,Compressed
4.90990990990991,29.01475597200145,PraatF0,Praat (F0),harmonicity,#11A3FF,Compressed
4.924924924924925,12.471930708693527,PraatF0,Praat (F0),harmonicity,#11A3FF,Compressed
4.93993993993994,12.450367718387035,PraatF0,Praat (F0),harmonicity,#11A3FF,Compressed
4.954954954954955,12.458212121613474,PraatF0,Praat (F0),harmonicity,#11A3FF,Compressed
4.96996996996997,12.465747425685496,PraatF0,Praat (F0),harmonicity,#11A3FF,Compressed
4.984984984984985,12.47343922714387,PraatF0,Praat (F0),harmonicity,#11A3FF,Compressed
5,12.48148953094055,PraatF0,Praat (F0),harmonicity,#11A3FF,Compressed
5.015015015015015,12.490119788896997,PraatF0,Praat (F0),harmonicity,#11A3FF,Compressed
5.03003003003003,11.26861110737362,PraatF0,Praat (F0),harmonicity,#11A3FF,Compressed
5.045045045045045,11.277167217232034,PraatF0,Praat (F0),harmonicity,#11A3FF,Compressed
5.06006006006006,11.287333729220528,PraatF0,Praat (F0),harmonicity,#11A3FF,Compressed
5.075075075075075,11.297009551723612,PraatF0,Praat (F0),harmonicity,#11A3FF,Compressed
5.09009009009009,13.090558264850966,PraatF0,Praat (F0),harmonicity,#11A3FF,Compressed
5.105105105105105,13.09876072164936,PraatF0,Praat (F0),harmonicity,#11A3FF,Compressed
5.12012012012012,13.106893622786187,PraatF0,Praat (F0),harmonicity,#11A3FF,Compressed
5.135135135135135,13.11496775369172,PraatF0,Praat (F0),harmonicity,#11A3FF,Compressed
5.15015015015015,11.350363377577255,PraatF0,Praat (F0),harmonicity,#11A3FF,Compressed
5.165165165165165,11.358486765755352,PraatF0,Praat (F0),harmonicity,#11A3FF,Compressed
5.18018018018018,11.36493711592393,PraatF0,Praat (F0),harmonicity,#11A3FF,Compressed
5.195195195195195,11.37102929991337,PraatF0,Praat (F0),harmonicity,#11A3FF,Compressed
5.21021021021021,11.377265896399885,PraatF0,Praat (F0),harmonicity,#11A3FF,Compressed
5.225225225225225,11.832610244456081,PraatF0,Praat (F0),harmonicity,#11A3FF,Compressed
5.24024024024024,11.839608709935375,PraatF0,Praat (F0),harmonicity,#11A3FF,Compressed
5.255255255255255,11.845008064222995,PraatF0,Praat (F0),harmonicity,#11A3FF,Compressed
5.27027027027027,11.844311571194298,PraatF0,Praat (F0),harmonicity,#11A3FF,Compressed
5.285285285285285,11.838616782286675,PraatF0,Praat (F0),harmonicity,#11A3FF,Compressed
5.3003003003003,11.843333562422423,PraatF0,Praat (F0),harmonicity,#11A3FF,Compressed
5.315315315315315,11.848927070328472,PraatF0,Praat (F0),harmonicity,#11A3FF,Compressed
5.33033033033033,11.854834645364807,PraatF0,Praat (F0),harmonicity,#11A3FF,Compressed
5.345345345345345,11.861085745523248,PraatF0,Praat (F0),harmonicity,#11A3FF,Compressed
5.36036036036036,44.818603884172106,PraatF0,Praat (F0),harmonicity,#11A3FF,Compressed
5.375375375375375,44.82908843669257,PraatF0,Praat (F0),harmonicity,#11A3FF,Compressed
5.39039039039039,11.499719115744334,PraatF0,Praat (F0),harmonicity,#11A3FF,Compressed
5.405405405405405,44.88958613811073,PraatF0,Praat (F0),harmonicity,#11A3FF,Compressed
5.42042042042042,44.94073036065967,PraatF0,Praat (F0),harmonicity,#11A3FF,Compressed
5.435435435435435,44.962873970345285,PraatF0,Praat (F0),harmonicity,#11A3FF,Compressed
5.45045045045045,44.98689119760085,PraatF0,Praat (F0),harmonicity,#11A3FF,Compressed
5.465465465465465,23.642549911145018,PraatF0,Praat (F0),harmonicity,#11A3FF,Compressed
5.48048048048048,23.658465837465663,PraatF0,Praat (F0),harmonicity,#11A3FF,Compressed
5.495495495495495,23.674017896622487,PraatF0,Praat (F0),harmonicity,#11A3FF,Compressed
5.51051051051051,12.45503168271955,PraatF0,Praat (F0),harmonicity,#11A3FF,Compressed
5.525525525525525,12.462851725872476,PraatF0,Praat (F0),harmonicity,#11A3FF,Compressed
5.54054054054054,12.470084674092796,PraatF0,Praat (F0),harmonicity,#11A3FF,Compressed
5.555555555555555,12.477087368525206,PraatF0,Praat (F0),harmonicity,#11A3FF,Compressed
5.57057057057057,20.026508140420056,PraatF0,Praat (F0),harmonicity,#11A3FF,Compressed
5.585585585585585,20.038598205491795,PraatF0,Praat (F0),harmonicity,#11A3FF,Compressed
5.6006006006006,20.050907360608228,PraatF0,Praat (F0),harmonicity,#11A3FF,Compressed
5.615615615615615,12.466357875794232,PraatF0,Praat (F0),harmonicity,#11A3FF,Compressed
5.63063063063063,32.79136469298828,PraatF0,Praat (F0),harmonicity,#11A3FF,Compressed
5.645645645645645,32.81345603302506,PraatF0,Praat (F0),harmonicity,#11A3FF,Compressed
5.66066066066066,32.834870941643345,PraatF0,Praat (F0),harmonicity,#11A3FF,Compressed
5.675675675675675,32.85532645213864,PraatF0,Praat (F0),harmonicity,#11A3FF,Compressed
5.6906906906906904,32.873526425229066,PraatF0,Praat (F0),harmonicity,#11A3FF,Compressed
5.7057057057057055,32.89636728435558,PraatF0,Praat (F0),harmonicity,#11A3FF,Compressed
5.7207207207207205,32.92072084337927,PraatF0,Praat (F0),harmonicity,#11A3FF,Compressed
5.7357357357357355,32.938893926191966,PraatF0,Praat (F0),harmonicity,#11A3FF,Compressed
5.7507507507507505,32.96164728609122,PraatF0,Praat (F0),harmonicity,#11A3FF,Compressed
5.7657657657657655,32.98532699480744,PraatF0,Praat (F0),harmonicity,#11A3FF,Compressed
5.7807807807807805,33.01023782909566,PraatF0,Praat (F0),harmonicity,#11A3FF,Compressed
5.7957957957957955,13.081144922333564,PraatF0,Praat (F0),harmonicity,#11A3FF,Compressed
5.8108108108108105,13.088215958022833,PraatF0,Praat (F0),harmonicity,#11A3FF,Compressed
5.8258258258258255,13.096289820311373,PraatF0,Praat (F0),harmonicity,#11A3FF,Compressed
5.8408408408408405,13.105002572525448,PraatF0,Praat (F0),harmonicity,#11A3FF,Compressed
5.8558558558558556,11.82622788748502,PraatF0,Praat (F0),harmonicity,#11A3FF,Compressed
5.870870870870871,11.833909707748678,PraatF0,Praat (F0),harmonicity,#11A3FF,Compressed
5.885885885885886,11.841032902742434,PraatF0,Praat (F0),harmonicity,#11A3FF,Compressed
5.900900900900901,11.847910359571822,PraatF0,Praat (F0),harmonicity,#11A3FF,Compressed
5.915915915915916,11.854786788473929,PraatF0,Praat (F0),harmonicity,#11A3FF,Compressed
5.930930930930931,11.861956889366649,PraatF0,Praat (F0),harmonicity,#11A3FF,Compressed
5.945945945945946,11.87009825375799,PraatF0,Praat (F0),harmonicity,#11A3FF,Compressed
5.960960960960961,18.496941620461843,PraatF0,Praat (F0),harmonicity,#11A3FF,Compressed
5.975975975975976,18.50686184827445,PraatF0,Praat (F0),harmonicity,#11A3FF,Compressed
5.990990990990991,18.5164245771115,PraatF0,Praat (F0),harmonicity,#11A3FF,Compressed
6.006006006006006,18.525957481042855,PraatF0,Praat (F0),harmonicity,#11A3FF,Compressed
6.021021021021021,18.535713769646826,PraatF0,Praat (F0),harmonicity,#11A3FF,Compressed
6.036036036036036,18.54598832743158,PraatF0,Praat (F0),harmonicity,#11A3FF,Compressed
6.051051051051051,18.557287405456293,PraatF0,Praat (F0),harmonicity,#11A3FF,Compressed
6.066066066066066,26.309829220245682,PraatF0,Praat (F0),harmonicity,#11A3FF,Compressed
6.081081081081081,26.325352935828484,PraatF0,Praat (F0),harmonicity,#11A3FF,Compressed
6.096096096096096,26.34051574999074,PraatF0,Praat (F0),harmonicity,#11A3FF,Compressed
6.111111111111111,26.355469804183713,PraatF0,Praat (F0),harmonicity,#11A3FF,Compressed
6.126126126126126,12.460381344892612,PraatF0,Praat (F0),harmonicity,#11A3FF,Compressed
6.141141141141141,12.466376559800775,PraatF0,Praat (F0),harmonicity,#11A3FF,Compressed
6.156156156156156,12.458169139969282,PraatF0,Praat (F0),harmonicity,#11A3FF,Compressed
6.171171171171171,12.458584831354583,PraatF0,Praat (F0),harmonicity,#11A3FF,Compressed
6.186186186186186,12.464576290858123,PraatF0,Praat (F0),harmonicity,#11A3FF,Compressed
6.201201201201201,12.47109427425766,PraatF0,Praat (F0),harmonicity,#11A3FF,Compressed
6.216216216216216,12.477955984246591,PraatF0,Praat (F0),harmonicity,#11A3FF,Compressed
6.231231231231231,12.485200665052588,PraatF0,Praat (F0),harmonicity,#11A3FF,Compressed
6.246246246246246,37.807710708418625,PraatF0,Praat (F0),harmonicity,#11A3FF,Compressed
6.261261261261261,37.83739138117197,PraatF0,Praat (F0),harmonicity,#11A3FF,Compressed
6.276276276276276,37.86639938842151,PraatF0,Praat (F0),harmonicity,#11A3FF,Compressed
6.291291291291291,37.89473453069326,PraatF0,Praat (F0),harmonicity,#11A3FF,Compressed
6.306306306306306,37.922495296804996,PraatF0,Praat (F0),harmonicity,#11A3FF,Compressed
6.321321321321321,37.95000703910733,PraatF0,Praat (F0),harmonicity,#11A3FF,Compressed
6.336336336336336,28.93461870538125,PraatF0,Praat (F0),harmonicity,#11A3FF,Compressed
6.351351351351351,28.951899033248182,PraatF0,Praat (F0),harmonicity,#11A3FF,Compressed
6.366366366366366,28.96690051890978,PraatF0,Praat (F0),harmonicity,#11A3FF,Compressed
6.381381381381381,13.093670151926887,PraatF0,Praat (F0),harmonicity,#11A3FF,Compressed
6.396396396396396,13.101461084755755,PraatF0,Praat (F0),harmonicity,#11A3FF,Compressed
6.411411411411412,29.012897897891456,PraatF0,Praat (F0),harmonicity,#11A3FF,Compressed
6.426426426426427,26.357527753160767,PraatF0,Praat (F0),harmonicity,#11A3FF,Compressed
6.441441441441442,29.032596529005126,PraatF0,Praat (F0),harmonicity,#11A3FF,Compressed
6.456456456456457,23.709682739943627,PraatF0,Praat (F0),harmonicity,#11A3FF,Compressed
6.471471471471472,17.22066769993724,PraatF0,Praat (F0),harmonicity,#11A3FF,Compressed
6.486486486486487,23.736457807516977,PraatF0,Praat (F0),harmonicity,#11A3FF,Compressed
6.501501501501502,11.8473220177328,PraatF0,Praat (F0),harmonicity,#11A3FF,Compressed
6.516516516516517,37.83479773442308,PraatF0,Praat (F0),harmonicity,#11A3FF,Compressed
6.531531531531532,37.878592131071315,PraatF0,Praat (F0),harmonicity,#11A3FF,Compressed
6.546546546546547,37.90223072120315,PraatF0,Praat (F0),harmonicity,#11A3FF,Compressed
6.561561561561562,37.95148755717331,PraatF0,Praat (F0),harmonicity,#11A3FF,Compressed
6.576576576576577,37.9825546429871,PraatF0,Praat (F0),harmonicity,#11A3FF,Compressed
6.591591591591592,38.01020560207004,PraatF0,Praat (F0),harmonicity,#11A3FF,Compressed
6.606606606606607,38.041318583100434,PraatF0,Praat (F0),harmonicity,#11A3FF,Compressed
6.621621621621622,38.069776872172795,PraatF0,Praat (F0),harmonicity,#11A3FF,Compressed
6.636636636636637,38.10021633001669,PraatF0,Praat (F0),harmonicity,#11A3FF,Compressed
6.651651651651652,38.12937319181364,PraatF0,Praat (F0),harmonicity,#11A3FF,Compressed
6.666666666666667,12.388108485754906,PraatF0,Praat (F0),harmonicity,#11A3FF,Compressed
6.681681681681682,12.39577896397095,PraatF0,Praat (F0),harmonicity,#11A3FF,Compressed
6.696696696696697,12.404738902511795,PraatF0,Praat (F0),harmonicity,#11A3FF,Compressed
6.711711711711712,12.415822525343316,PraatF0,Praat (F0),harmonicity,#11A3FF,Compressed
6.726726726726727,12.430236397032242,PraatF0,Praat (F0),harmonicity,#11A3FF,Compressed
6.741741741741742,12.443965683679636,PraatF0,Praat (F0),harmonicity,#11A3FF,Compressed
6.756756756756757,12.453961132823588,PraatF0,Praat (F0),harmonicity,#11A3FF,Compressed
6.771771771771772,12.462177977128517,PraatF0,Praat (F0),harmonicity,#11A3FF,Compressed
6.786786786786787,12.46991921583252,PraatF0,Praat (F0),harmonicity,#11A3FF,Compressed
6.801801801801802,12.477688174920203,PraatF0,Praat (F0),harmonicity,#11A3FF,Compressed
6.816816816816817,12.48580245133227,PraatF0,Praat (F0),harmonicity,#11A3FF,Compressed
6.831831831831832,18.50900290622618,PraatF0,Praat (F0),harmonicity,#11A3FF,Compressed
6.846846846846847,18.519526346823994,PraatF0,Praat (F0),harmonicity,#11A3FF,Compressed
6.861861861861862,18.529714372835997,PraatF0,Praat (F0),harmonicity,#11A3FF,Compressed
6.876876876876877,18.539756644606328,PraatF0,Praat (F0),harmonicity,#11A3FF,Compressed
6.891891891891892,18.549822814691833,PraatF0,Praat (F0),harmonicity,#11A3FF,Compressed
6.906906906906907,11.836069670850158,PraatF0,Praat (F0),harmonicity,#11A3FF,Compressed
6.921921921921922,11.844101129307052,PraatF0,Praat (F0),harmonicity,#11A3FF,Compressed
6.936936936936937,11.85190369103641,PraatF0,Praat (F0),harmonicity,#11A3FF,Compressed
6.951951951951952,11.859779525188687,PraatF0,Praat (F0),harmonicity,#11A3FF,Compressed
6.966966966966967,13.08291924753659,PraatF0,Praat (F0),harmonicity,#11A3FF,Compressed
6.981981981981982,13.090110696222872,PraatF0,Praat (F0),harmonicity,#11A3FF,Compressed
6.996996996996997,13.095323711328813,PraatF0,Praat (F0),harmonicity,#11A3FF,Compressed
7.012012012012012,13.08362115710274,PraatF0,Praat (F0),harmonicity,#11A3FF,Compressed
7.027027027027027,13.087869863133058,PraatF0,Praat (F0),harmonicity,#11A3FF,Compressed
7.042042042042042,13.094507002864615,PraatF0,Praat (F0),harmonicity,#11A3FF,Compressed
7.057057057057057,13.102020393552626,PraatF0,Praat (F0),harmonicity,#11A3FF,Compressed
7.072072072072072,13.110173991746802,PraatF0,Praat (F0),harmonicity,#11A3FF,Compressed
7.087087087087087,13.119036588179616,PraatF0,Praat (F0),harmonicity,#11A3FF,Compressed
7.102102102102102,25.979877431517842,PraatF0,Praat (F0),harmonicity,#11A3FF,Compressed
7.117117117117117,25.994979942241905,PraatF0,Praat (F0),harmonicity,#11A3FF,Compressed
7.132132132132132,26.010197271505795,PraatF0,Praat (F0),harmonicity,#11A3FF,Compressed
7.147147147147147,26.025758412010518,PraatF0,Praat (F0),harmonicity,#11A3FF,Compressed
7.162162162162162,33.01873292393114,PraatF0,Praat (F0),harmonicity,#11A3FF,Compressed
7.177177177177177,13.703944649015922,PraatF0,Praat (F0),harmonicity,#11A3FF,Compressed
7.192192192192192,0,PraatF0,Praat (F0),harmonicity,#11A3FF,Compressed
7.207207207207207,0,PraatF0,Praat (F0),harmonicity,#11A3FF,Compressed
7.222222222222222,0,PraatF0,Praat (F0),harmonicity,#11A3FF,Compressed
7.237237237237237,10.482138799050304,PraatF0,Praat (F0),harmonicity,#11A3FF,Compressed
7.252252252252252,10.489513659841236,PraatF0,Praat (F0),harmonicity,#11A3FF,Compressed
7.267267267267267,10.496392379434432,PraatF0,Praat (F0),harmonicity,#11A3FF,Compressed
7.282282282282282,10.503157712575685,PraatF0,Praat (F0),harmonicity,#11A3FF,Compressed
7.297297297297297,19.985497352698097,PraatF0,Praat (F0),harmonicity,#11A3FF,Compressed
7.312312312312312,19.999255162465005,PraatF0,Praat (F0),harmonicity,#11A3FF,Compressed
7.327327327327327,20.01186896408183,PraatF0,Praat (F0),harmonicity,#11A3FF,Compressed
7.342342342342342,20.023950224557467,PraatF0,Praat (F0),harmonicity,#11A3FF,Compressed
7.357357357357357,20.03586829721354,PraatF0,Praat (F0),harmonicity,#11A3FF,Compressed
7.372372372372372,20.04793620233891,PraatF0,Praat (F0),harmonicity,#11A3FF,Compressed
7.387387387387387,12.467745929787476,PraatF0,Praat (F0),harmonicity,#11A3FF,Compressed
7.402402402402402,12.475927954026062,PraatF0,Praat (F0),harmonicity,#11A3FF,Compressed
7.4174174174174174,12.484313699771903,PraatF0,Praat (F0),harmonicity,#11A3FF,Compressed
7.4324324324324325,23.710523161191446,PraatF0,Praat (F0),harmonicity,#11A3FF,Compressed
7.4474474474474475,23.724739727194148,PraatF0,Praat (F0),harmonicity,#11A3FF,Compressed
7.4624624624624625,11.839043633976287,PraatF0,Praat (F0),harmonicity,#11A3FF,Compressed
7.4774774774774775,11.846394173693596,PraatF0,Praat (F0),harmonicity,#11A3FF,Compressed
7.4924924924924925,11.852922247297244,PraatF0,Praat (F0),harmonicity,#11A3FF,Compressed
7.5075075075075075,44.76435427541004,PraatF0,Praat (F0),harmonicity,#11A3FF,Compressed
7.5225225225225225,44.80143317527111,PraatF0,Praat (F0),harmonicity,#11A3FF,Compressed
7.5375375375375375,44.83924718216659,PraatF0,Praat (F0),harmonicity,#11A3FF,Compressed
7.5525525525525525,44.86441158115866,PraatF0,Praat (F0),harmonicity,#11A3FF,Compressed
7.5675675675675675,44.898572483767104,PraatF0,Praat (F0),harmonicity,#11A3FF,Compressed
7.5825825825825826,13.78361641956618,PraatF0,Praat (F0),harmonicity,#11A3FF,Compressed
7.597597597597598,13.07640736422415,PraatF0,Praat (F0),harmonicity,#11A3FF,Compressed
7.612612612612613,13.08434851141068,PraatF0,Praat (F0),harmonicity,#11A3FF,Compressed
7.627627627627628,13.092455105549817,PraatF0,Praat (F0),harmonicity,#11A3FF,Compressed
7.642642642642643,13.100968995078478,PraatF0,Praat (F0),harmonicity,#11A3FF,Compressed
7.657657657657658,13.109919355626008,PraatF0,Praat (F0),harmonicity,#11A3FF,Compressed
7.672672672672673,13.119438781623263,PraatF0,Praat (F0),harmonicity,#11A3FF,Compressed
7.687687687687688,13.129868909198414,PraatF0,Praat (F0),harmonicity,#11A3FF,Compressed
7.702702702702703,18.496237344679876,PraatF0,Praat (F0),harmonicity,#11A3FF,Compressed
7.717717717717718,18.508278052731132,PraatF0,Praat (F0),harmonicity,#11A3FF,Compressed
7.732732732732733,18.519596391200988,PraatF0,Praat (F0),harmonicity,#11A3FF,Compressed
7.747747747747748,18.530549649531963,PraatF0,Praat (F0),harmonicity,#11A3FF,Compressed
7.762762762762763,18.541452857159335,PraatF0,Praat (F0),harmonicity,#11A3FF,Compressed
7.777777777777778,18.552742094121506,PraatF0,Praat (F0),harmonicity,#11A3FF,Compressed
7.792792792792793,29.038221609846687,PraatF0,Praat (F0),harmonicity,#11A3FF,Compressed
7.807807807807808,29.057871741606903,PraatF0,Praat (F0),harmonicity,#11A3FF,Compressed
7.822822822822823,12.474348218955075,PraatF0,Praat (F0),harmonicity,#11A3FF,Compressed
7.837837837837838,13.70486036515095,PraatF0,Praat (F0),harmonicity,#11A3FF,Compressed
7.852852852852853,10.859176463226328,PraatF0,Praat (F0),harmonicity,#11A3FF,Compressed
7.867867867867868,10.866548866921274,PraatF0,Praat (F0),harmonicity,#11A3FF,Compressed
7.882882882882883,12.46449541473328,PraatF0,Praat (F0),harmonicity,#11A3FF,Compressed
7.897897897897898,12.472014304719636,PraatF0,Praat (F0),harmonicity,#11A3FF,Compressed
7.912912912912913,29.2683123094836,PraatF0,Praat (F0),harmonicity,#11A3FF,Compressed
7.927927927927928,15.42448834606946,PraatF0,Praat (F0),harmonicity,#11A3FF,Compressed
7.942942942942943,15.435494511495783,PraatF0,Praat (F0),harmonicity,#11A3FF,Compressed
7.957957957957958,15.446627125898988,PraatF0,Praat (F0),harmonicity,#11A3FF,Compressed
7.972972972972973,15.458192591900861,PraatF0,Praat (F0),harmonicity,#11A3FF,Compressed
7.987987987987988,15.470346426916642,PraatF0,Praat (F0),harmonicity,#11A3FF,Compressed
8.003003003003004,37.60791991361789,PraatF0,Praat (F0),harmonicity,#11A3FF,Compressed
8.018018018018019,37.63923805574128,PraatF0,Praat (F0),harmonicity,#11A3FF,Compressed
8.033033033033034,11.84053770387097,PraatF0,Praat (F0),harmonicity,#11A3FF,Compressed
8.048048048048049,11.847899364456115,PraatF0,Praat (F0),harmonicity,#11A3FF,Compressed
8.063063063063064,37.73513960485009,PraatF0,Praat (F0),harmonicity,#11A3FF,Compressed
8.078078078078079,37.765765990247246,PraatF0,Praat (F0),harmonicity,#11A3FF,Compressed
8.093093093093094,37.79686050095275,PraatF0,Praat (F0),harmonicity,#11A3FF,Compressed
8.108108108108109,37.82679458070362,PraatF0,Praat (F0),harmonicity,#11A3FF,Compressed
8.123123123123124,37.85014770031442,PraatF0,Praat (F0),harmonicity,#11A3FF,Compressed
8.138138138138139,37.900946674169944,PraatF0,Praat (F0),harmonicity,#11A3FF,Compressed
8.153153153153154,45.28802930371775,PraatF0,Praat (F0),harmonicity,#11A3FF,Compressed
8.168168168168169,28.956791658063928,PraatF0,Praat (F0),harmonicity,#11A3FF,Compressed
8.183183183183184,20.01454293983049,PraatF0,Praat (F0),harmonicity,#11A3FF,Compressed
8.198198198198199,29.009611520303167,PraatF0,Praat (F0),harmonicity,#11A3FF,Compressed
8.213213213213214,29.022602032622174,PraatF0,Praat (F0),harmonicity,#11A3FF,Compressed
8.228228228228229,20.052184615055683,PraatF0,Praat (F0),harmonicity,#11A3FF,Compressed
8.243243243243244,13.099684259174364,PraatF0,Praat (F0),harmonicity,#11A3FF,Compressed
8.258258258258259,13.108238211314289,PraatF0,Praat (F0),harmonicity,#11A3FF,Compressed
8.273273273273274,13.117904417156845,PraatF0,Praat (F0),harmonicity,#11A3FF,Compressed
8.288288288288289,20.11007347248379,PraatF0,Praat (F0),harmonicity,#11A3FF,Compressed
8.303303303303304,38.18223619107173,PraatF0,Praat (F0),harmonicity,#11A3FF,Compressed
8.318318318318319,38.213531674074005,PraatF0,Praat (F0),harmonicity,#11A3FF,Compressed
8.333333333333334,11.82762792735626,PraatF0,Praat (F0),harmonicity,#11A3FF,Compressed
8.348348348348349,11.836400914283162,PraatF0,Praat (F0),harmonicity,#11A3FF,Compressed
8.363363363363364,11.844707433182329,PraatF0,Praat (F0),harmonicity,#11A3FF,Compressed
8.378378378378379,11.852808623517113,PraatF0,Praat (F0),harmonicity,#11A3FF,Compressed
8.393393393393394,11.861052561305526,PraatF0,Praat (F0),harmonicity,#11A3FF,Compressed
8.408408408408409,13.69608545547597,PraatF0,Praat (F0),harmonicity,#11A3FF,Compressed
8.423423423423424,13.70421924397122,PraatF0,Praat (F0),harmonicity,#11A3FF,Compressed
8.438438438438439,23.636093562099788,PraatF0,Praat (F0),harmonicity,#11A3FF,Compressed
8.453453453453454,23.65204132546104,PraatF0,Praat (F0),harmonicity,#11A3FF,Compressed
8.468468468468469,23.667911691538063,PraatF0,Praat (F0),harmonicity,#11A3FF,Compressed
8.483483483483484,23.683762476534177,PraatF0,Praat (F0),harmonicity,#11A3FF,Compressed
8.498498498498499,23.699678948275345,PraatF0,Praat (F0),harmonicity,#11A3FF,Compressed
8.513513513513514,32.79113761732516,PraatF0,Praat (F0),harmonicity,#11A3FF,Compressed
8.528528528528529,13.792924937709344,PraatF0,Praat (F0),harmonicity,#11A3FF,Compressed
8.543543543543544,13.801266495453973,PraatF0,Praat (F0),harmonicity,#11A3FF,Compressed
8.558558558558559,32.860165755914096,PraatF0,Praat (F0),harmonicity,#11A3FF,Compressed
8.573573573573574,32.882675579732165,PraatF0,Praat (F0),harmonicity,#11A3FF,Compressed
8.588588588588589,32.90530409297347,PraatF0,Praat (F0),harmonicity,#11A3FF,Compressed
8.603603603603604,32.92828775842176,PraatF0,Praat (F0),harmonicity,#11A3FF,Compressed
8.618618618618619,32.95189661613129,PraatF0,Praat (F0),harmonicity,#11A3FF,Compressed
8.633633633633634,13.877673224193664,PraatF0,Praat (F0),harmonicity,#11A3FF,Compressed
8.64864864864865,13.886140257224106,PraatF0,Praat (F0),harmonicity,#11A3FF,Compressed
8.663663663663664,13.894286341847216,PraatF0,Praat (F0),harmonicity,#11A3FF,Compressed
8.67867867867868,15.443182780454565,PraatF0,Praat (F0),harmonicity,#11A3FF,Compressed
8.693693693693694,15.45477860877251,PraatF0,Praat (F0),harmonicity,#11A3FF,Compressed
8.70870870870871,15.467064893656978,PraatF0,Praat (F0),harmonicity,#11A3FF,Compressed
8.723723723723724,15.4797837510636,PraatF0,Praat (F0),harmonicity,#11A3FF,Compressed
8.73873873873874,15.492459479982763,PraatF0,Praat (F0),harmonicity,#11A3FF,Compressed
8.753753753753754,14.502025650809507,PraatF0,Praat (F0),harmonicity,#11A3FF,Compressed
8.76876876876877,14.508594457689554,PraatF0,Praat (F0),harmonicity,#11A3FF,Compressed
8.783783783783784,14.497273819421261,PraatF0,Praat (F0),harmonicity,#11A3FF,Compressed
8.7987987987988,14.499846709254749,PraatF0,Praat (F0),harmonicity,#11A3FF,Compressed
8.813813813813814,14.506792065582337,PraatF0,Praat (F0),harmonicity,#11A3FF,Compressed
8.82882882882883,14.514800329032191,PraatF0,Praat (F0),harmonicity,#11A3FF,Compressed
8.843843843843844,14.523724769633821,PraatF0,Praat (F0),harmonicity,#11A3FF,Compressed
8.85885885885886,11.834396587478556,PraatF0,Praat (F0),harmonicity,#11A3FF,Compressed
8.873873873873874,11.842770643517195,PraatF0,Praat (F0),harmonicity,#11A3FF,Compressed
8.88888888888889,11.85065709428595,PraatF0,Praat (F0),harmonicity,#11A3FF,Compressed
8.903903903903904,11.85825730844546,PraatF0,Praat (F0),harmonicity,#11A3FF,Compressed
8.91891891891892,11.865987218182834,PraatF0,Praat (F0),harmonicity,#11A3FF,Compressed
8.933933933933934,25.95147459755153,PraatF0,Praat (F0),harmonicity,#11A3FF,Compressed
8.94894894894895,25.956388885028883,PraatF0,Praat (F0),harmonicity,#11A3FF,Compressed
8.963963963963964,25.957355923527498,PraatF0,Praat (F0),harmonicity,#11A3FF,Compressed
8.97897897897898,25.963859575770364,PraatF0,Praat (F0),harmonicity,#11A3FF,Compressed
8.993993993993994,25.97764362082851,PraatF0,Praat (F0),harmonicity,#11A3FF,Compressed
9.00900900900901,25.988235615314526,PraatF0,Praat (F0),harmonicity,#11A3FF,Compressed
9.024024024024024,26.002480756308255,PraatF0,Praat (F0),harmonicity,#11A3FF,Compressed
9.03903903903904,26.01525022390721,PraatF0,Praat (F0),harmonicity,#11A3FF,Compressed
9.054054054054054,19.998145586052097,PraatF0,Praat (F0),harmonicity,#11A3FF,Compressed
9.06906906906907,20.012678815527895,PraatF0,Praat (F0),harmonicity,#11A3FF,Compressed
9.084084084084084,20.02650950046446,PraatF0,Praat (F0),harmonicity,#11A3FF,Compressed
9.0990990990991,20.040016452623526,PraatF0,Praat (F0),harmonicity,#11A3FF,Compressed
9.114114114114114,20.05348401983339,PraatF0,Praat (F0),harmonicity,#11A3FF,Compressed
9.12912912912913,20.06723149365396,PraatF0,Praat (F0),harmonicity,#11A3FF,Compressed
9.144144144144144,20.08166709015321,PraatF0,Praat (F0),harmonicity,#11A3FF,Compressed
9.15915915915916,20.09736186416183,PraatF0,Praat (F0),harmonicity,#11A3FF,Compressed
9.174174174174174,20.114822267589908,PraatF0,Praat (F0),harmonicity,#11A3FF,Compressed
9.18918918918919,26.31076918945464,PraatF0,Praat (F0),harmonicity,#11A3FF,Compressed
9.204204204204204,26.319316977665686,PraatF0,Praat (F0),harmonicity,#11A3FF,Compressed
9.21921921921922,26.329343329317624,PraatF0,Praat (F0),harmonicity,#11A3FF,Compressed
9.234234234234235,12.457312784748414,PraatF0,Praat (F0),harmonicity,#11A3FF,Compressed
9.24924924924925,12.466419557540467,PraatF0,Praat (F0),harmonicity,#11A3FF,Compressed
9.264264264264265,12.475323248546285,PraatF0,Praat (F0),harmonicity,#11A3FF,Compressed
9.27927927927928,12.484399927903258,PraatF0,Praat (F0),harmonicity,#11A3FF,Compressed
9.294294294294295,15.48611935328615,PraatF0,Praat (F0),harmonicity,#11A3FF,Compressed
9.30930930930931,15.433018116382918,PraatF0,Praat (F0),harmonicity,#11A3FF,Compressed
9.324324324324325,11.825918355156244,PraatF0,Praat (F0),harmonicity,#11A3FF,Compressed
9.33933933933934,11.834994387885732,PraatF0,Praat (F0),harmonicity,#11A3FF,Compressed
9.354354354354355,11.843291069695136,PraatF0,Praat (F0),harmonicity,#11A3FF,Compressed
9.36936936936937,11.85147734276341,PraatF0,Praat (F0),harmonicity,#11A3FF,Compressed
9.384384384384385,11.859948556467325,PraatF0,Praat (F0),harmonicity,#11A3FF,Compressed
9.3993993993994,14.504587238511178,PraatF0,Praat (F0),harmonicity,#11A3FF,Compressed
9.414414414414415,14.514593306735335,PraatF0,Praat (F0),harmonicity,#11A3FF,Compressed
9.42942942942943,14.52593849150377,PraatF0,Praat (F0),harmonicity,#11A3FF,Compressed
9.444444444444445,14.534173554677793,PraatF0,Praat (F0),harmonicity,#11A3FF,Compressed
9.45945945945946,14.547523323023619,PraatF0,Praat (F0),harmonicity,#11A3FF,Compressed
9.474474474474475,44.90888388246791,PraatF0,Praat (F0),harmonicity,#11A3FF,Compressed
9.48948948948949,44.945753569603454,PraatF0,Praat (F0),harmonicity,#11A3FF,Compressed
9.504504504504505,44.98076090536378,PraatF0,Praat (F0),harmonicity,#11A3FF,Compressed
9.51951951951952,45.01552736163204,PraatF0,Praat (F0),harmonicity,#11A3FF,Compressed
9.534534534534535,45.0505643598772,PraatF0,Praat (F0),harmonicity,#11A3FF,Compressed
9.54954954954955,45.08569495957204,PraatF0,Praat (F0),harmonicity,#11A3FF,Compressed
9.564564564564565,37.97136566631709,PraatF0,Praat (F0),harmonicity,#11A3FF,Compressed
9.57957957957958,37.997395439531076,PraatF0,Praat (F0),harmonicity,#11A3FF,Compressed
9.594594594594595,38.0235388349933,PraatF0,Praat (F0),harmonicity,#11A3FF,Compressed
9.60960960960961,38.04992606437041,PraatF0,Praat (F0),harmonicity,#11A3FF,Compressed
9.624624624624625,38.07672809946496,PraatF0,Praat (F0),harmonicity,#11A3FF,Compressed
9.63963963963964,14.704227836734564,PraatF0,Praat (F0),harmonicity,#11A3FF,Compressed
9.654654654654655,21.792556957621862,PraatF0,Praat (F0),harmonicity,#11A3FF,Compressed
9.66966966966967,21.809118251508615,PraatF0,Praat (F0),harmonicity,#11A3FF,Compressed
9.684684684684685,21.82489863669244,PraatF0,Praat (F0),harmonicity,#11A3FF,Compressed
9.6996996996997,21.84029042609773,PraatF0,Praat (F0),harmonicity,#11A3FF,Compressed
9.714714714714715,21.855591822907172,PraatF0,Praat (F0),harmonicity,#11A3FF,Compressed
9.72972972972973,21.871058351752037,PraatF0,Praat (F0),harmonicity,#11A3FF,Compressed
9.744744744744745,12.455106257845008,PraatF0,Praat (F0),harmonicity,#11A3FF,Compressed
9.75975975975976,12.464282787933726,PraatF0,Praat (F0),harmonicity,#11A3FF,Compressed
9.774774774774775,12.472969769004724,PraatF0,Praat (F0),harmonicity,#11A3FF,Compressed
9.78978978978979,12.48152363278226,PraatF0,Praat (F0),harmonicity,#11A3FF,Compressed
9.804804804804805,12.490206809179503,PraatF0,Praat (F0),harmonicity,#11A3FF,Compressed
9.81981981981982,11.837070047683621,PraatF0,Praat (F0),harmonicity,#11A3FF,Compressed
9.834834834834835,11.843396105568582,PraatF0,Praat (F0),harmonicity,#11A3FF,Compressed
9.84984984984985,11.848807332573605,PraatF0,Praat (F0),harmonicity,#11A3FF,Compressed
9.864864864864865,11.853140059181216,PraatF0,Praat (F0),harmonicity,#11A3FF,Compressed
9.87987987987988,11.856676487780554,PraatF0,Praat (F0),harmonicity,#11A3FF,Compressed
9.894894894894895,15.441027919077065,PraatF0,Praat (F0),harmonicity,#11A3FF,Compressed
9.90990990990991,15.451569072218243,PraatF0,Praat (F0),harmonicity,#11A3FF,Compressed
9.924924924924925,15.463047975284322,PraatF0,Praat (F0),harmonicity,#11A3FF,Compressed
9.93993993993994,15.475272243395763,PraatF0,Praat (F0),harmonicity,#11A3FF,Compressed
9.954954954954955,32.90921200180017,PraatF0,Praat (F0),harmonicity,#11A3FF,Compressed
9.96996996996997,32.93389844501222,PraatF0,Praat (F0),harmonicity,#11A3FF,Compressed
9.984984984984985,32.95913474284221,PraatF0,Praat (F0),harmonicity,#11A3FF,Compressed
10,14.50116464457878,PraatF0,Praat (F0),harmonicity,#11A3FF,Compressed
10.015015015015015,14.510863697268283,PraatF0,Praat (F0),harmonicity,#11A3FF,Compressed
10.03003003003003,14.520898372231304,PraatF0,Praat (F0),harmonicity,#11A3FF,Compressed
10.045045045045045,25.94554245321939,PraatF0,Praat (F0),harmonicity,#11A3FF,Compressed
10.06006006006006,25.959496682433723,PraatF0,Praat (F0),harmonicity,#11A3FF,Compressed
10.075075075075075,25.97403962813548,PraatF0,Praat (F0),harmonicity,#11A3FF,Compressed
10.09009009009009,25.98906447597782,PraatF0,Praat (F0),harmonicity,#11A3FF,Compressed
10.105105105105105,13.097519242546987,PraatF0,Praat (F0),harmonicity,#11A3FF,Compressed
10.12012012012012,13.107309684623965,PraatF0,Praat (F0),harmonicity,#11A3FF,Compressed
10.135135135135135,13.11749157330312,PraatF0,Praat (F0),harmonicity,#11A3FF,Compressed
10.15015015015015,12.39940626839277,PraatF0,Praat (F0),harmonicity,#11A3FF,Compressed
10.165165165165165,23.5833360416416,PraatF0,Praat (F0),harmonicity,#11A3FF,Compressed
10.18018018018018,23.600186975841588,PraatF0,Praat (F0),harmonicity,#11A3FF,Compressed
10.195195195195195,23.616612536449324,PraatF0,Praat (F0),harmonicity,#11A3FF,Compressed
10.21021021021021,23.632710293022996,PraatF0,Praat (F0),harmonicity,#11A3FF,Compressed
10.225225225225225,12.455714205880628,PraatF0,Praat (F0),harmonicity,#11A3FF,Compressed
10.24024024024024,12.464952893182904,PraatF0,Praat (F0),harmonicity,#11A3FF,Compressed
10.255255255255255,12.473848990942399,PraatF0,Praat (F0),harmonicity,#11A3FF,Compressed
10.27027027027027,12.482800457632532,PraatF0,Praat (F0),harmonicity,#11A3FF,Compressed
10.285285285285285,23.711620686421107,PraatF0,Praat (F0),harmonicity,#11A3FF,Compressed
10.3003003003003,23.727967668008766,PraatF0,Praat (F0),harmonicity,#11A3FF,Compressed
10.315315315315315,11.839521157290324,PraatF0,Praat (F0),harmonicity,#11A3FF,Compressed
10.33033033033033,11.847906154362986,PraatF0,Praat (F0),harmonicity,#11A3FF,Compressed
10.345345345345345,11.856139338710282,PraatF0,Praat (F0),harmonicity,#11A3FF,Compressed
10.36036036036036,11.864647302909717,PraatF0,Praat (F0),harmonicity,#11A3FF,Compressed
10.375375375375375,52.756876259458636,PraatF0,Praat (F0),harmonicity,#11A3FF,Compressed
10.39039039039039,52.78608946986098,PraatF0,Praat (F0),harmonicity,#11A3FF,Compressed
10.405405405405405,52.81528739925321,PraatF0,Praat (F0),harmonicity,#11A3FF,Compressed
10.42042042042042,52.8443882974189,PraatF0,Praat (F0),harmonicity,#11A3FF,Compressed
10.435435435435435,15.405029221254983,PraatF0,Praat (F0),harmonicity,#11A3FF,Compressed
10.45045045045045,15.416337935690883,PraatF0,Praat (F0),harmonicity,#11A3FF,Compressed
10.465465465465465,15.427165812699947,PraatF0,Praat (F0),harmonicity,#11A3FF,Compressed
10.48048048048048,15.438078088462206,PraatF0,Praat (F0),harmonicity,#11A3FF,Compressed
10.495495495495495,15.449426605525836,PraatF0,Praat (F0),harmonicity,#11A3FF,Compressed
10.51051051051051,15.461408280612723,PraatF0,Praat (F0),harmonicity,#11A3FF,Compressed
10.525525525525525,15.47395329499258,PraatF0,Praat (F0),harmonicity,#11A3FF,Compressed
10.54054054054054,15.486673899707124,PraatF0,Praat (F0),harmonicity,#11A3FF,Compressed
10.555555555555555,15.499107371078077,PraatF0,Praat (F0),harmonicity,#11A3FF,Compressed
10.57057057057057,21.823866096469807,PraatF0,Praat (F0),harmonicity,#11A3FF,Compressed
10.585585585585585,21.839886542772994,PraatF0,Praat (F0),harmonicity,#11A3FF,Compressed
10.6006006006006,13.085786442639826,PraatF0,Praat (F0),harmonicity,#11A3FF,Compressed
10.615615615615615,13.09516013680725,PraatF0,Praat (F0),harmonicity,#11A3FF,Compressed
10.63063063063063,13.104624490836567,PraatF0,Praat (F0),harmonicity,#11A3FF,Compressed
10.645645645645645,13.11432712655736,PraatF0,Praat (F0),harmonicity,#11A3FF,Compressed
10.66066066066066,21.922779594643828,PraatF0,Praat (F0),harmonicity,#11A3FF,Compressed
10.675675675675675,11.841643817258191,PraatF0,Praat (F0),harmonicity,#11A3FF,Compressed
10.69069069069069,11.849354045466235,PraatF0,Praat (F0),harmonicity,#11A3FF,Compressed
10.705705705705705,12.457533696095535,PraatF0,Praat (F0),harmonicity,#11A3FF,Compressed
10.72072072072072,12.464722949978663,PraatF0,Praat (F0),harmonicity,#11A3FF,Compressed
10.735735735735735,12.470931274093836,PraatF0,Praat (F0),harmonicity,#11A3FF,Compressed
10.75075075075075,12.476219827782561,PraatF0,Praat (F0),harmonicity,#11A3FF,Compressed
10.765765765765765,12.480585316416876,PraatF0,Praat (F0),harmonicity,#11A3FF,Compressed
10.78078078078078,12.485872191887385,PraatF0,Praat (F0),harmonicity,#11A3FF,Compressed
10.795795795795796,32.855800268693585,PraatF0,Praat (F0),harmonicity,#11A3FF,Compressed
10.81081081081081,25.9429796912327,PraatF0,Praat (F0),harmonicity,#11A3FF,Compressed
10.825825825825826,25.960013198935087,PraatF0,Praat (F0),harmonicity,#11A3FF,Compressed
10.84084084084084,25.976634159064602,PraatF0,Praat (F0),harmonicity,#11A3FF,Compressed
10.855855855855856,28.95855868872303,PraatF0,Praat (F0),harmonicity,#11A3FF,Compressed
10.87087087087087,28.97148880391712,PraatF0,Praat (F0),harmonicity,#11A3FF,Compressed
10.885885885885886,28.985229725919492,PraatF0,Praat (F0),harmonicity,#11A3FF,Compressed
10.9009009009009,29.00108051408335,PraatF0,Praat (F0),harmonicity,#11A3FF,Compressed
10.915915915915916,29.017441637372443,PraatF0,Praat (F0),harmonicity,#11A3FF,Compressed
10.93093093093093,29.03469291502699,PraatF0,Praat (F0),harmonicity,#11A3FF,Compressed
10.945945945945946,29.05381145338543,PraatF0,Praat (F0),harmonicity,#11A3FF,Compressed
10.96096096096096,37.76575813344058,PraatF0,Praat (F0),harmonicity,#11A3FF,Compressed
10.975975975975976,37.79487239374679,PraatF0,Praat (F0),harmonicity,#11A3FF,Compressed
10.99099099099099,37.82595326900198,PraatF0,Praat (F0),harmonicity,#11A3FF,Compressed
11.006006006006006,37.857692945145715,PraatF0,Praat (F0),harmonicity,#11A3FF,Compressed
11.02102102102102,37.892102515124535,PraatF0,Praat (F0),harmonicity,#11A3FF,Compressed
11.036036036036036,30.753327328547655,PraatF0,Praat (F0),harmonicity,#11A3FF,Compressed
11.05105105105105,24.781372120239237,PraatF0,Praat (F0),harmonicity,#11A3FF,Compressed
11.066066066066066,23.634236733952594,PraatF0,Praat (F0),harmonicity,#11A3FF,Compressed
11.08108108108108,19.54260260880121,PraatF0,Praat (F0),harmonicity,#11A3FF,Compressed
11.096096096096096,14.267273221672363,PraatF0,Praat (F0),harmonicity,#11A3FF,Compressed
11.11111111111111,23.67934005764006,PraatF0,Praat (F0),harmonicity,#11A3FF,Compressed
11.126126126126126,13.113704273405062,PraatF0,Praat (F0),harmonicity,#11A3FF,Compressed
11.14114114114114,23.72745752626639,PraatF0,Praat (F0),harmonicity,#11A3FF,Compressed
11.156156156156156,11.84293500693229,PraatF0,Praat (F0),harmonicity,#11A3FF,Compressed
11.17117117117117,11.850112211354293,PraatF0,Praat (F0),harmonicity,#11A3FF,Compressed
11.186186186186186,11.85973448494806,PraatF0,Praat (F0),harmonicity,#11A3FF,Compressed
11.2012012012012,12.460709683907313,PraatF0,Praat (F0),harmonicity,#11A3FF,Compressed
11.216216216216216,12.470005553595467,PraatF0,Praat (F0),harmonicity,#11A3FF,Compressed
11.23123123123123,12.479002056717825,PraatF0,Praat (F0),harmonicity,#11A3FF,Compressed
11.246246246246246,12.4882082869944,PraatF0,Praat (F0),harmonicity,#11A3FF,Compressed
11.26126126126126,11.49280663969033,PraatF0,Praat (F0),harmonicity,#11A3FF,Compressed
11.276276276276276,16.15957866267739,PraatF0,Praat (F0),harmonicity,#11A3FF,Compressed
11.29129129129129,13.153842439926997,PraatF0,Praat (F0),harmonicity,#11A3FF,Compressed
11.306306306306306,26.326261597906836,PraatF0,Praat (F0),harmonicity,#11A3FF,Compressed
11.32132132132132,10.488445943555572,PraatF0,Praat (F0),harmonicity,#11A3FF,Compressed
11.336336336336336,10.495230068954992,PraatF0,Praat (F0),harmonicity,#11A3FF,Compressed
11.35135135135135,5.2515238661114765,PraatF0,Praat (F0),harmonicity,#11A3FF,Compressed
11.366366366366366,0,PraatF0,Praat (F0),harmonicity,#11A3FF,Compressed
11.381381381381381,13.689444465860442,PraatF0,Praat (F0),harmonicity,#11A3FF,Compressed
11.396396396396396,13.698915892386449,PraatF0,Praat (F0),harmonicity,#11A3FF,Compressed
11.411411411411411,16.873874505533085,PraatF0,Praat (F0),harmonicity,#11A3FF,Compressed
11.426426426426426,20.05464195416674,PraatF0,Praat (F0),harmonicity,#11A3FF,Compressed
11.441441441441441,20.07020331648009,PraatF0,Praat (F0),harmonicity,#11A3FF,Compressed
11.456456456456456,16.33579410437093,PraatF0,Praat (F0),harmonicity,#11A3FF,Compressed
11.471471471471471,16.34713037543094,PraatF0,Praat (F0),harmonicity,#11A3FF,Compressed
11.486486486486486,16.3587234363435,PraatF0,Praat (F0),harmonicity,#11A3FF,Compressed
11.501501501501501,16.370888688198214,PraatF0,Praat (F0),harmonicity,#11A3FF,Compressed
11.516516516516516,11.828936645547254,PraatF0,Praat (F0),harmonicity,#11A3FF,Compressed
11.531531531531531,11.838191083890012,PraatF0,Praat (F0),harmonicity,#11A3FF,Compressed
11.546546546546546,11.847049179275505,PraatF0,Praat (F0),harmonicity,#11A3FF,Compressed
11.561561561561561,11.85576182703278,PraatF0,Praat (F0),harmonicity,#11A3FF,Compressed
11.576576576576576,13.094710342696258,PraatF0,Praat (F0),harmonicity,#11A3FF,Compressed
11.591591591591591,13.101507148563108,PraatF0,Praat (F0),harmonicity,#11A3FF,Compressed
11.606606606606606,13.107771550377663,PraatF0,Praat (F0),harmonicity,#11A3FF,Compressed
11.621621621621621,13.113698702352417,PraatF0,Praat (F0),harmonicity,#11A3FF,Compressed
11.636636636636636,13.88932375574467,PraatF0,Praat (F0),harmonicity,#11A3FF,Compressed
11.651651651651651,16.518933062924347,PraatF0,Praat (F0),harmonicity,#11A3FF,Compressed
11.666666666666666,16.532400965320626,PraatF0,Praat (F0),harmonicity,#11A3FF,Compressed
11.681681681681681,16.545234379724683,PraatF0,Praat (F0),harmonicity,#11A3FF,Compressed
11.696696696696696,16.557524738050365,PraatF0,Praat (F0),harmonicity,#11A3FF,Compressed
11.711711711711711,16.569491409149244,PraatF0,Praat (F0),harmonicity,#11A3FF,Compressed
11.726726726726726,16.581398712710115,PraatF0,Praat (F0),harmonicity,#11A3FF,Compressed
11.741741741741741,10.109697676320751,PraatF0,Praat (F0),harmonicity,#11A3FF,Compressed
11.756756756756756,51.23657822858131,PraatF0,Praat (F0),harmonicity,#11A3FF,Compressed
11.771771771771771,17.217966016342256,PraatF0,Praat (F0),harmonicity,#11A3FF,Compressed
11.786786786786786,17.226759097248678,PraatF0,Praat (F0),harmonicity,#11A3FF,Compressed
11.801801801801801,25.928206359547456,PraatF0,Praat (F0),harmonicity,#11A3FF,Compressed
11.816816816816816,25.942356794106907,PraatF0,Praat (F0),harmonicity,#11A3FF,Compressed
11.831831831831831,25.956501704468074,PraatF0,Praat (F0),harmonicity,#11A3FF,Compressed
11.846846846846846,25.97082876403215,PraatF0,Praat (F0),harmonicity,#11A3FF,Compressed
11.861861861861861,25.985498168764302,PraatF0,Praat (F0),harmonicity,#11A3FF,Compressed
11.876876876876876,26.000679565960738,PraatF0,Praat (F0),harmonicity,#11A3FF,Compressed
11.891891891891891,26.016596189554793,PraatF0,Praat (F0),harmonicity,#11A3FF,Compressed
11.906906906906906,26.033598797566235,PraatF0,Praat (F0),harmonicity,#11A3FF,Compressed
11.921921921921921,23.599806172336347,PraatF0,Praat (F0),harmonicity,#11A3FF,Compressed
11.936936936936936,23.61790061291126,PraatF0,Praat (F0),harmonicity,#11A3FF,Compressed
11.951951951951951,23.635615854945662,PraatF0,Praat (F0),harmonicity,#11A3FF,Compressed
11.966966966966966,23.652995250632422,PraatF0,Praat (F0),harmonicity,#11A3FF,Compressed
11.981981981981981,23.670094536919656,PraatF0,Praat (F0),harmonicity,#11A3FF,Compressed
11.996996996996996,23.686995833774077,PraatF0,Praat (F0),harmonicity,#11A3FF,Compressed
12.012012012012011,23.703816763346353,PraatF0,Praat (F0),harmonicity,#11A3FF,Compressed
12.027027027027026,23.72071799243586,PraatF0,Praat (F0),harmonicity,#11A3FF,Compressed
12.042042042042041,12.462781230763445,PraatF0,Praat (F0),harmonicity,#11A3FF,Compressed
12.057057057057056,13.091620721421052,PraatF0,Praat (F0),harmonicity,#11A3FF,Compressed
12.072072072072071,13.101380524762785,PraatF0,Praat (F0),harmonicity,#11A3FF,Compressed
12.087087087087086,26.331320051080787,PraatF0,Praat (F0),harmonicity,#11A3FF,Compressed
12.102102102102101,26.348117800590508,PraatF0,Praat (F0),harmonicity,#11A3FF,Compressed
12.117117117117116,26.365121676876825,PraatF0,Praat (F0),harmonicity,#11A3FF,Compressed
12.132132132132131,26.382522956327072,PraatF0,Praat (F0),harmonicity,#11A3FF,Compressed
12.147147147147146,26.400508784359836,PraatF0,Praat (F0),harmonicity,#11A3FF,Compressed
12.162162162162161,10.359933679550963,PraatF0,Praat (F0),harmonicity,#11A3FF,Compressed
12.177177177177176,10.367295175223449,PraatF0,Praat (F0),harmonicity,#11A3FF,Compressed
12.192192192192191,52.57300073461243,PraatF0,Praat (F0),harmonicity,#11A3FF,Compressed
12.207207207207206,52.608902010431436,PraatF0,Praat (F0),harmonicity,#11A3FF,Compressed
12.222222222222221,52.64470311988539,PraatF0,Praat (F0),harmonicity,#11A3FF,Compressed
12.237237237237236,52.68052059852354,PraatF0,Praat (F0),harmonicity,#11A3FF,Compressed
12.252252252252251,52.71645593802141,PraatF0,Praat (F0),harmonicity,#11A3FF,Compressed
12.267267267267266,11.846476738615479,PraatF0,Praat (F0),harmonicity,#11A3FF,Compressed
12.282282282282281,11.854096187697836,PraatF0,Praat (F0),harmonicity,#11A3FF,Compressed
12.297297297297296,52.826007458056694,PraatF0,Praat (F0),harmonicity,#11A3FF,Compressed
12.312312312312311,37.729478155067675,PraatF0,Praat (F0),harmonicity,#11A3FF,Compressed
12.327327327327327,37.7614941009856,PraatF0,Praat (F0),harmonicity,#11A3FF,Compressed
12.342342342342342,37.793192760341356,PraatF0,Praat (F0),harmonicity,#11A3FF,Compressed
12.357357357357357,17.21085735625151,PraatF0,Praat (F0),harmonicity,#11A3FF,Compressed
12.372372372372372,10.486020881335335,PraatF0,Praat (F0),harmonicity,#11A3FF,Compressed
12.387387387387387,10.494157377613845,PraatF0,Praat (F0),harmonicity,#11A3FF,Compressed
12.402402402402402,17.245134835897318,PraatF0,Praat (F0),harmonicity,#11A3FF,Compressed
12.417417417417417,12.459434393830257,PraatF0,Praat (F0),harmonicity,#11A3FF,Compressed
12.432432432432432,12.469006284858159,PraatF0,Praat (F0),harmonicity,#11A3FF,Compressed
12.447447447447447,12.478476279507255,PraatF0,Praat (F0),harmonicity,#11A3FF,Compressed
12.462462462462462,12.488160783258323,PraatF0,Praat (F0),harmonicity,#11A3FF,Compressed
12.477477477477477,20.051698861948864,PraatF0,Praat (F0),harmonicity,#11A3FF,Compressed
12.492492492492492,20.066593187281878,PraatF0,Praat (F0),harmonicity,#11A3FF,Compressed
12.507507507507507,20.08192339497405,PraatF0,Praat (F0),harmonicity,#11A3FF,Compressed
12.522522522522522,10.361654274442301,PraatF0,Praat (F0),harmonicity,#11A3FF,Compressed
12.537537537537537,10.368365959093355,PraatF0,Praat (F0),harmonicity,#11A3FF,Compressed
12.552552552552552,10.375113880721662,PraatF0,Praat (F0),harmonicity,#11A3FF,Compressed
12.567567567567567,13.872391512043281,PraatF0,Praat (F0),harmonicity,#11A3FF,Compressed
12.582582582582582,13.880676182494756,PraatF0,Praat (F0),harmonicity,#11A3FF,Compressed
12.597597597597597,13.887417070440492,PraatF0,Praat (F0),harmonicity,#11A3FF,Compressed
12.612612612612612,13.892740736099746,PraatF0,Praat (F0),harmonicity,#11A3FF,Compressed
12.627627627627627,25.890096668191617,PraatF0,Praat (F0),harmonicity,#11A3FF,Compressed
12.642642642642642,25.909497706722224,PraatF0,Praat (F0),harmonicity,#11A3FF,Compressed
12.657657657657657,25.926975136651556,PraatF0,Praat (F0),harmonicity,#11A3FF,Compressed
12.672672672672672,25.943464918712188,PraatF0,Praat (F0),harmonicity,#11A3FF,Compressed
12.687687687687687,25.959466074631116,PraatF0,Praat (F0),harmonicity,#11A3FF,Compressed
12.702702702702702,25.97526064176469,PraatF0,Praat (F0),harmonicity,#11A3FF,Compressed
12.717717717717717,25.99103387457042,PraatF0,Praat (F0),harmonicity,#11A3FF,Compressed
12.732732732732732,26.00694794145948,PraatF0,Praat (F0),harmonicity,#11A3FF,Compressed
12.747747747747747,26.023219525844024,PraatF0,Praat (F0),harmonicity,#11A3FF,Compressed
12.762762762762762,26.040247397724716,PraatF0,Praat (F0),harmonicity,#11A3FF,Compressed
12.777777777777777,17.623771955110072,PraatF0,Praat (F0),harmonicity,#11A3FF,Compressed
12.792792792792792,17.63697710467932,PraatF0,Praat (F0),harmonicity,#11A3FF,Compressed
12.807807807807807,17.6505856742201,PraatF0,Praat (F0),harmonicity,#11A3FF,Compressed
12.822822822822824,25.99760152819714,PraatF0,Praat (F0),harmonicity,#11A3FF,Compressed
12.837837837837839,14.486253551338045,PraatF0,Praat (F0),harmonicity,#11A3FF,Compressed
12.852852852852854,14.497135872184424,PraatF0,Praat (F0),harmonicity,#11A3FF,Compressed
12.867867867867869,14.507674908280574,PraatF0,Praat (F0),harmonicity,#11A3FF,Compressed
12.882882882882884,14.518312785506723,PraatF0,Praat (F0),harmonicity,#11A3FF,Compressed
12.897897897897899,13.093788766638937,PraatF0,Praat (F0),harmonicity,#11A3FF,Compressed
12.912912912912914,13.103847464568549,PraatF0,Praat (F0),harmonicity,#11A3FF,Compressed
12.927927927927929,26.319002150701703,PraatF0,Praat (F0),harmonicity,#11A3FF,Compressed
12.942942942942944,26.336070100790756,PraatF0,Praat (F0),harmonicity,#11A3FF,Compressed
12.957957957957959,26.353521296889394,PraatF0,Praat (F0),harmonicity,#11A3FF,Compressed
12.972972972972974,26.371250872823772,PraatF0,Praat (F0),harmonicity,#11A3FF,Compressed
12.987987987987989,26.388492380694593,PraatF0,Praat (F0),harmonicity,#11A3FF,Compressed
13.003003003003004,11.84049902919656,PraatF0,Praat (F0),harmonicity,#11A3FF,Compressed
13.018018018018019,18.491323601295186,PraatF0,Praat (F0),harmonicity,#11A3FF,Compressed
13.033033033033034,18.51075714241343,PraatF0,Praat (F0),harmonicity,#11A3FF,Compressed
13.048048048048049,18.52263419632496,PraatF0,Praat (F0),harmonicity,#11A3FF,Compressed
13.063063063063064,18.534119329420307,PraatF0,Praat (F0),harmonicity,#11A3FF,Compressed
13.078078078078079,32.88358366704029,PraatF0,Praat (F0),harmonicity,#11A3FF,Compressed
13.093093093093094,32.906534059888216,PraatF0,Praat (F0),harmonicity,#11A3FF,Compressed
13.108108108108109,32.930139787381364,PraatF0,Praat (F0),harmonicity,#11A3FF,Compressed
13.123123123123124,32.95463860950919,PraatF0,Praat (F0),harmonicity,#11A3FF,Compressed
13.138138138138139,32.980167692267344,PraatF0,Praat (F0),harmonicity,#11A3FF,Compressed
13.153153153153154,12.468349969013914,PraatF0,Praat (F0),harmonicity,#11A3FF,Compressed
13.168168168168169,20.017261681865367,PraatF0,Praat (F0),harmonicity,#11A3FF,Compressed
13.183183183183184,20.032315862957326,PraatF0,Praat (F0),harmonicity,#11A3FF,Compressed
13.198198198198199,20.0474301710829,PraatF0,Praat (F0),harmonicity,#11A3FF,Compressed
13.213213213213214,20.062839003335515,PraatF0,Praat (F0),harmonicity,#11A3FF,Compressed
13.228228228228229,20.078756343180668,PraatF0,Praat (F0),harmonicity,#11A3FF,Compressed
13.243243243243244,20.095359102968068,PraatF0,Praat (F0),harmonicity,#11A3FF,Compressed
13.258258258258259,13.080300679183582,PraatF0,Praat (F0),harmonicity,#11A3FF,Compressed
13.273273273273274,13.090374642896462,PraatF0,Praat (F0),harmonicity,#11A3FF,Compressed
13.288288288288289,13.100506248161592,PraatF0,Praat (F0),harmonicity,#11A3FF,Compressed
13.303303303303304,13.110847547934318,PraatF0,Praat (F0),harmonicity,#11A3FF,Compressed
13.318318318318319,13.121516944436355,PraatF0,Praat (F0),harmonicity,#11A3FF,Compressed
13.333333333333334,14.498965599821133,PraatF0,Praat (F0),harmonicity,#11A3FF,Compressed
13.348348348348349,14.507006591373997,PraatF0,Praat (F0),harmonicity,#11A3FF,Compressed
13.363363363363364,14.514502385164327,PraatF0,Praat (F0),harmonicity,#11A3FF,Compressed
13.378378378378379,14.521558607261788,PraatF0,Praat (F0),harmonicity,#11A3FF,Compressed
13.393393393393394,14.528645076425153,PraatF0,Praat (F0),harmonicity,#11A3FF,Compressed
13.408408408408409,11.833137584318912,PraatF0,Praat (F0),harmonicity,#11A3FF,Compressed
13.423423423423424,11.84193687272419,PraatF0,Praat (F0),harmonicity,#11A3FF,Compressed
13.438438438438439,11.85050378504366,PraatF0,Praat (F0),harmonicity,#11A3FF,Compressed
13.453453453453454,11.85916539008006,PraatF0,Praat (F0),harmonicity,#11A3FF,Compressed
13.468468468468469,15.441420427682678,PraatF0,Praat (F0),harmonicity,#11A3FF,Compressed
13.483483483483484,15.4536224862746,PraatF0,Praat (F0),harmonicity,#11A3FF,Compressed
13.498498498498499,15.466196976681621,PraatF0,Praat (F0),harmonicity,#11A3FF,Compressed
13.513513513513514,15.47901472423897,PraatF0,Praat (F0),harmonicity,#11A3FF,Compressed
13.528528528528529,25.90454920391221,PraatF0,Praat (F0),harmonicity,#11A3FF,Compressed
13.543543543543544,25.923836346405686,PraatF0,Praat (F0),harmonicity,#11A3FF,Compressed
13.558558558558559,25.940421826660817,PraatF0,Praat (F0),harmonicity,#11A3FF,Compressed
13.573573573573574,25.956230276798212,PraatF0,Praat (F0),harmonicity,#11A3FF,Compressed
13.588588588588589,25.97489740545058,PraatF0,Praat (F0),harmonicity,#11A3FF,Compressed
13.603603603603604,25.99073577797781,PraatF0,Praat (F0),harmonicity,#11A3FF,Compressed
13.618618618618619,26.009197624210856,PraatF0,Praat (F0),harmonicity,#11A3FF,Compressed
13.633633633633634,18.52021159799071,PraatF0,Praat (F0),harmonicity,#11A3FF,Compressed
13.64864864864865,18.532641570398898,PraatF0,Praat (F0),harmonicity,#11A3FF,Compressed
13.663663663663664,18.546436671124283,PraatF0,Praat (F0),harmonicity,#11A3FF,Compressed
13.67867867867868,18.56057099725323,PraatF0,Praat (F0),harmonicity,#11A3FF,Compressed
13.693693693693694,28.9073618424065,PraatF0,Praat (F0),harmonicity,#11A3FF,Compressed
13.70870870870871,28.929157804712773,PraatF0,Praat (F0),harmonicity,#11A3FF,Compressed
13.723723723723724,28.94993951449672,PraatF0,Praat (F0),harmonicity,#11A3FF,Compressed
13.73873873873874,28.970163968343197,PraatF0,Praat (F0),harmonicity,#11A3FF,Compressed
13.753753753753754,28.99019310733993,PraatF0,Praat (F0),harmonicity,#11A3FF,Compressed
13.76876876876877,29.010339320253344,PraatF0,Praat (F0),harmonicity,#11A3FF,Compressed
13.783783783783784,29.03090758223895,PraatF0,Praat (F0),harmonicity,#11A3FF,Compressed
13.7987987987988,29.052220705630823,PraatF0,Praat (F0),harmonicity,#11A3FF,Compressed
13.813813813813814,26.318134319491094,PraatF0,Praat (F0),harmonicity,#11A3FF,Compressed
13.82882882882883,26.33678113179262,PraatF0,Praat (F0),harmonicity,#11A3FF,Compressed
13.843843843843844,26.35521679772916,PraatF0,Praat (F0),harmonicity,#11A3FF,Compressed
13.85885885885886,26.37365359896002,PraatF0,Praat (F0),harmonicity,#11A3FF,Compressed
13.873873873873874,26.392295665703273,PraatF0,Praat (F0),harmonicity,#11A3FF,Compressed
13.88888888888889,26.411357358893518,PraatF0,Praat (F0),harmonicity,#11A3FF,Compressed
13.903903903903904,52.78483690243719,PraatF0,Praat (F0),harmonicity,#11A3FF,Compressed
13.91891891891892,15.41828678506373,PraatF0,Praat (F0),harmonicity,#11A3FF,Compressed
13.933933933933934,15.430310604868458,PraatF0,Praat (F0),harmonicity,#11A3FF,Compressed
13.94894894894895,15.442388534814924,PraatF0,Praat (F0),harmonicity,#11A3FF,Compressed
13.963963963963964,15.454765487026634,PraatF0,Praat (F0),harmonicity,#11A3FF,Compressed
13.97897897897898,15.467528949149028,PraatF0,Praat (F0),harmonicity,#11A3FF,Compressed
13.993993993993994,15.4805387929178,PraatF0,Praat (F0),harmonicity,#11A3FF,Compressed
14.00900900900901,15.493496276649164,PraatF0,Praat (F0),harmonicity,#11A3FF,Compressed
14.024024024024024,15.506182669372894,PraatF0,Praat (F0),harmonicity,#11A3FF,Compressed
14.03903903903904,45.069534587306805,PraatF0,Praat (F0),harmonicity,#11A3FF,Compressed
14.054054054054054,23.636061381769693,PraatF0,Praat (F0),harmonicity,#11A3FF,Compressed
14.06906906906907,23.653951785731195,PraatF0,Praat (F0),harmonicity,#11A3FF,Compressed
14.084084084084084,32.74732148985701,PraatF0,Praat (F0),harmonicity,#11A3FF,Compressed
14.0990990990991,32.774254937952975,PraatF0,Praat (F0),harmonicity,#11A3FF,Compressed
14.114114114114114,32.80063754237293,PraatF0,Praat (F0),harmonicity,#11A3FF,Compressed
14.12912912912913,32.826604031099926,PraatF0,Praat (F0),harmonicity,#11A3FF,Compressed
14.144144144144144,32.85231734196742,PraatF0,Praat (F0),harmonicity,#11A3FF,Compressed
14.15915915915916,11.849829292797569,PraatF0,Praat (F0),harmonicity,#11A3FF,Compressed
14.174174174174174,32.90367208921973,PraatF0,Praat (F0),harmonicity,#11A3FF,Compressed
14.18918918918919,32.92965860919752,PraatF0,Praat (F0),harmonicity,#11A3FF,Compressed
14.204204204204204,32.95607354186381,PraatF0,Praat (F0),harmonicity,#11A3FF,Compressed
14.21921921921922,18.502330984268944,PraatF0,Praat (F0),harmonicity,#11A3FF,Compressed
14.234234234234235,18.516148131642723,PraatF0,Praat (F0),harmonicity,#11A3FF,Compressed
14.24924924924925,18.529732336961104,PraatF0,Praat (F0),harmonicity,#11A3FF,Compressed
14.264264264264265,18.543454213018784,PraatF0,Praat (F0),harmonicity,#11A3FF,Compressed
14.27927927927928,12.443316587085675,PraatF0,Praat (F0),harmonicity,#11A3FF,Compressed
14.294294294294295,12.453837551891883,PraatF0,Praat (F0),harmonicity,#11A3FF,Compressed
14.30930930930931,12.463447409497416,PraatF0,Praat (F0),harmonicity,#11A3FF,Compressed
14.324324324324325,12.472760092299453,PraatF0,Praat (F0),harmonicity,#11A3FF,Compressed
14.33933933933934,12.482190332934909,PraatF0,Praat (F0),harmonicity,#11A3FF,Compressed
14.354354354354355,10.357115740277338,PraatF0,Praat (F0),harmonicity,#11A3FF,Compressed
14.36936936936937,10.364835839744586,PraatF0,Praat (F0),harmonicity,#11A3FF,Compressed
14.384384384384385,20.015347247363792,PraatF0,Praat (F0),harmonicity,#11A3FF,Compressed
14.3993993993994,20.029255984907245,PraatF0,Praat (F0),harmonicity,#11A3FF,Compressed
14.414414414414415,20.04327861621294,PraatF0,Praat (F0),harmonicity,#11A3FF,Compressed
14.42942942942943,20.057623253211197,PraatF0,Praat (F0),harmonicity,#11A3FF,Compressed
14.444444444444445,11.82008124116837,PraatF0,Praat (F0),harmonicity,#11A3FF,Compressed
14.45945945945946,11.82998704616984,PraatF0,Praat (F0),harmonicity,#11A3FF,Compressed
14.474474474474475,11.839576024370718,PraatF0,Praat (F0),harmonicity,#11A3FF,Compressed
14.48948948948949,11.848899831233599,PraatF0,Praat (F0),harmonicity,#11A3FF,Compressed
14.504504504504505,11.858182218200028,PraatF0,Praat (F0),harmonicity,#11A3FF,Compressed
14.51951951951952,11.867755502043245,PraatF0,Praat (F0),harmonicity,#11A3FF,Compressed
14.534534534534535,11.878019494907349,PraatF0,Praat (F0),harmonicity,#11A3FF,Compressed
14.54954954954955,28.910647591688175,PraatF0,Praat (F0),harmonicity,#11A3FF,Compressed
14.564564564564565,28.93318755580029,PraatF0,Praat (F0),harmonicity,#11A3FF,Compressed
14.57957957957958,10.491493088758151,PraatF0,Praat (F0),harmonicity,#11A3FF,Compressed
14.594594594594595,28.976076821051656,PraatF0,Praat (F0),harmonicity,#11A3FF,Compressed
14.60960960960961,28.99697775202685,PraatF0,Praat (F0),harmonicity,#11A3FF,Compressed
14.624624624624625,29.017648089323835,PraatF0,Praat (F0),harmonicity,#11A3FF,Compressed
14.63963963963964,29.039922502983334,PraatF0,Praat (F0),harmonicity,#11A3FF,Compressed
14.654654654654655,29.06239154008738,PraatF0,Praat (F0),harmonicity,#11A3FF,Compressed
14.66966966966967,29.067695804482124,PraatF0,Praat (F0),harmonicity,#11A3FF,Compressed
14.684684684684685,21.81433064829401,PraatF0,Praat (F0),harmonicity,#11A3FF,Compressed
14.6996996996997,76.09049409198283,PraatF0,Praat (F0),harmonicity,#11A3FF,Compressed
14.714714714714715,76.16417350766154,PraatF0,Praat (F0),harmonicity,#11A3FF,Compressed
14.72972972972973,29.203449789069893,PraatF0,Praat (F0),harmonicity,#11A3FF,Compressed
14.744744744744745,13.092468948164113,PraatF0,Praat (F0),harmonicity,#11A3FF,Compressed
14.75975975975976,13.102817475519894,PraatF0,Praat (F0),harmonicity,#11A3FF,Compressed
14.774774774774775,29.281935681792646,PraatF0,Praat (F0),harmonicity,#11A3FF,Compressed
14.78978978978979,29.306948394605598,PraatF0,Praat (F0),harmonicity,#11A3FF,Compressed
14.804804804804805,11.82274896306529,PraatF0,Praat (F0),harmonicity,#11A3FF,Compressed
14.81981981981982,11.832344293251257,PraatF0,Praat (F0),harmonicity,#11A3FF,Compressed
14.834834834834835,11.841544590844403,PraatF0,Praat (F0),harmonicity,#11A3FF,Compressed
14.84984984984985,11.8503857279288,PraatF0,Praat (F0),harmonicity,#11A3FF,Compressed
14.864864864864865,11.859077652873026,PraatF0,Praat (F0),harmonicity,#11A3FF,Compressed
14.87987987987988,11.86806250925589,PraatF0,Praat (F0),harmonicity,#11A3FF,Compressed
14.894894894894895,15.424761093040457,PraatF0,Praat (F0),harmonicity,#11A3FF,Compressed
14.90990990990991,15.436895302235015,PraatF0,Praat (F0),harmonicity,#11A3FF,Compressed
14.924924924924925,15.44922382352285,PraatF0,Praat (F0),harmonicity,#11A3FF,Compressed
14.93993993993994,19.977826703069503,PraatF0,Praat (F0),harmonicity,#11A3FF,Compressed
14.954954954954955,19.994326022528845,PraatF0,Praat (F0),harmonicity,#11A3FF,Compressed
14.96996996996997,20.010106317840478,PraatF0,Praat (F0),harmonicity,#11A3FF,Compressed
14.984984984984985,20.02541991953575,PraatF0,Praat (F0),harmonicity,#11A3FF,Compressed
15,20.040551439294074,PraatF0,Praat (F0),harmonicity,#11A3FF,Compressed
