interval,output,model_id,model_label,model_theory,model_colour,timbre_label
0,0.9788159612687167,Milne13,Milne (2013),harmonicity,#11A3FF,Piano
0.015015015015015015,0.9783357741587317,Milne13,Milne (2013),harmonicity,#11A3FF,Piano
0.03003003003003003,0.9774637150642415,Milne13,Milne (2013),harmonicity,#11A3FF,Piano
0.04504504504504504,0.9758103251449584,Milne13,Milne (2013),harmonicity,#11A3FF,Piano
0.06006006006006006,0.9727715802010529,Milne13,Milne (2013),harmonicity,#11A3FF,Piano
0.07507507507507508,0.9675889472505782,Milne13,Milne (2013),harmonicity,#11A3FF,Piano
0.09009009009009009,0.9594527727058023,Milne13,Milne (2013),harmonicity,#11A3FF,Piano
0.10510510510510511,0.9475659388989897,Milne13,Milne (2013),harmonicity,#11A3FF,Piano
0.12012012012012012,0.9312000638371004,Milne13,Milne (2013),harmonicity,#11A3FF,Piano
0.13513513513513514,0.9098551751312117,Milne13,Milne (2013),harmonicity,#11A3FF,Piano
0.15015015015015015,0.8835641307959547,Milne13,Milne (2013),harmonicity,#11A3FF,Piano
0.16516516516516516,0.8532552246975444,Milne13,Milne (2013),harmonicity,#11A3FF,Piano
0.18018018018018017,0.8209515244589859,Milne13,Milne (2013),harmonicity,#11A3FF,Piano
0.19519519519519518,0.7895025144403736,Milne13,Milne (2013),harmonicity,#11A3FF,Piano
0.21021021021021022,0.7617489831998645,Milne13,Milne (2013),harmonicity,#11A3FF,Piano
0.22522522522522523,0.7395401451563922,Milne13,Milne (2013),harmonicity,#11A3FF,Piano
0.24024024024024024,0.7232717825257233,Milne13,Milne (2013),harmonicity,#11A3FF,Piano
0.2552552552552553,0.712172799963078,Milne13,Milne (2013),harmonicity,#11A3FF,Piano
0.2702702702702703,0.7049614041317152,Milne13,Milne (2013),harmonicity,#11A3FF,Piano
0.2852852852852853,0.7003934318827848,Milne13,Milne (2013),harmonicity,#11A3FF,Piano
0.3003003003003003,0.6975207559959893,Milne13,Milne (2013),harmonicity,#11A3FF,Piano
0.3153153153153153,0.6957183003034982,Milne13,Milne (2013),harmonicity,#11A3FF,Piano
0.3303303303303303,0.6945994937428389,Milne13,Milne (2013),harmonicity,#11A3FF,Piano
0.34534534534534533,0.6939193208203112,Milne13,Milne (2013),harmonicity,#11A3FF,Piano
0.36036036036036034,0.6935143332900727,Milne13,Milne (2013),harmonicity,#11A3FF,Piano
0.37537537537537535,0.6932762884015332,Milne13,Milne (2013),harmonicity,#11A3FF,Piano
0.39039039039039036,0.6931374102956509,Milne13,Milne (2013),harmonicity,#11A3FF,Piano
0.40540540540540543,0.6930571515375602,Milne13,Milne (2013),harmonicity,#11A3FF,Piano
0.42042042042042044,0.693011464691727,Milne13,Milne (2013),harmonicity,#11A3FF,Piano
0.43543543543543545,0.6929859611178055,Milne13,Milne (2013),harmonicity,#11A3FF,Piano
0.45045045045045046,0.6929720307613284,Milne13,Milne (2013),harmonicity,#11A3FF,Piano
0.46546546546546547,0.6929645930531859,Milne13,Milne (2013),harmonicity,#11A3FF,Piano
0.4804804804804805,0.6929607139396001,Milne13,Milne (2013),harmonicity,#11A3FF,Piano
0.4954954954954955,0.692958738924793,Milne13,Milne (2013),harmonicity,#11A3FF,Piano
0.5105105105105106,0.69295775758635,Milne13,Milne (2013),harmonicity,#11A3FF,Piano
0.5255255255255256,0.6929572815749382,Milne13,Milne (2013),harmonicity,#11A3FF,Piano
0.5405405405405406,0.6929570560048319,Milne13,Milne (2013),harmonicity,#11A3FF,Piano
0.5555555555555556,0.6929569514771335,Milne13,Milne (2013),harmonicity,#11A3FF,Piano
0.5705705705705706,0.6929569039650678,Milne13,Milne (2013),harmonicity,#11A3FF,Piano
0.5855855855855856,0.692956882600545,Milne13,Milne (2013),harmonicity,#11A3FF,Piano
0.6006006006006006,0.6929568729904393,Milne13,Milne (2013),harmonicity,#11A3FF,Piano
0.6156156156156156,0.6929568686694328,Milne13,Milne (2013),harmonicity,#11A3FF,Piano
0.6306306306306306,0.6929568667706386,Milne13,Milne (2013),harmonicity,#11A3FF,Piano
0.6456456456456456,0.6929568659792191,Milne13,Milne (2013),harmonicity,#11A3FF,Piano
0.6606606606606606,0.6929568656704612,Milne13,Milne (2013),harmonicity,#11A3FF,Piano
0.6756756756756757,0.6929568655563162,Milne13,Milne (2013),harmonicity,#11A3FF,Piano
0.6906906906906907,0.6929568655152484,Milne13,Milne (2013),harmonicity,#11A3FF,Piano
0.7057057057057057,0.6929568655005703,Milne13,Milne (2013),harmonicity,#11A3FF,Piano
0.7207207207207207,0.6929568654953405,Milne13,Milne (2013),harmonicity,#11A3FF,Piano
0.7357357357357357,0.6929568654934971,Milne13,Milne (2013),harmonicity,#11A3FF,Piano
0.7507507507507507,0.6929568654928587,Milne13,Milne (2013),harmonicity,#11A3FF,Piano
0.7657657657657657,0.6929568654926436,Milne13,Milne (2013),harmonicity,#11A3FF,Piano
0.7807807807807807,0.6929568654925761,Milne13,Milne (2013),harmonicity,#11A3FF,Piano
0.7957957957957957,0.6929568654925647,Milne13,Milne (2013),harmonicity,#11A3FF,Piano
0.8108108108108109,0.6929568654925907,Milne13,Milne (2013),harmonicity,#11A3FF,Piano
0.8258258258258259,0.6929568654926797,Milne13,Milne (2013),harmonicity,#11A3FF,Piano
0.8408408408408409,0.6929568654929211,Milne13,Milne (2013),harmonicity,#11A3FF,Piano
0.8558558558558559,0.6929568654935443,Milne13,Milne (2013),harmonicity,#11A3FF,Piano
0.8708708708708709,0.6929568654950743,Milne13,Milne (2013),harmonicity,#11A3FF,Piano
0.8858858858858859,0.6929568654985419,Milne13,Milne (2013),harmonicity,#11A3FF,Piano
0.9009009009009009,0.6929568655054852,Milne13,Milne (2013),harmonicity,#11A3FF,Piano
0.9159159159159159,0.6929568655172057,Milne13,Milne (2013),harmonicity,#11A3FF,Piano
0.9309309309309309,0.6929568655338533,Milne13,Milne (2013),harmonicity,#11A3FF,Piano
0.9459459459459459,0.6929568655592665,Milne13,Milne (2013),harmonicity,#11A3FF,Piano
0.960960960960961,0.6929568656285964,Milne13,Milne (2013),harmonicity,#11A3FF,Piano
0.975975975975976,0.6929568658865102,Milne13,Milne (2013),harmonicity,#11A3FF,Piano
0.990990990990991,0.6929568667354459,Milne13,Milne (2013),harmonicity,#11A3FF,Piano
1.006006006006006,0.692956869030323,Milne13,Milne (2013),harmonicity,#11A3FF,Piano
1.021021021021021,0.6929568742563298,Milne13,Milne (2013),harmonicity,#11A3FF,Piano
1.0360360360360361,0.6929568846182426,Milne13,Milne (2013),harmonicity,#11A3FF,Piano
1.0510510510510511,0.6929569028202566,Milne13,Milne (2013),harmonicity,#11A3FF,Piano
1.0660660660660661,0.6929569312271008,Milne13,Milne (2013),harmonicity,#11A3FF,Piano
1.0810810810810811,0.6929569719100248,Milne13,Milne (2013),harmonicity,#11A3FF,Piano
1.0960960960960962,0.692957033319927,Milne13,Milne (2013),harmonicity,#11A3FF,Piano
1.1111111111111112,0.6929571471117032,Milne13,Milne (2013),harmonicity,#11A3FF,Piano
1.1261261261261262,0.6929573830588621,Milne13,Milne (2013),harmonicity,#11A3FF,Piano
1.1411411411411412,0.6929578562221871,Milne13,Milne (2013),harmonicity,#11A3FF,Piano
1.1561561561561562,0.692958785647283,Milne13,Milne (2013),harmonicity,#11A3FF,Piano
1.1711711711711712,0.6929606664469378,Milne13,Milne (2013),harmonicity,#11A3FF,Piano
1.1861861861861862,0.6929643984773599,Milne13,Milne (2013),harmonicity,#11A3FF,Piano
1.2012012012012012,0.69297110611614,Milne13,Milne (2013),harmonicity,#11A3FF,Piano
1.2162162162162162,0.6929819262276815,Milne13,Milne (2013),harmonicity,#11A3FF,Piano
1.2312312312312312,0.6929985442545779,Milne13,Milne (2013),harmonicity,#11A3FF,Piano
1.2462462462462462,0.693024233235041,Milne13,Milne (2013),harmonicity,#11A3FF,Piano
1.2612612612612613,0.6930636216723707,Milne13,Milne (2013),harmonicity,#11A3FF,Piano
1.2762762762762763,0.6931205714768194,Milne13,Milne (2013),harmonicity,#11A3FF,Piano
1.2912912912912913,0.6931965279228023,Milne13,Milne (2013),harmonicity,#11A3FF,Piano
1.3063063063063063,0.6932915534527525,Milne13,Milne (2013),harmonicity,#11A3FF,Piano
1.3213213213213213,0.6934068088025273,Milne13,Milne (2013),harmonicity,#11A3FF,Piano
1.3363363363363363,0.6935455047466307,Milne13,Milne (2013),harmonicity,#11A3FF,Piano
1.3513513513513513,0.6937109383166024,Milne13,Milne (2013),harmonicity,#11A3FF,Piano
1.3663663663663663,0.6939030612241587,Milne13,Milne (2013),harmonicity,#11A3FF,Piano
1.3813813813813813,0.6941168893612158,Milne13,Milne (2013),harmonicity,#11A3FF,Piano
1.3963963963963963,0.6943444697103079,Milne13,Milne (2013),harmonicity,#11A3FF,Piano
1.4114114114114114,0.694577922196032,Milne13,Milne (2013),harmonicity,#11A3FF,Piano
1.4264264264264264,0.6948097748050495,Milne13,Milne (2013),harmonicity,#11A3FF,Piano
1.4414414414414414,0.6950306003132658,Milne13,Milne (2013),harmonicity,#11A3FF,Piano
1.4564564564564564,0.6952277455218888,Milne13,Milne (2013),harmonicity,#11A3FF,Piano
1.4714714714714714,0.6953876254081062,Milne13,Milne (2013),harmonicity,#11A3FF,Piano
1.4864864864864864,0.695499845132962,Milne13,Milne (2013),harmonicity,#11A3FF,Piano
1.5015015015015014,0.6955598633908923,Milne13,Milne (2013),harmonicity,#11A3FF,Piano
1.5165165165165164,0.6955689503596916,Milne13,Milne (2013),harmonicity,#11A3FF,Piano
1.5315315315315314,0.69553330571946,Milne13,Milne (2013),harmonicity,#11A3FF,Piano
1.5465465465465464,0.6954655635144001,Milne13,Milne (2013),harmonicity,#11A3FF,Piano
1.5615615615615615,0.6953882600314645,Milne13,Milne (2013),harmonicity,#11A3FF,Piano
1.5765765765765765,0.6953325441371717,Milne13,Milne (2013),harmonicity,#11A3FF,Piano
1.5915915915915915,0.6953267100479505,Milne13,Milne (2013),harmonicity,#11A3FF,Piano
1.6066066066066067,0.6953809628921448,Milne13,Milne (2013),harmonicity,#11A3FF,Piano
1.6216216216216217,0.6954824777997973,Milne13,Milne (2013),harmonicity,#11A3FF,Piano
1.6366366366366367,0.695605496728863,Milne13,Milne (2013),harmonicity,#11A3FF,Piano
1.6516516516516517,0.6957263710601769,Milne13,Milne (2013),harmonicity,#11A3FF,Piano
1.6666666666666667,0.6958319971137756,Milne13,Milne (2013),harmonicity,#11A3FF,Piano
1.6816816816816818,0.6959199576603123,Milne13,Milne (2013),harmonicity,#11A3FF,Piano
1.6966966966966968,0.6959952974670924,Milne13,Milne (2013),harmonicity,#11A3FF,Piano
1.7117117117117118,0.6960678825995058,Milne13,Milne (2013),harmonicity,#11A3FF,Piano
1.7267267267267268,0.6961512100272443,Milne13,Milne (2013),harmonicity,#11A3FF,Piano
1.7417417417417418,0.6962621538601177,Milne13,Milne (2013),harmonicity,#11A3FF,Piano
1.7567567567567568,0.6964211253451902,Milne13,Milne (2013),harmonicity,#11A3FF,Piano
1.7717717717717718,0.6966523411435384,Milne13,Milne (2013),harmonicity,#11A3FF,Piano
1.7867867867867868,0.6969839519138519,Milne13,Milne (2013),harmonicity,#11A3FF,Piano
1.8018018018018018,0.6974477416901501,Milne13,Milne (2013),harmonicity,#11A3FF,Piano
1.8168168168168168,0.698078078693495,Milne13,Milne (2013),harmonicity,#11A3FF,Piano
1.8318318318318318,0.6989098628465215,Milne13,Milne (2013),harmonicity,#11A3FF,Piano
1.8468468468468469,0.6999754087147102,Milne13,Milne (2013),harmonicity,#11A3FF,Piano
1.8618618618618619,0.7013004131497061,Milne13,Milne (2013),harmonicity,#11A3FF,Piano
1.8768768768768769,0.7028991903117199,Milne13,Milne (2013),harmonicity,#11A3FF,Piano
1.8918918918918919,0.7047693818716154,Milne13,Milne (2013),harmonicity,#11A3FF,Piano
1.906906906906907,0.7068867709208094,Milne13,Milne (2013),harmonicity,#11A3FF,Piano
1.921921921921922,0.7092011919060153,Milne13,Milne (2013),harmonicity,#11A3FF,Piano
1.936936936936937,0.7116340223698204,Milne13,Milne (2013),harmonicity,#11A3FF,Piano
1.951951951951952,0.714078180286453,Milne13,Milne (2013),harmonicity,#11A3FF,Piano
1.966966966966967,0.7164056552574171,Milne13,Milne (2013),harmonicity,#11A3FF,Piano
1.981981981981982,0.7184894477019867,Milne13,Milne (2013),harmonicity,#11A3FF,Piano
1.996996996996997,0.7202332946712849,Milne13,Milne (2013),harmonicity,#11A3FF,Piano
2.012012012012012,0.721582463102703,Milne13,Milne (2013),harmonicity,#11A3FF,Piano
2.027027027027027,0.7224999255090732,Milne13,Milne (2013),harmonicity,#11A3FF,Piano
2.042042042042042,0.7229362232484695,Milne13,Milne (2013),harmonicity,#11A3FF,Piano
2.057057057057057,0.7228362117036653,Milne13,Milne (2013),harmonicity,#11A3FF,Piano
2.0720720720720722,0.722183400443689,Milne13,Milne (2013),harmonicity,#11A3FF,Piano
2.0870870870870872,0.721039204652082,Milne13,Milne (2013),harmonicity,#11A3FF,Piano
2.1021021021021022,0.7195408247081329,Milne13,Milne (2013),harmonicity,#11A3FF,Piano
2.1171171171171173,0.7178637482238931,Milne13,Milne (2013),harmonicity,#11A3FF,Piano
2.1321321321321323,0.7161863549541866,Milne13,Milne (2013),harmonicity,#11A3FF,Piano
2.1471471471471473,0.7146834427419358,Milne13,Milne (2013),harmonicity,#11A3FF,Piano
2.1621621621621623,0.713537940143605,Milne13,Milne (2013),harmonicity,#11A3FF,Piano
2.1771771771771773,0.7129350411576808,Milne13,Milne (2013),harmonicity,#11A3FF,Piano
2.1921921921921923,0.7130133757592954,Milne13,Milne (2013),harmonicity,#11A3FF,Piano
2.2072072072072073,0.71379127003046,Milne13,Milne (2013),harmonicity,#11A3FF,Piano
2.2222222222222223,0.71512612975394,Milne13,Milne (2013),harmonicity,#11A3FF,Piano
2.2372372372372373,0.7167524993628283,Milne13,Milne (2013),harmonicity,#11A3FF,Piano
2.2522522522522523,0.7183839191926329,Milne13,Milne (2013),harmonicity,#11A3FF,Piano
2.2672672672672673,0.719810120146968,Milne13,Milne (2013),harmonicity,#11A3FF,Piano
2.2822822822822824,0.7209196358730741,Milne13,Milne (2013),harmonicity,#11A3FF,Piano
2.2972972972972974,0.72164284154338465,Milne13,Milne (2013),harmonicity,#11A3FF,Piano
2.3123123123123124,0.7218925279588942,Milne13,Milne (2013),harmonicity,#11A3FF,Piano
2.3273273273273274,0.7215748316046338,Milne13,Milne (2013),harmonicity,#11A3FF,Piano
2.3423423423423424,0.7206479503217575,Milne13,Milne (2013),harmonicity,#11A3FF,Piano
2.3573573573573574,0.7191541284404427,Milne13,Milne (2013),harmonicity,#11A3FF,Piano
2.3723723723723724,0.7172008909681508,Milne13,Milne (2013),harmonicity,#11A3FF,Piano
2.3873873873873874,0.7149250842336713,Milne13,Milne (2013),harmonicity,#11A3FF,Piano
2.4024024024024024,0.7124694465838329,Milne13,Milne (2013),harmonicity,#11A3FF,Piano
2.4174174174174174,0.7099727961698264,Milne13,Milne (2013),harmonicity,#11A3FF,Piano
2.4324324324324325,0.7075643986764668,Milne13,Milne (2013),harmonicity,#11A3FF,Piano
2.4474474474474475,0.7053576685312527,Milne13,Milne (2013),harmonicity,#11A3FF,Piano
2.4624624624624625,0.7034417373895283,Milne13,Milne (2013),harmonicity,#11A3FF,Piano
2.4774774774774775,0.7018698594614553,Milne13,Milne (2013),harmonicity,#11A3FF,Piano
2.4924924924924925,0.7006509684058773,Milne13,Milne (2013),harmonicity,#11A3FF,Piano
2.5075075075075075,0.6997596332078306,Milne13,Milne (2013),harmonicity,#11A3FF,Piano
2.5225225225225225,0.6991650694872835,Milne13,Milne (2013),harmonicity,#11A3FF,Piano
2.5375375375375375,0.698850602824017,Milne13,Milne (2013),harmonicity,#11A3FF,Piano
2.5525525525525525,0.6988016569441663,Milne13,Milne (2013),harmonicity,#11A3FF,Piano
2.5675675675675675,0.698981676349523,Milne13,Milne (2013),harmonicity,#11A3FF,Piano
2.5825825825825826,0.6993273019884938,Milne13,Milne (2013),harmonicity,#11A3FF,Piano
2.5975975975975976,0.6997635178179026,Milne13,Milne (2013),harmonicity,#11A3FF,Piano
2.6126126126126126,0.7002187976139341,Milne13,Milne (2013),harmonicity,#11A3FF,Piano
2.6276276276276276,0.700630999891405,Milne13,Milne (2013),harmonicity,#11A3FF,Piano
2.6426426426426426,0.7009489317345586,Milne13,Milne (2013),harmonicity,#11A3FF,Piano
2.6576576576576576,0.7011341041287602,Milne13,Milne (2013),harmonicity,#11A3FF,Piano
2.6726726726726726,0.7011620865802085,Milne13,Milne (2013),harmonicity,#11A3FF,Piano
2.6876876876876876,0.7010223979458355,Milne13,Milne (2013),harmonicity,#11A3FF,Piano
2.7027027027027026,0.700717462884491,Milne13,Milne (2013),harmonicity,#11A3FF,Piano
2.7177177177177176,0.7002616284547615,Milne13,Milne (2013),harmonicity,#11A3FF,Piano
2.7327327327327327,0.6996806699329824,Milne13,Milne (2013),harmonicity,#11A3FF,Piano
2.7477477477477477,0.6990104278135301,Milne13,Milne (2013),harmonicity,#11A3FF,Piano
2.7627627627627627,0.6982918275133659,Milne13,Milne (2013),harmonicity,#11A3FF,Piano
2.7777777777777777,0.6975626514461776,Milne13,Milne (2013),harmonicity,#11A3FF,Piano
2.7927927927927927,0.6968517793585032,Milne13,Milne (2013),harmonicity,#11A3FF,Piano
2.8078078078078077,0.6961802587870483,Milne13,Milne (2013),harmonicity,#11A3FF,Piano
2.8228228228228227,0.6955661679260415,Milne13,Milne (2013),harmonicity,#11A3FF,Piano
2.8378378378378377,0.6950272880383728,Milne13,Milne (2013),harmonicity,#11A3FF,Piano
2.8528528528528527,0.6945794813824668,Milne13,Milne (2013),harmonicity,#11A3FF,Piano
2.8678678678678677,0.6942335666204503,Milne13,Milne (2013),harmonicity,#11A3FF,Piano
2.8828828828828827,0.6939952206526439,Milne13,Milne (2013),harmonicity,#11A3FF,Piano
2.8978978978978978,0.6938686696181583,Milne13,Milne (2013),harmonicity,#11A3FF,Piano
2.9129129129129128,0.6938593451420717,Milne13,Milne (2013),harmonicity,#11A3FF,Piano
2.9279279279279278,0.6939719907026025,Milne13,Milne (2013),harmonicity,#11A3FF,Piano
2.942942942942943,0.6942074697337504,Milne13,Milne (2013),harmonicity,#11A3FF,Piano
2.957957957957958,0.6945629060766624,Milne13,Milne (2013),harmonicity,#11A3FF,Piano
2.972972972972973,0.6950343097450403,Milne13,Milne (2013),harmonicity,#11A3FF,Piano
2.987987987987988,0.6956176845394082,Milne13,Milne (2013),harmonicity,#11A3FF,Piano
3.003003003003003,0.6963072205310565,Milne13,Milne (2013),harmonicity,#11A3FF,Piano
3.018018018018018,0.6970922512701729,Milne13,Milne (2013),harmonicity,#11A3FF,Piano
3.033033033033033,0.6979548187115371,Milne13,Milne (2013),harmonicity,#11A3FF,Piano
3.048048048048048,0.6988685369211489,Milne13,Milne (2013),harmonicity,#11A3FF,Piano
3.063063063063063,0.6997987974693334,Milne13,Milne (2013),harmonicity,#11A3FF,Piano
3.078078078078078,0.7007042631434603,Milne13,Milne (2013),harmonicity,#11A3FF,Piano
3.093093093093093,0.7015395486519154,Milne13,Milne (2013),harmonicity,#11A3FF,Piano
3.108108108108108,0.7022588255395398,Milne13,Milne (2013),harmonicity,#11A3FF,Piano
3.123123123123123,0.702819925795215,Milne13,Milne (2013),harmonicity,#11A3FF,Piano
3.138138138138138,0.7031884231432102,Milne13,Milne (2013),harmonicity,#11A3FF,Piano
3.153153153153153,0.7033411525967236,Milne13,Milne (2013),harmonicity,#11A3FF,Piano
3.168168168168168,0.703268676765142,Milne13,Milne (2013),harmonicity,#11A3FF,Piano
3.183183183183183,0.7029763411476232,Milne13,Milne (2013),harmonicity,#11A3FF,Piano
3.198198198198198,0.7024837590431786,Milne13,Milne (2013),harmonicity,#11A3FF,Piano
3.2132132132132134,0.7018227977131376,Milne13,Milne (2013),harmonicity,#11A3FF,Piano
3.2282282282282284,0.7010343553650236,Milne13,Milne (2013),harmonicity,#11A3FF,Piano
3.2432432432432434,0.7001643795581554,Milne13,Milne (2013),harmonicity,#11A3FF,Piano
3.2582582582582584,0.6992596613970294,Milne13,Milne (2013),harmonicity,#11A3FF,Piano
3.2732732732732734,0.6983639268500591,Milne13,Milne (2013),harmonicity,#11A3FF,Piano
3.2882882882882885,0.6975146569875964,Milne13,Milne (2013),harmonicity,#11A3FF,Piano
3.3033033033033035,0.6967409169872807,Milne13,Milne (2013),harmonicity,#11A3FF,Piano
3.3183183183183185,0.6960623020636943,Milne13,Milne (2013),harmonicity,#11A3FF,Piano
3.3333333333333335,0.6954889443008531,Milne13,Milne (2013),harmonicity,#11A3FF,Piano
3.3483483483483485,0.6950223986611096,Milne13,Milne (2013),harmonicity,#11A3FF,Piano
3.3633633633633635,0.6946571529584197,Milne13,Milne (2013),harmonicity,#11A3FF,Piano
3.3783783783783785,0.6943824867479198,Milne13,Milne (2013),harmonicity,#11A3FF,Piano
3.3933933933933935,0.6941844312329616,Milne13,Milne (2013),harmonicity,#11A3FF,Piano
3.4084084084084085,0.6940476386497675,Milne13,Milne (2013),harmonicity,#11A3FF,Piano
3.4234234234234235,0.6939570411138982,Milne13,Milne (2013),harmonicity,#11A3FF,Piano
3.4384384384384385,0.6938992493357626,Milne13,Milne (2013),harmonicity,#11A3FF,Piano
3.4534534534534536,0.6938637028133775,Milne13,Milne (2013),harmonicity,#11A3FF,Piano
3.4684684684684686,0.693843629539144,Milne13,Milne (2013),harmonicity,#11A3FF,Piano
3.4834834834834836,0.693836903311539,Milne13,Milne (2013),harmonicity,#11A3FF,Piano
3.4984984984984986,0.6938468999263753,Milne13,Milne (2013),harmonicity,#11A3FF,Piano
3.5135135135135136,0.6938834475757036,Milne13,Milne (2013),harmonicity,#11A3FF,Piano
3.5285285285285286,0.6939639384778955,Milne13,Milne (2013),harmonicity,#11A3FF,Piano
3.5435435435435436,0.6941146135742559,Milne13,Milne (2013),harmonicity,#11A3FF,Piano
3.5585585585585586,0.6943719509998972,Milne13,Milne (2013),harmonicity,#11A3FF,Piano
3.5735735735735736,0.6947840051459715,Milne13,Milne (2013),harmonicity,#11A3FF,Piano
3.5885885885885886,0.6954115359894009,Milne13,Milne (2013),harmonicity,#11A3FF,Piano
3.6036036036036037,0.6963289661116752,Milne13,Milne (2013),harmonicity,#11A3FF,Piano
3.6186186186186187,0.6976255101446819,Milne13,Milne (2013),harmonicity,#11A3FF,Piano
3.6336336336336337,0.6994063097201489,Milne13,Milne (2013),harmonicity,#11A3FF,Piano
3.6486486486486487,0.7017905571026509,Milne13,Milne (2013),harmonicity,#11A3FF,Piano
3.6636636636636637,0.7048994527876825,Milne13,Milne (2013),harmonicity,#11A3FF,Piano
3.6786786786786787,0.7088281879858497,Milne13,Milne (2013),harmonicity,#11A3FF,Piano
3.6936936936936937,0.7136086002061925,Milne13,Milne (2013),harmonicity,#11A3FF,Piano
3.7087087087087087,0.7191826241696446,Milne13,Milne (2013),harmonicity,#11A3FF,Piano
3.7237237237237237,0.7254016528368565,Milne13,Milne (2013),harmonicity,#11A3FF,Piano
3.7387387387387387,0.7320460083166721,Milne13,Milne (2013),harmonicity,#11A3FF,Piano
3.7537537537537538,0.7388488760796271,Milne13,Milne (2013),harmonicity,#11A3FF,Piano
3.7687687687687688,0.7455195051888359,Milne13,Milne (2013),harmonicity,#11A3FF,Piano
3.7837837837837838,0.7517696149578806,Milne13,Milne (2013),harmonicity,#11A3FF,Piano
3.798798798798799,0.7573395514373652,Milne13,Milne (2013),harmonicity,#11A3FF,Piano
3.813813813813814,0.7620101764984536,Milne13,Milne (2013),harmonicity,#11A3FF,Piano
3.828828828828829,0.7655943701860142,Milne13,Milne (2013),harmonicity,#11A3FF,Piano
3.843843843843844,0.7679258140152888,Milne13,Milne (2013),harmonicity,#11A3FF,Piano
3.858858858858859,0.7688720583943764,Milne13,Milne (2013),harmonicity,#11A3FF,Piano
3.873873873873874,0.7683726138736182,Milne13,Milne (2013),harmonicity,#11A3FF,Piano
3.888888888888889,0.7664661192397964,Milne13,Milne (2013),harmonicity,#11A3FF,Piano
3.903903903903904,0.7632738264648333,Milne13,Milne (2013),harmonicity,#11A3FF,Piano
3.918918918918919,0.7589554844731309,Milne13,Milne (2013),harmonicity,#11A3FF,Piano
3.933933933933934,0.7536867649842597,Milne13,Milne (2013),harmonicity,#11A3FF,Piano
3.948948948948949,0.7476777053385347,Milne13,Milne (2013),harmonicity,#11A3FF,Piano
3.963963963963964,0.7411982062415291,Milne13,Milne (2013),harmonicity,#11A3FF,Piano
3.978978978978979,0.7345626897351176,Milne13,Milne (2013),harmonicity,#11A3FF,Piano
3.993993993993994,0.7280619415993873,Milne13,Milne (2013),harmonicity,#11A3FF,Piano
4.009009009009009,0.721893346442982,Milne13,Milne (2013),harmonicity,#11A3FF,Piano
4.024024024024024,0.7161714710446021,Milne13,Milne (2013),harmonicity,#11A3FF,Piano
4.039039039039039,0.7110164152092043,Milne13,Milne (2013),harmonicity,#11A3FF,Piano
4.054054054054054,0.7065942992925359,Milne13,Milne (2013),harmonicity,#11A3FF,Piano
4.069069069069069,0.7030353125475245,Milne13,Milne (2013),harmonicity,#11A3FF,Piano
4.084084084084084,0.7003348791080143,Milne13,Milne (2013),harmonicity,#11A3FF,Piano
4.099099099099099,0.6983665393177697,Milne13,Milne (2013),harmonicity,#11A3FF,Piano
4.114114114114114,0.6969777326564279,Milne13,Milne (2013),harmonicity,#11A3FF,Piano
4.129129129129129,0.6960523444542858,Milne13,Milne (2013),harmonicity,#11A3FF,Piano
4.1441441441441444,0.6954983673760955,Milne13,Milne (2013),harmonicity,#11A3FF,Piano
4.1591591591591595,0.6952148736878613,Milne13,Milne (2013),harmonicity,#11A3FF,Piano
4.1741741741741745,0.6950922387307297,Milne13,Milne (2013),harmonicity,#11A3FF,Piano
4.1891891891891895,0.6950390424058734,Milne13,Milne (2013),harmonicity,#11A3FF,Piano
4.2042042042042045,0.6950002079564656,Milne13,Milne (2013),harmonicity,#11A3FF,Piano
4.2192192192192195,0.6949527637699227,Milne13,Milne (2013),harmonicity,#11A3FF,Piano
4.2342342342342345,0.694891852325267,Milne13,Milne (2013),harmonicity,#11A3FF,Piano
4.2492492492492495,0.6948210342225304,Milne13,Milne (2013),harmonicity,#11A3FF,Piano
4.2642642642642645,0.6947490904783632,Milne13,Milne (2013),harmonicity,#11A3FF,Piano
4.2792792792792795,0.6946883110223324,Milne13,Milne (2013),harmonicity,#11A3FF,Piano
4.2942942942942945,0.6946501860049761,Milne13,Milne (2013),harmonicity,#11A3FF,Piano
4.3093093093093096,0.6946392683544622,Milne13,Milne (2013),harmonicity,#11A3FF,Piano
4.324324324324325,0.6946495020300473,Milne13,Milne (2013),harmonicity,#11A3FF,Piano
4.33933933933934,0.6946659362926652,Milne13,Milne (2013),harmonicity,#11A3FF,Piano
4.354354354354355,0.6946704885380296,Milne13,Milne (2013),harmonicity,#11A3FF,Piano
4.36936936936937,0.6946481636560368,Milne13,Milne (2013),harmonicity,#11A3FF,Piano
4.384384384384385,0.6945910408550504,Milne13,Milne (2013),harmonicity,#11A3FF,Piano
4.3993993993994,0.6944991461150118,Milne13,Milne (2013),harmonicity,#11A3FF,Piano
4.414414414414415,0.6943785690647303,Milne13,Milne (2013),harmonicity,#11A3FF,Piano
4.42942942942943,0.6942381691564546,Milne13,Milne (2013),harmonicity,#11A3FF,Piano
4.444444444444445,0.6940868031912879,Milne13,Milne (2013),harmonicity,#11A3FF,Piano
4.45945945945946,0.6939321663149671,Milne13,Milne (2013),harmonicity,#11A3FF,Piano
4.474474474474475,0.6937807480455955,Milne13,Milne (2013),harmonicity,#11A3FF,Piano
4.48948948948949,0.6936379232601031,Milne13,Milne (2013),harmonicity,#11A3FF,Piano
4.504504504504505,0.6935078601343609,Milne13,Milne (2013),harmonicity,#11A3FF,Piano
4.51951951951952,0.6933934604135507,Milne13,Milne (2013),harmonicity,#11A3FF,Piano
4.534534534534535,0.6932965247288008,Milne13,Milne (2013),harmonicity,#11A3FF,Piano
4.54954954954955,0.6932181122977212,Milne13,Milne (2013),harmonicity,#11A3FF,Piano
4.564564564564565,0.6931589942040848,Milne13,Milne (2013),harmonicity,#11A3FF,Piano
4.57957957957958,0.6931204835100037,Milne13,Milne (2013),harmonicity,#11A3FF,Piano
4.594594594594595,0.6931065885629495,Milne13,Milne (2013),harmonicity,#11A3FF,Piano
4.60960960960961,0.6931279657483066,Milne13,Milne (2013),harmonicity,#11A3FF,Piano
4.624624624624625,0.6932056191859777,Milne13,Milne (2013),harmonicity,#11A3FF,Piano
4.63963963963964,0.6933709290415897,Milne13,Milne (2013),harmonicity,#11A3FF,Piano
4.654654654654655,0.69366269582652,Milne13,Milne (2013),harmonicity,#11A3FF,Piano
4.66966966966967,0.694126988884919,Milne13,Milne (2013),harmonicity,#11A3FF,Piano
4.684684684684685,0.6948222717100512,Milne13,Milne (2013),harmonicity,#11A3FF,Piano
4.6996996996997,0.6958248618661319,Milne13,Milne (2013),harmonicity,#11A3FF,Piano
4.714714714714715,0.6972339438818218,Milne13,Milne (2013),harmonicity,#11A3FF,Piano
4.72972972972973,0.6991897991702455,Milne13,Milne (2013),harmonicity,#11A3FF,Piano
4.744744744744745,0.7019114781713456,Milne13,Milne (2013),harmonicity,#11A3FF,Piano
4.75975975975976,0.7057072880991824,Milne13,Milne (2013),harmonicity,#11A3FF,Piano
4.774774774774775,0.7108807287392568,Milne13,Milne (2013),harmonicity,#11A3FF,Piano
4.78978978978979,0.7175588465718176,Milne13,Milne (2013),harmonicity,#11A3FF,Piano
4.804804804804805,0.7256239158067803,Milne13,Milne (2013),harmonicity,#11A3FF,Piano
4.81981981981982,0.7348614818398403,Milne13,Milne (2013),harmonicity,#11A3FF,Piano
4.834834834834835,0.7451520290480491,Milne13,Milne (2013),harmonicity,#11A3FF,Piano
4.84984984984985,0.7564405260309953,Milne13,Milne (2013),harmonicity,#11A3FF,Piano
4.864864864864865,0.7685293507465697,Milne13,Milne (2013),harmonicity,#11A3FF,Piano
4.87987987987988,0.7810009447507158,Milne13,Milne (2013),harmonicity,#11A3FF,Piano
4.894894894894895,0.7933276228987343,Milne13,Milne (2013),harmonicity,#11A3FF,Piano
4.90990990990991,0.8049286752380195,Milne13,Milne (2013),harmonicity,#11A3FF,Piano
4.924924924924925,0.8151535159935828,Milne13,Milne (2013),harmonicity,#11A3FF,Piano
4.93993993993994,0.823388736506467,Milne13,Milne (2013),harmonicity,#11A3FF,Piano
4.954954954954955,0.8292349143022649,Milne13,Milne (2013),harmonicity,#11A3FF,Piano
4.96996996996997,0.8325333735600425,Milne13,Milne (2013),harmonicity,#11A3FF,Piano
4.984984984984985,0.8332552626009736,Milne13,Milne (2013),harmonicity,#11A3FF,Piano
5,0.8314262218109724,Milne13,Milne (2013),harmonicity,#11A3FF,Piano
5.015015015015015,0.8271360745062177,Milne13,Milne (2013),harmonicity,#11A3FF,Piano
5.03003003003003,0.8205440208456886,Milne13,Milne (2013),harmonicity,#11A3FF,Piano
5.045045045045045,0.8118343784872462,Milne13,Milne (2013),harmonicity,#11A3FF,Piano
5.06006006006006,0.8012265529600157,Milne13,Milne (2013),harmonicity,#11A3FF,Piano
5.075075075075075,0.7891140002186999,Milne13,Milne (2013),harmonicity,#11A3FF,Piano
5.09009009009009,0.7761598378628529,Milne13,Milne (2013),harmonicity,#11A3FF,Piano
5.105105105105105,0.7631558629780334,Milne13,Milne (2013),harmonicity,#11A3FF,Piano
5.12012012012012,0.7507690070622637,Milne13,Milne (2013),harmonicity,#11A3FF,Piano
5.135135135135135,0.7394256699005795,Milne13,Milne (2013),harmonicity,#11A3FF,Piano
5.15015015015015,0.7293621227757294,Milne13,Milne (2013),harmonicity,#11A3FF,Piano
5.165165165165165,0.7207074734162854,Milne13,Milne (2013),harmonicity,#11A3FF,Piano
5.18018018018018,0.7135204614780792,Milne13,Milne (2013),harmonicity,#11A3FF,Piano
5.195195195195195,0.7077871528025995,Milne13,Milne (2013),harmonicity,#11A3FF,Piano
5.21021021021021,0.7034128570871311,Milne13,Milne (2013),harmonicity,#11A3FF,Piano
5.225225225225225,0.7002389760819027,Milne13,Milne (2013),harmonicity,#11A3FF,Piano
5.24024024024024,0.6980895686576959,Milne13,Milne (2013),harmonicity,#11A3FF,Piano
5.255255255255255,0.6968141975127303,Milne13,Milne (2013),harmonicity,#11A3FF,Piano
5.27027027027027,0.696293167925796,Milne13,Milne (2013),harmonicity,#11A3FF,Piano
5.285285285285285,0.6964167380054251,Milne13,Milne (2013),harmonicity,#11A3FF,Piano
5.3003003003003,0.6970766985884046,Milne13,Milne (2013),harmonicity,#11A3FF,Piano
5.315315315315315,0.6981808206013481,Milne13,Milne (2013),harmonicity,#11A3FF,Piano
5.33033033033033,0.6996665816025655,Milne13,Milne (2013),harmonicity,#11A3FF,Piano
5.345345345345345,0.7014961847540976,Milne13,Milne (2013),harmonicity,#11A3FF,Piano
5.36036036036036,0.7036386739870162,Milne13,Milne (2013),harmonicity,#11A3FF,Piano
5.375375375375375,0.7060525653478784,Milne13,Milne (2013),harmonicity,#11A3FF,Piano
5.39039039039039,0.7086753547142669,Milne13,Milne (2013),harmonicity,#11A3FF,Piano
5.405405405405405,0.7114198019848731,Milne13,Milne (2013),harmonicity,#11A3FF,Piano
5.42042042042042,0.7141754005076808,Milne13,Milne (2013),harmonicity,#11A3FF,Piano
5.435435435435435,0.7168139539014027,Milne13,Milne (2013),harmonicity,#11A3FF,Piano
5.45045045045045,0.7191984937602776,Milne13,Milne (2013),harmonicity,#11A3FF,Piano
5.465465465465465,0.7211945964926462,Milne13,Milne (2013),harmonicity,#11A3FF,Piano
5.48048048048048,0.7226827785646139,Milne13,Milne (2013),harmonicity,#11A3FF,Piano
5.495495495495495,0.7235703502286271,Milne13,Milne (2013),harmonicity,#11A3FF,Piano
5.51051051051051,0.7238010324677927,Milne13,Milne (2013),harmonicity,#11A3FF,Piano
5.525525525525525,0.7233609606173209,Milne13,Milne (2013),harmonicity,#11A3FF,Piano
5.54054054054054,0.7222803293717431,Milne13,Milne (2013),harmonicity,#11A3FF,Piano
5.555555555555555,0.7206305599056072,Milne13,Milne (2013),harmonicity,#11A3FF,Piano
5.57057057057057,0.7185172031905337,Milne13,Milne (2013),harmonicity,#11A3FF,Piano
5.585585585585585,0.7160691270261439,Milne13,Milne (2013),harmonicity,#11A3FF,Piano
5.6006006006006,0.7134254202816512,Milne13,Milne (2013),harmonicity,#11A3FF,Piano
5.615615615615615,0.7107224579887172,Milne13,Milne (2013),harmonicity,#11A3FF,Piano
5.63063063063063,0.7080835315157447,Milne13,Milne (2013),harmonicity,#11A3FF,Piano
5.645645645645645,0.7056121029231601,Milne13,Milne (2013),harmonicity,#11A3FF,Piano
5.66066066066066,0.7033881218268763,Milne13,Milne (2013),harmonicity,#11A3FF,Piano
5.675675675675675,0.7014664004438084,Milne13,Milne (2013),harmonicity,#11A3FF,Piano
5.6906906906906904,0.6998779379535384,Milne13,Milne (2013),harmonicity,#11A3FF,Piano
5.7057057057057055,0.6986361432259873,Milne13,Milne (2013),harmonicity,#11A3FF,Piano
5.7207207207207205,0.697744290181391,Milne13,Milne (2013),harmonicity,#11A3FF,Piano
5.7357357357357355,0.6971933286367246,Milne13,Milne (2013),harmonicity,#11A3FF,Piano
5.7507507507507505,0.6969455868069628,Milne13,Milne (2013),harmonicity,#11A3FF,Piano
5.7657657657657655,0.6969186215235466,Milne13,Milne (2013),harmonicity,#11A3FF,Piano
5.7807807807807805,0.6969910703726283,Milne13,Milne (2013),harmonicity,#11A3FF,Piano
5.7957957957957955,0.6970394854158624,Milne13,Milne (2013),harmonicity,#11A3FF,Piano
5.8108108108108105,0.6969945417558573,Milne13,Milne (2013),harmonicity,#11A3FF,Piano
5.8258258258258255,0.6968784243955489,Milne13,Milne (2013),harmonicity,#11A3FF,Piano
5.8408408408408405,0.6967724263324793,Milne13,Milne (2013),harmonicity,#11A3FF,Piano
5.8558558558558556,0.6967235302880854,Milne13,Milne (2013),harmonicity,#11A3FF,Piano
5.870870870870871,0.6966889082418878,Milne13,Milne (2013),harmonicity,#11A3FF,Piano
5.885885885885886,0.6965842123192358,Milne13,Milne (2013),harmonicity,#11A3FF,Piano
5.900900900900901,0.6963680151288006,Milne13,Milne (2013),harmonicity,#11A3FF,Piano
5.915915915915916,0.6960653374296795,Milne13,Milne (2013),harmonicity,#11A3FF,Piano
5.930930930930931,0.6957304690183448,Milne13,Milne (2013),harmonicity,#11A3FF,Piano
5.945945945945946,0.6954090660020475,Milne13,Milne (2013),harmonicity,#11A3FF,Piano
5.960960960960961,0.6951301057427126,Milne13,Milne (2013),harmonicity,#11A3FF,Piano
5.975975975975976,0.6949159058130338,Milne13,Milne (2013),harmonicity,#11A3FF,Piano
5.990990990990991,0.6947889957334653,Milne13,Milne (2013),harmonicity,#11A3FF,Piano
6.006006006006006,0.6947679563364828,Milne13,Milne (2013),harmonicity,#11A3FF,Piano
6.021021021021021,0.6948588911287222,Milne13,Milne (2013),harmonicity,#11A3FF,Piano
6.036036036036036,0.6950521276098751,Milne13,Milne (2013),harmonicity,#11A3FF,Piano
6.051051051051051,0.6953263404969365,Milne13,Milne (2013),harmonicity,#11A3FF,Piano
6.066066066066066,0.6956553301353718,Milne13,Milne (2013),harmonicity,#11A3FF,Piano
6.081081081081081,0.6960126379600603,Milne13,Milne (2013),harmonicity,#11A3FF,Piano
6.096096096096096,0.6963730312759733,Milne13,Milne (2013),harmonicity,#11A3FF,Piano
6.111111111111111,0.6967125103897962,Milne13,Milne (2013),harmonicity,#11A3FF,Piano
6.126126126126126,0.6970085109948129,Milne13,Milne (2013),harmonicity,#11A3FF,Piano
6.141141141141141,0.6972408562501315,Milne13,Milne (2013),harmonicity,#11A3FF,Piano
6.156156156156156,0.6973932620969812,Milne13,Milne (2013),harmonicity,#11A3FF,Piano
6.171171171171171,0.6974552672670422,Milne13,Milne (2013),harmonicity,#11A3FF,Piano
6.186186186186186,0.6974251754238475,Milne13,Milne (2013),harmonicity,#11A3FF,Piano
6.201201201201201,0.6973154799508534,Milne13,Milne (2013),harmonicity,#11A3FF,Piano
6.216216216216216,0.6971616180611185,Milne13,Milne (2013),harmonicity,#11A3FF,Piano
6.231231231231231,0.6970303419879507,Milne13,Milne (2013),harmonicity,#11A3FF,Piano
6.246246246246246,0.697017652926089,Milne13,Milne (2013),harmonicity,#11A3FF,Piano
6.261261261261261,0.6972284033976003,Milne13,Milne (2013),harmonicity,#11A3FF,Piano
6.276276276276276,0.6977458496531039,Milne13,Milne (2013),harmonicity,#11A3FF,Piano
6.291291291291291,0.6986133440547276,Milne13,Milne (2013),harmonicity,#11A3FF,Piano
6.306306306306306,0.6998403883618399,Milne13,Milne (2013),harmonicity,#11A3FF,Piano
6.321321321321321,0.701420310408186,Milne13,Milne (2013),harmonicity,#11A3FF,Piano
6.336336336336336,0.7033381939107946,Milne13,Milne (2013),harmonicity,#11A3FF,Piano
6.351351351351351,0.7055638186855069,Milne13,Milne (2013),harmonicity,#11A3FF,Piano
6.366366366366366,0.7080415759045499,Milne13,Milne (2013),harmonicity,#11A3FF,Piano
6.381381381381381,0.7106881226129151,Milne13,Milne (2013),harmonicity,#11A3FF,Piano
6.396396396396396,0.7133967929772085,Milne13,Milne (2013),harmonicity,#11A3FF,Piano
6.411411411411412,0.7160433036304693,Milne13,Milne (2013),harmonicity,#11A3FF,Piano
6.426426426426427,0.7184920450157923,Milne13,Milne (2013),harmonicity,#11A3FF,Piano
6.441441441441442,0.7206054339240249,Milne13,Milne (2013),harmonicity,#11A3FF,Piano
6.456456456456457,0.7222561683746969,Milne13,Milne (2013),harmonicity,#11A3FF,Piano
6.471471471471472,0.7233394646793663,Milne13,Milne (2013),harmonicity,#11A3FF,Piano
6.486486486486487,0.7237833342127103,Milne13,Milne (2013),harmonicity,#11A3FF,Piano
6.501501501501502,0.7235563125152302,Milne13,Milne (2013),harmonicity,#11A3FF,Piano
6.516516516516517,0.7226713744839505,Milne13,Milne (2013),harmonicity,#11A3FF,Piano
6.531531531531532,0.7211846300138663,Milne13,Milne (2013),harmonicity,#11A3FF,Piano
6.546546546546547,0.7191889844375943,Milne13,Milne (2013),harmonicity,#11A3FF,Piano
6.561561561561562,0.7168041817583646,Milne13,Milne (2013),harmonicity,#11A3FF,Piano
6.576576576576577,0.7141648019993653,Milne13,Milne (2013),harmonicity,#11A3FF,Piano
6.591591591591592,0.711407810832849,Milne13,Milne (2013),harmonicity,#11A3FF,Piano
6.606606606606607,0.7086612598187167,Milne13,Milne (2013),harmonicity,#11A3FF,Piano
6.621621621621622,0.7060354471676282,Milne13,Milne (2013),harmonicity,#11A3FF,Piano
6.636636636636637,0.7036175319095942,Milne13,Milne (2013),harmonicity,#11A3FF,Piano
6.651651651651652,0.7014704501568901,Milne13,Milne (2013),harmonicity,#11A3FF,Piano
6.666666666666667,0.6996370783367134,Milne13,Milne (2013),harmonicity,#11A3FF,Piano
6.681681681681682,0.69815124951778,Milne13,Milne (2013),harmonicity,#11A3FF,Piano
6.696696696696697,0.6970556854239195,Milne13,Milne (2013),harmonicity,#11A3FF,Piano
6.711711711711712,0.6964188177799973,Milne13,Milne (2013),harmonicity,#11A3FF,Piano
6.726726726726727,0.6963356399288727,Milne13,Milne (2013),harmonicity,#11A3FF,Piano
6.741741741741742,0.6969104200067467,Milne13,Milne (2013),harmonicity,#11A3FF,Piano
6.756756756756757,0.6982445879942389,Milne13,Milne (2013),harmonicity,#11A3FF,Piano
6.771771771771772,0.7004513413277796,Milne13,Milne (2013),harmonicity,#11A3FF,Piano
6.786786786786787,0.7036797638130714,Milne13,Milne (2013),harmonicity,#11A3FF,Piano
6.801801801801802,0.7081087408801182,Milne13,Milne (2013),harmonicity,#11A3FF,Piano
6.816816816816817,0.7139016417093859,Milne13,Milne (2013),harmonicity,#11A3FF,Piano
6.831831831831832,0.7211546474936293,Milne13,Milne (2013),harmonicity,#11A3FF,Piano
6.846846846846847,0.7298695700953606,Milne13,Milne (2013),harmonicity,#11A3FF,Piano
6.861861861861862,0.7399478901696679,Milne13,Milne (2013),harmonicity,#11A3FF,Piano
6.876876876876877,0.7511856764179491,Milne13,Milne (2013),harmonicity,#11A3FF,Piano
6.891891891891892,0.7632641410145229,Milne13,Milne (2013),harmonicity,#11A3FF,Piano
6.906906906906907,0.775751296419272,Milne13,Milne (2013),harmonicity,#11A3FF,Piano
6.921921921921922,0.7881294959041325,Milne13,Milne (2013),harmonicity,#11A3FF,Piano
6.936936936936937,0.7998452933443364,Milne13,Milne (2013),harmonicity,#11A3FF,Piano
6.951951951951952,0.8103676135048569,Milne13,Milne (2013),harmonicity,#11A3FF,Piano
6.966966966966967,0.8192432380101476,Milne13,Milne (2013),harmonicity,#11A3FF,Piano
6.981981981981982,0.8261356306932639,Milne13,Milne (2013),harmonicity,#11A3FF,Piano
6.996996996996997,0.8308294835706141,Milne13,Milne (2013),harmonicity,#11A3FF,Piano
7.012012012012012,0.8332041041373875,Milne13,Milne (2013),harmonicity,#11A3FF,Piano
7.027027027027027,0.8332047477201133,Milne13,Milne (2013),harmonicity,#11A3FF,Piano
7.042042042042042,0.8308309943555625,Milne13,Milne (2013),harmonicity,#11A3FF,Piano
7.057057057057057,0.8261371723632156,Milne13,Milne (2013),harmonicity,#11A3FF,Piano
7.072072072072072,0.8192442719523242,Milne13,Milne (2013),harmonicity,#11A3FF,Piano
7.087087087087087,0.8103681117573649,Milne13,Milne (2013),harmonicity,#11A3FF,Piano
7.102102102102102,0.799845472298674,Milne13,Milne (2013),harmonicity,#11A3FF,Piano
7.117117117117117,0.7881295477696261,Milne13,Milne (2013),harmonicity,#11A3FF,Piano
7.132132132132132,0.7757513287614262,Milne13,Milne (2013),harmonicity,#11A3FF,Piano
7.147147147147147,0.7632642554696,Milne13,Milne (2013),harmonicity,#11A3FF,Piano
7.162162162162162,0.7511861233578334,Milne13,Milne (2013),harmonicity,#11A3FF,Piano
7.177177177177177,0.7399492714018916,Milne13,Milne (2013),harmonicity,#11A3FF,Piano
7.192192192192192,0.7298728999775912,Milne13,Milne (2013),harmonicity,#11A3FF,Piano
7.207207207207207,0.7211608547456085,Milne13,Milne (2013),harmonicity,#11A3FF,Piano
7.222222222222222,0.7139101365052412,Milne13,Milne (2013),harmonicity,#11A3FF,Piano
7.237237237237237,0.7081144591943229,Milne13,Milne (2013),harmonicity,#11A3FF,Piano
7.252252252252252,0.7036660970236873,Milne13,Milne (2013),harmonicity,#11A3FF,Piano
7.267267267267267,0.7003739757478927,Milne13,Milne (2013),harmonicity,#11A3FF,Piano
7.282282282282282,0.6980055923625584,Milne13,Milne (2013),harmonicity,#11A3FF,Piano
7.297297297297297,0.6963357432712297,Milne13,Milne (2013),harmonicity,#11A3FF,Piano
7.312312312312312,0.6951775372475465,Milne13,Milne (2013),harmonicity,#11A3FF,Piano
7.327327327327327,0.6943885685925975,Milne13,Milne (2013),harmonicity,#11A3FF,Piano
7.342342342342342,0.6938631899486863,Milne13,Milne (2013),harmonicity,#11A3FF,Piano
7.357357357357357,0.6935232884878149,Milne13,Milne (2013),harmonicity,#11A3FF,Piano
7.372372372372372,0.6933120160731462,Milne13,Milne (2013),harmonicity,#11A3FF,Piano
7.387387387387387,0.6931894894772052,Milne13,Milne (2013),harmonicity,#11A3FF,Piano
7.402402402402402,0.6931289351245542,Milne13,Milne (2013),harmonicity,#11A3FF,Piano
7.4174174174174174,0.6931129239516102,Milne13,Milne (2013),harmonicity,#11A3FF,Piano
7.4324324324324325,0.6931300219280512,Milne13,Milne (2013),harmonicity,#11A3FF,Piano
7.4474474474474475,0.6931724348036555,Milne13,Milne (2013),harmonicity,#11A3FF,Piano
7.4624624624624625,0.6932352917435629,Milne13,Milne (2013),harmonicity,#11A3FF,Piano
7.4774774774774775,0.69331718379874,Milne13,Milne (2013),harmonicity,#11A3FF,Piano
7.4924924924924925,0.6934197573708998,Milne13,Milne (2013),harmonicity,#11A3FF,Piano
7.5075075075075075,0.6935446187266506,Milne13,Milne (2013),harmonicity,#11A3FF,Piano
7.5225225225225225,0.6936894823397327,Milne13,Milne (2013),harmonicity,#11A3FF,Piano
7.5375375375375375,0.693847347980445,Milne13,Milne (2013),harmonicity,#11A3FF,Piano
7.5525525525525525,0.6940088692561689,Milne13,Milne (2013),harmonicity,#11A3FF,Piano
7.5675675675675675,0.694164118428027,Milne13,Milne (2013),harmonicity,#11A3FF,Piano
7.5825825825825826,0.6943013961961512,Milne13,Milne (2013),harmonicity,#11A3FF,Piano
7.597597597597598,0.6944053694521874,Milne13,Milne (2013),harmonicity,#11A3FF,Piano
7.612612612612613,0.694460384135395,Milne13,Milne (2013),harmonicity,#11A3FF,Piano
7.627627627627628,0.6944630514162338,Milne13,Milne (2013),harmonicity,#11A3FF,Piano
7.642642642642643,0.6944352935575935,Milne13,Milne (2013),harmonicity,#11A3FF,Piano
7.657657657657658,0.6944171884608831,Milne13,Milne (2013),harmonicity,#11A3FF,Piano
7.672672672672673,0.6944377353321728,Milne13,Milne (2013),harmonicity,#11A3FF,Piano
7.687687687687688,0.6944957123431836,Milne13,Milne (2013),harmonicity,#11A3FF,Piano
7.702702702702703,0.6945726520899395,Milne13,Milne (2013),harmonicity,#11A3FF,Piano
7.717717717717718,0.6946553341246505,Milne13,Milne (2013),harmonicity,#11A3FF,Piano
7.732732732732733,0.6947398792685403,Milne13,Milne (2013),harmonicity,#11A3FF,Piano
7.747747747747748,0.69482332740961,Milne13,Milne (2013),harmonicity,#11A3FF,Piano
7.762762762762763,0.6949002934678147,Milne13,Milne (2013),harmonicity,#11A3FF,Piano
7.777777777777778,0.6949661724153481,Milne13,Milne (2013),harmonicity,#11A3FF,Piano
7.792792792792793,0.6950199771311426,Milne13,Milne (2013),harmonicity,#11A3FF,Piano
7.807807807807808,0.6950657760727228,Milne13,Milne (2013),harmonicity,#11A3FF,Piano
7.822822822822823,0.6951165872835375,Milne13,Milne (2013),harmonicity,#11A3FF,Piano
7.837837837837838,0.6952030268496967,Milne13,Milne (2013),harmonicity,#11A3FF,Piano
7.852852852852853,0.6953838584686964,Milne13,Milne (2013),harmonicity,#11A3FF,Piano
7.867867867867868,0.6957502539120101,Milne13,Milne (2013),harmonicity,#11A3FF,Piano
7.882882882882883,0.6964171485482991,Milne13,Milne (2013),harmonicity,#11A3FF,Piano
7.897897897897898,0.6975065940122813,Milne13,Milne (2013),harmonicity,#11A3FF,Piano
7.912912912912913,0.6991360319025798,Milne13,Milne (2013),harmonicity,#11A3FF,Piano
7.927927927927928,0.7014155311231827,Milne13,Milne (2013),harmonicity,#11A3FF,Piano
7.942942942942943,0.7044412444536916,Milne13,Milne (2013),harmonicity,#11A3FF,Piano
7.957957957957958,0.708268993046534,Milne13,Milne (2013),harmonicity,#11A3FF,Piano
7.972972972972973,0.7128752401735715,Milne13,Milne (2013),harmonicity,#11A3FF,Piano
7.987987987987988,0.7181491294042961,Milne13,Milne (2013),harmonicity,#11A3FF,Piano
8.003003003003004,0.723953435599457,Milne13,Milne (2013),harmonicity,#11A3FF,Piano
8.018018018018019,0.7302025342525603,Milne13,Milne (2013),harmonicity,#11A3FF,Piano
8.033033033033034,0.7368313137640315,Milne13,Milne (2013),harmonicity,#11A3FF,Piano
8.048048048048049,0.7436448011984622,Milne13,Milne (2013),harmonicity,#11A3FF,Piano
8.063063063063064,0.7502405097495223,Milne13,Milne (2013),harmonicity,#11A3FF,Piano
8.078078078078079,0.7561412215338392,Milne13,Milne (2013),harmonicity,#11A3FF,Piano
8.093093093093094,0.7610036497776359,Milne13,Milne (2013),harmonicity,#11A3FF,Piano
8.108108108108109,0.7646909592259413,Milne13,Milne (2013),harmonicity,#11A3FF,Piano
8.123123123123124,0.7671826100458371,Milne13,Milne (2013),harmonicity,#11A3FF,Piano
8.138138138138139,0.7684538134282544,Milne13,Milne (2013),harmonicity,#11A3FF,Piano
8.153153153153154,0.7684418838807505,Milne13,Milne (2013),harmonicity,#11A3FF,Piano
8.168168168168169,0.7670880870658395,Milne13,Milne (2013),harmonicity,#11A3FF,Piano
8.183183183183184,0.7643690829964748,Milne13,Milne (2013),harmonicity,#11A3FF,Piano
8.198198198198199,0.7603151106178387,Milne13,Milne (2013),harmonicity,#11A3FF,Piano
8.213213213213214,0.7550717113098713,Milne13,Milne (2013),harmonicity,#11A3FF,Piano
8.228228228228229,0.7489533750275003,Milne13,Milne (2013),harmonicity,#11A3FF,Piano
8.243243243243244,0.7423789500254525,Milne13,Milne (2013),harmonicity,#11A3FF,Piano
8.258258258258259,0.7357122622369204,Milne13,Milne (2013),harmonicity,#11A3FF,Piano
8.273273273273274,0.7291554237253723,Milne13,Milne (2013),harmonicity,#11A3FF,Piano
8.288288288288289,0.7228007390289142,Milne13,Milne (2013),harmonicity,#11A3FF,Piano
8.303303303303304,0.7167849191718232,Milne13,Milne (2013),harmonicity,#11A3FF,Piano
8.318318318318319,0.7113581549778835,Milne13,Milne (2013),harmonicity,#11A3FF,Piano
8.333333333333334,0.706773454905428,Milne13,Milne (2013),harmonicity,#11A3FF,Piano
8.348348348348349,0.7031336104994964,Milne13,Milne (2013),harmonicity,#11A3FF,Piano
8.363363363363364,0.700366003899309,Milne13,Milne (2013),harmonicity,#11A3FF,Piano
8.378378378378379,0.6983114625439387,Milne13,Milne (2013),harmonicity,#11A3FF,Piano
8.393393393393394,0.6968110720190143,Milne13,Milne (2013),harmonicity,#11A3FF,Piano
8.408408408408409,0.6957376604196485,Milne13,Milne (2013),harmonicity,#11A3FF,Piano
8.423423423423424,0.6949924531883336,Milne13,Milne (2013),harmonicity,#11A3FF,Piano
8.438438438438439,0.6944954344728984,Milne13,Milne (2013),harmonicity,#11A3FF,Piano
8.453453453453454,0.6941795284933037,Milne13,Milne (2013),harmonicity,#11A3FF,Piano
8.468468468468469,0.6939883912742805,Milne13,Milne (2013),harmonicity,#11A3FF,Piano
8.483483483483484,0.6938763558769776,Milne13,Milne (2013),harmonicity,#11A3FF,Piano
8.498498498498499,0.6938103356417664,Milne13,Milne (2013),harmonicity,#11A3FF,Piano
8.513513513513514,0.693772658541159,Milne13,Milne (2013),harmonicity,#11A3FF,Piano
8.528528528528529,0.6937603999993635,Milne13,Milne (2013),harmonicity,#11A3FF,Piano
8.543543543543544,0.6937773838387434,Milne13,Milne (2013),harmonicity,#11A3FF,Piano
8.558558558558559,0.6938238290787078,Milne13,Milne (2013),harmonicity,#11A3FF,Piano
8.573573573573574,0.6938948449805711,Milne13,Milne (2013),harmonicity,#11A3FF,Piano
8.588588588588589,0.6939902794840154,Milne13,Milne (2013),harmonicity,#11A3FF,Piano
8.603603603603604,0.6941241426876555,Milne13,Milne (2013),harmonicity,#11A3FF,Piano
8.618618618618619,0.6943214240464184,Milne13,Milne (2013),harmonicity,#11A3FF,Piano
8.633633633633634,0.6946048596550618,Milne13,Milne (2013),harmonicity,#11A3FF,Piano
8.64864864864865,0.694985725831872,Milne13,Milne (2013),harmonicity,#11A3FF,Piano
8.663663663663664,0.6954662596168203,Milne13,Milne (2013),harmonicity,#11A3FF,Piano
8.67867867867868,0.6960463276176231,Milne13,Milne (2013),harmonicity,#11A3FF,Piano
8.693693693693694,0.6967241411684864,Milne13,Milne (2013),harmonicity,#11A3FF,Piano
8.70870870870871,0.697490296497636,Milne13,Milne (2013),harmonicity,#11A3FF,Piano
8.723723723723724,0.6983216111248641,Milne13,Milne (2013),harmonicity,#11A3FF,Piano
8.73873873873874,0.6991821243293094,Milne13,Milne (2013),harmonicity,#11A3FF,Piano
8.753753753753754,0.70003445675081,Milne13,Milne (2013),harmonicity,#11A3FF,Piano
8.76876876876877,0.700852647089716,Milne13,Milne (2013),harmonicity,#11A3FF,Piano
8.783783783783784,0.7016186339359622,Milne13,Milne (2013),harmonicity,#11A3FF,Piano
8.7987987987988,0.702301535460963,Milne13,Milne (2013),harmonicity,#11A3FF,Piano
8.813813813813814,0.7028471125829071,Milne13,Milne (2013),harmonicity,#11A3FF,Piano
8.82882882882883,0.7031958815915961,Milne13,Milne (2013),harmonicity,#11A3FF,Piano
8.843843843843844,0.7033098504684747,Milne13,Milne (2013),harmonicity,#11A3FF,Piano
8.85885885885886,0.7031812106691367,Milne13,Milne (2013),harmonicity,#11A3FF,Piano
8.873873873873874,0.7028255723255178,Milne13,Milne (2013),harmonicity,#11A3FF,Piano
8.88888888888889,0.7022754507937781,Milne13,Milne (2013),harmonicity,#11A3FF,Piano
8.903903903903904,0.7015753566471201,Milne13,Milne (2013),harmonicity,#11A3FF,Piano
8.91891891891892,0.7007711944619842,Milne13,Milne (2013),harmonicity,#11A3FF,Piano
8.933933933933934,0.699898145631974,Milne13,Milne (2013),harmonicity,#11A3FF,Piano
8.94894894894895,0.6989816130229434,Milne13,Milne (2013),harmonicity,#11A3FF,Piano
8.963963963963964,0.6980525730063827,Milne13,Milne (2013),harmonicity,#11A3FF,Piano
8.97897897897898,0.6971566269356292,Milne13,Milne (2013),harmonicity,#11A3FF,Piano
8.993993993993994,0.6963419417415916,Milne13,Milne (2013),harmonicity,#11A3FF,Piano
9.00900900900901,0.6956395094787929,Milne13,Milne (2013),harmonicity,#11A3FF,Piano
9.024024024024024,0.6950571007586572,Milne13,Milne (2013),harmonicity,#11A3FF,Piano
9.03903903903904,0.6945897397490564,Milne13,Milne (2013),harmonicity,#11A3FF,Piano
9.054054054054054,0.6942338155973826,Milne13,Milne (2013),harmonicity,#11A3FF,Piano
9.06906906906907,0.6939922934184333,Milne13,Milne (2013),harmonicity,#11A3FF,Piano
9.084084084084084,0.693869631829955,Milne13,Milne (2013),harmonicity,#11A3FF,Piano
9.0990990990991,0.6938655187381738,Milne13,Milne (2013),harmonicity,#11A3FF,Piano
9.114114114114114,0.6939746637654326,Milne13,Milne (2013),harmonicity,#11A3FF,Piano
9.12912912912913,0.6941904543457714,Milne13,Milne (2013),harmonicity,#11A3FF,Piano
9.144144144144144,0.6945073672968872,Milne13,Milne (2013),harmonicity,#11A3FF,Piano
9.15915915915916,0.6949207822630187,Milne13,Milne (2013),harmonicity,#11A3FF,Piano
9.174174174174174,0.6954252995250942,Milne13,Milne (2013),harmonicity,#11A3FF,Piano
9.18918918918919,0.6960125667009258,Milne13,Milne (2013),harmonicity,#11A3FF,Piano
9.204204204204204,0.6966693043620146,Milne13,Milne (2013),harmonicity,#11A3FF,Piano
9.21921921921922,0.6973760716261889,Milne13,Milne (2013),harmonicity,#11A3FF,Piano
9.234234234234235,0.698107053329966,Milne13,Milne (2013),harmonicity,#11A3FF,Piano
9.24924924924925,0.6988309299489721,Milne13,Milne (2013),harmonicity,#11A3FF,Piano
9.264264264264265,0.6995127531287314,Milne13,Milne (2013),harmonicity,#11A3FF,Piano
9.27927927927928,0.7001166086596191,Milne13,Milne (2013),harmonicity,#11A3FF,Piano
9.294294294294295,0.7006087481748663,Milne13,Milne (2013),harmonicity,#11A3FF,Piano
9.30930930930931,0.7009609138116845,Milne13,Milne (2013),harmonicity,#11A3FF,Piano
9.324324324324325,0.7011536842917404,Milne13,Milne (2013),harmonicity,#11A3FF,Piano
9.33933933933934,0.7011795823828834,Milne13,Milne (2013),harmonicity,#11A3FF,Piano
9.354354354354355,0.7010452566343358,Milne13,Milne (2013),harmonicity,#11A3FF,Piano
9.36936936936937,0.7007718357854497,Milne13,Milne (2013),harmonicity,#11A3FF,Piano
9.384384384384385,0.7003934131333877,Milne13,Milne (2013),harmonicity,#11A3FF,Piano
9.3993993993994,0.6999548880636798,Milne13,Milne (2013),harmonicity,#11A3FF,Piano
9.414414414414415,0.6995101085695492,Milne13,Milne (2013),harmonicity,#11A3FF,Piano
9.42942942942943,0.699119637821262,Milne13,Milne (2013),harmonicity,#11A3FF,Piano
9.444444444444445,0.6988468719351775,Milne13,Milne (2013),harmonicity,#11A3FF,Piano
9.45945945945946,0.6987522464104887,Milne13,Milne (2013),harmonicity,#11A3FF,Piano
9.474474474474475,0.6988873897039866,Milne13,Milne (2013),harmonicity,#11A3FF,Piano
9.48948948948949,0.6992943233001924,Milne13,Milne (2013),harmonicity,#11A3FF,Piano
9.504504504504505,0.7000138060735874,Milne13,Milne (2013),harmonicity,#11A3FF,Piano
9.51951951951952,0.701093195247283,Milne13,Milne (2013),harmonicity,#11A3FF,Piano
9.534534534534535,0.7025715154344377,Milne13,Milne (2013),harmonicity,#11A3FF,Piano
9.54954954954955,0.7044405702694937,Milne13,Milne (2013),harmonicity,#11A3FF,Piano
9.564564564564565,0.7066209491903892,Milne13,Milne (2013),harmonicity,#11A3FF,Piano
9.57957957957958,0.7089865702838705,Milne13,Milne (2013),harmonicity,#11A3FF,Piano
9.594594594594595,0.7114206444347373,Milne13,Milne (2013),harmonicity,#11A3FF,Piano
9.60960960960961,0.7138591483193761,Milne13,Milne (2013),harmonicity,#11A3FF,Piano
9.624624624624625,0.7162978045571983,Milne13,Milne (2013),harmonicity,#11A3FF,Piano
9.63963963963964,0.7187663037651493,Milne13,Milne (2013),harmonicity,#11A3FF,Piano
9.654654654654655,0.7212612280795947,Milne13,Milne (2013),harmonicity,#11A3FF,Piano
9.66966966966967,0.7236079615146401,Milne13,Milne (2013),harmonicity,#11A3FF,Piano
9.684684684684685,0.7253434120963416,Milne13,Milne (2013),harmonicity,#11A3FF,Piano
9.6996996996997,0.7258801627615726,Milne13,Milne (2013),harmonicity,#11A3FF,Piano
9.714714714714715,0.7249683304638178,Milne13,Milne (2013),harmonicity,#11A3FF,Piano
9.72972972972973,0.7229630161360282,Milne13,Milne (2013),harmonicity,#11A3FF,Piano
9.744744744744745,0.7205395299132422,Milne13,Milne (2013),harmonicity,#11A3FF,Piano
9.75975975975976,0.7182156607840218,Milne13,Milne (2013),harmonicity,#11A3FF,Piano
9.774774774774775,0.7162047880931595,Milne13,Milne (2013),harmonicity,#11A3FF,Piano
9.78978978978979,0.7145919761123429,Milne13,Milne (2013),harmonicity,#11A3FF,Piano
9.804804804804805,0.7134981817571832,Milne13,Milne (2013),harmonicity,#11A3FF,Piano
9.81981981981982,0.7130654185513441,Milne13,Milne (2013),harmonicity,#11A3FF,Piano
9.834834834834835,0.7133491251561767,Milne13,Milne (2013),harmonicity,#11A3FF,Piano
9.84984984984985,0.714264272580015,Milne13,Milne (2013),harmonicity,#11A3FF,Piano
9.864864864864865,0.7156270782234644,Milne13,Milne (2013),harmonicity,#11A3FF,Piano
9.87987987987988,0.71722777023405,Milne13,Milne (2013),harmonicity,#11A3FF,Piano
9.894894894894895,0.7188712563297233,Milne13,Milne (2013),harmonicity,#11A3FF,Piano
9.90990990990991,0.7203845240978618,Milne13,Milne (2013),harmonicity,#11A3FF,Piano
9.924924924924925,0.7216189163310665,Milne13,Milne (2013),harmonicity,#11A3FF,Piano
9.93993993993994,0.7224573158981418,Milne13,Milne (2013),harmonicity,#11A3FF,Piano
9.954954954954955,0.7228151648123049,Milne13,Milne (2013),harmonicity,#11A3FF,Piano
9.96996996996997,0.7226341429162758,Milne13,Milne (2013),harmonicity,#11A3FF,Piano
9.984984984984985,0.7218858989230884,Milne13,Milne (2013),harmonicity,#11A3FF,Piano
10,0.7205858915071371,Milne13,Milne (2013),harmonicity,#11A3FF,Piano
10.015015015015015,0.7187935813367381,Milne13,Milne (2013),harmonicity,#11A3FF,Piano
10.03003003003003,0.7166021621825023,Milne13,Milne (2013),harmonicity,#11A3FF,Piano
10.045045045045045,0.7141431862846819,Milne13,Milne (2013),harmonicity,#11A3FF,Piano
10.06006006006006,0.7115885380900089,Milne13,Milne (2013),harmonicity,#11A3FF,Piano
10.075075075075075,0.7091127702288205,Milne13,Milne (2013),harmonicity,#11A3FF,Piano
10.09009009009009,0.7068347249926878,Milne13,Milne (2013),harmonicity,#11A3FF,Piano
10.105105105105105,0.7047923574811424,Milne13,Milne (2013),harmonicity,#11A3FF,Piano
10.12012012012012,0.7029725424325273,Milne13,Milne (2013),harmonicity,#11A3FF,Piano
10.135135135135135,0.7013671745194895,Milne13,Milne (2013),harmonicity,#11A3FF,Piano
10.15015015015015,0.7000002533473105,Milne13,Milne (2013),harmonicity,#11A3FF,Piano
10.165165165165165,0.6989006734687077,Milne13,Milne (2013),harmonicity,#11A3FF,Piano
10.18018018018018,0.6980607283853341,Milne13,Milne (2013),harmonicity,#11A3FF,Piano
10.195195195195195,0.6974329747483446,Milne13,Milne (2013),harmonicity,#11A3FF,Piano
10.21021021021021,0.6969626415817443,Milne13,Milne (2013),harmonicity,#11A3FF,Piano
10.225225225225225,0.6966131743081915,Milne13,Milne (2013),harmonicity,#11A3FF,Piano
10.24024024024024,0.6963637829942709,Milne13,Milne (2013),harmonicity,#11A3FF,Piano
10.255255255255255,0.6961951457922475,Milne13,Milne (2013),harmonicity,#11A3FF,Piano
10.27027027027027,0.6960833688798068,Milne13,Milne (2013),harmonicity,#11A3FF,Piano
10.285285285285285,0.6960034005636686,Milne13,Milne (2013),harmonicity,#11A3FF,Piano
10.3003003003003,0.6959338715606392,Milne13,Milne (2013),harmonicity,#11A3FF,Piano
10.315315315315315,0.6958594050780004,Milne13,Milne (2013),harmonicity,#11A3FF,Piano
10.33033033033033,0.6957709102631744,Milne13,Milne (2013),harmonicity,#11A3FF,Piano
10.345345345345345,0.6956653534109499,Milne13,Milne (2013),harmonicity,#11A3FF,Piano
10.36036036036036,0.6955465716279667,Milne13,Milne (2013),harmonicity,#11A3FF,Piano
10.375375375375375,0.6954276605928739,Milne13,Milne (2013),harmonicity,#11A3FF,Piano
10.39039039039039,0.6953315394100529,Milne13,Milne (2013),harmonicity,#11A3FF,Piano
10.405405405405405,0.6952837587242822,Milne13,Milne (2013),harmonicity,#11A3FF,Piano
10.42042042042042,0.6952980301323934,Milne13,Milne (2013),harmonicity,#11A3FF,Piano
10.435435435435435,0.6953654349670813,Milne13,Milne (2013),harmonicity,#11A3FF,Piano
10.45045045045045,0.6954574276545566,Milne13,Milne (2013),harmonicity,#11A3FF,Piano
10.465465465465465,0.6955396700640984,Milne13,Milne (2013),harmonicity,#11A3FF,Piano
10.48048048048048,0.695585172615213,Milne13,Milne (2013),harmonicity,#11A3FF,Piano
10.495495495495495,0.6955794178071699,Milne13,Milne (2013),harmonicity,#11A3FF,Piano
10.51051051051051,0.6955185806723398,Milne13,Milne (2013),harmonicity,#11A3FF,Piano
10.525525525525525,0.6954056304136854,Milne13,Milne (2013),harmonicity,#11A3FF,Piano
10.54054054054054,0.6952474782144511,Milne13,Milne (2013),harmonicity,#11A3FF,Piano
10.555555555555555,0.695053497176466,Milne13,Milne (2013),harmonicity,#11A3FF,Piano
10.57057057057057,0.6948345722495165,Milne13,Milne (2013),harmonicity,#11A3FF,Piano
10.585585585585585,0.694602150554769,Milne13,Milne (2013),harmonicity,#11A3FF,Piano
10.6006006006006,0.6943672664798676,Milne13,Milne (2013),harmonicity,#11A3FF,Piano
10.615615615615615,0.6941396867418904,Milne13,Milne (2013),harmonicity,#11A3FF,Piano
10.63063063063063,0.6939272912818965,Milne13,Milne (2013),harmonicity,#11A3FF,Piano
10.645645645645645,0.6937357387752014,Milne13,Milne (2013),harmonicity,#11A3FF,Piano
10.66066066066066,0.6935684113181905,Milne13,Milne (2013),harmonicity,#11A3FF,Piano
10.675675675675675,0.6934265937633831,Milne13,Milne (2013),harmonicity,#11A3FF,Piano
10.69069069069069,0.6933098198693111,Milne13,Milne (2013),harmonicity,#11A3FF,Piano
10.705705705705705,0.6932163096440158,Milne13,Milne (2013),harmonicity,#11A3FF,Piano
10.72072072072072,0.6931434270536749,Milne13,Milne (2013),harmonicity,#11A3FF,Piano
10.735735735735735,0.6930881015295317,Milne13,Milne (2013),harmonicity,#11A3FF,Piano
10.75075075075075,0.693047175626689,Milne13,Milne (2013),harmonicity,#11A3FF,Piano
10.765765765765765,0.6930176610960931,Milne13,Milne (2013),harmonicity,#11A3FF,Piano
10.78078078078078,0.6929969023575866,Milne13,Milne (2013),harmonicity,#11A3FF,Piano
10.795795795795796,0.6929826583868277,Milne13,Milne (2013),harmonicity,#11A3FF,Piano
10.81081081081081,0.6929731206867017,Milne13,Milne (2013),harmonicity,#11A3FF,Piano
10.825825825825826,0.6929668870742519,Milne13,Milne (2013),harmonicity,#11A3FF,Piano
10.84084084084084,0.6929629096030292,Milne13,Milne (2013),harmonicity,#11A3FF,Piano
10.855855855855856,0.6929604314857093,Milne13,Milne (2013),harmonicity,#11A3FF,Piano
10.87087087087087,0.6929589236595305,Milne13,Milne (2013),harmonicity,#11A3FF,Piano
10.885885885885886,0.6929580275635883,Milne13,Milne (2013),harmonicity,#11A3FF,Piano
10.9009009009009,0.6929575073472442,Milne13,Milne (2013),harmonicity,#11A3FF,Piano
10.915915915915916,0.6929572123034378,Milne13,Milne (2013),harmonicity,#11A3FF,Piano
10.93093093093093,0.6929570488086791,Milne13,Milne (2013),harmonicity,#11A3FF,Piano
10.945945945945946,0.6929569602821243,Milne13,Milne (2013),harmonicity,#11A3FF,Piano
10.96096096096096,0.6929569134407583,Milne13,Milne (2013),harmonicity,#11A3FF,Piano
10.975975975975976,0.6929568892191809,Milne13,Milne (2013),harmonicity,#11A3FF,Piano
10.99099099099099,0.6929568769780936,Milne13,Milne (2013),harmonicity,#11A3FF,Piano
11.006006006006006,0.6929568709315451,Milne13,Milne (2013),harmonicity,#11A3FF,Piano
11.02102102102102,0.6929568680121815,Milne13,Milne (2013),harmonicity,#11A3FF,Piano
11.036036036036036,0.6929568666343914,Milne13,Milne (2013),harmonicity,#11A3FF,Piano
11.05105105105105,0.6929568659987505,Milne13,Milne (2013),harmonicity,#11A3FF,Piano
11.066066066066066,0.6929568657120742,Milne13,Milne (2013),harmonicity,#11A3FF,Piano
11.08108108108108,0.6929568655856763,Milne13,Milne (2013),harmonicity,#11A3FF,Piano
11.096096096096096,0.6929568655311921,Milne13,Milne (2013),harmonicity,#11A3FF,Piano
11.11111111111111,0.6929568655082305,Milne13,Milne (2013),harmonicity,#11A3FF,Piano
11.126126126126126,0.6929568654987696,Milne13,Milne (2013),harmonicity,#11A3FF,Piano
11.14114114114114,0.6929568654949582,Milne13,Milne (2013),harmonicity,#11A3FF,Piano
11.156156156156156,0.6929568654934568,Milne13,Milne (2013),harmonicity,#11A3FF,Piano
11.17117117117117,0.6929568654928793,Milne13,Milne (2013),harmonicity,#11A3FF,Piano
11.186186186186186,0.6929568654926638,Milne13,Milne (2013),harmonicity,#11A3FF,Piano
11.2012012012012,0.6929568654925907,Milne13,Milne (2013),harmonicity,#11A3FF,Piano
11.216216216216216,0.6929568654925848,Milne13,Milne (2013),harmonicity,#11A3FF,Piano
11.23123123123123,0.6929568654926459,Milne13,Milne (2013),harmonicity,#11A3FF,Piano
11.246246246246246,0.6929568654928566,Milne13,Milne (2013),harmonicity,#11A3FF,Piano
11.26126126126126,0.6929568654934873,Milne13,Milne (2013),harmonicity,#11A3FF,Piano
11.276276276276276,0.6929568654953085,Milne13,Milne (2013),harmonicity,#11A3FF,Piano
11.29129129129129,0.692956865500443,Milne13,Milne (2013),harmonicity,#11A3FF,Piano
11.306306306306306,0.6929568655145978,Milne13,Milne (2013),harmonicity,#11A3FF,Piano
11.32132132132132,0.6929568655527549,Milne13,Milne (2013),harmonicity,#11A3FF,Piano
11.336336336336336,0.6929568656533328,Milne13,Milne (2013),harmonicity,#11A3FF,Piano
11.35135135135135,0.6929568659125419,Milne13,Milne (2013),harmonicity,#11A3FF,Piano
11.366366366366366,0.692956866565703,Milne13,Milne (2013),harmonicity,#11A3FF,Piano
11.381381381381381,0.6929568681749074,Milne13,Milne (2013),harmonicity,#11A3FF,Piano
11.396396396396396,0.6929568720511712,Milne13,Milne (2013),harmonicity,#11A3FF,Piano
11.411411411411411,0.6929568811798974,Milne13,Milne (2013),harmonicity,#11A3FF,Piano
11.426426426426426,0.692956902197558,Milne13,Milne (2013),harmonicity,#11A3FF,Piano
11.441441441441441,0.6929569495048952,Milne13,Milne (2013),harmonicity,#11A3FF,Piano
11.456456456456456,0.6929570536040961,Milne13,Milne (2013),harmonicity,#11A3FF,Piano
11.471471471471471,0.6929572775493008,Milne13,Milne (2013),harmonicity,#11A3FF,Piano
11.486486486486486,0.6929577485091035,Milne13,Milne (2013),harmonicity,#11A3FF,Piano
11.501501501501501,0.6929587166013704,Milne13,Milne (2013),harmonicity,#11A3FF,Piano
11.516516516516516,0.6929606614593552,Milne13,Milne (2013),harmonicity,#11A3FF,Piano
11.531531531531531,0.6929644798916438,Milne13,Milne (2013),harmonicity,#11A3FF,Piano
11.546546546546546,0.6929718070169621,Milne13,Milne (2013),harmonicity,#11A3FF,Piano
11.561561561561561,0.6929855490084664,Milne13,Milne (2013),harmonicity,#11A3FF,Piano
11.576576576576576,0.6930107371893616,Milne13,Milne (2013),harmonicity,#11A3FF,Piano
11.591591591591591,0.6930558516518182,Milne13,Milne (2013),harmonicity,#11A3FF,Piano
11.606606606606606,0.6931348257846142,Milne13,Milne (2013),harmonicity,#11A3FF,Piano
11.621621621621621,0.6932701132326767,Milne13,Milne (2013),harmonicity,#11A3FF,Piano
11.636636636636636,0.6934977061916687,Milne13,Milne (2013),harmonicity,#11A3FF,Piano
11.651651651651651,0.693876125268008,Milne13,Milne (2013),harmonicity,#11A3FF,Piano
11.666666666666666,0.6945027647279671,Milne13,Milne (2013),harmonicity,#11A3FF,Piano
11.681681681681681,0.695540821095615,Milne13,Milne (2013),harmonicity,#11A3FF,Piano
11.696696696696696,0.6972576627557313,Milne13,Milne (2013),harmonicity,#11A3FF,Piano
11.711711711711711,0.7000750660279443,Milne13,Milne (2013),harmonicity,#11A3FF,Piano
11.726726726726726,0.7046340014547242,Milne13,Milne (2013),harmonicity,#11A3FF,Piano
11.741741741741741,0.7118606572563815,Milne13,Milne (2013),harmonicity,#11A3FF,Piano
11.756756756756756,0.7229597576829849,Milne13,Milne (2013),harmonicity,#11A3FF,Piano
11.771771771771771,0.7391915034285889,Milne13,Milne (2013),harmonicity,#11A3FF,Piano
11.786786786786786,0.76133778601086,Milne13,Milne (2013),harmonicity,#11A3FF,Piano
11.801801801801801,0.7890337260928988,Milne13,Milne (2013),harmonicity,#11A3FF,Piano
11.816816816816816,0.8204577129628151,Milne13,Milne (2013),harmonicity,#11A3FF,Piano
11.831831831831831,0.852777509340816,Milne13,Milne (2013),harmonicity,#11A3FF,Piano
11.846846846846846,0.8831346836385738,Milne13,Milne (2013),harmonicity,#11A3FF,Piano
11.861861861861861,0.9094911205909166,Milne13,Milne (2013),harmonicity,#11A3FF,Piano
11.876876876876876,0.9309058984105942,Milne13,Milne (2013),harmonicity,#11A3FF,Piano
11.891891891891891,0.9473397353115469,Milne13,Milne (2013),harmonicity,#11A3FF,Piano
11.906906906906906,0.9592959803384786,Milne13,Milne (2013),harmonicity,#11A3FF,Piano
11.921921921921921,0.96751735950739,Milne13,Milne (2013),harmonicity,#11A3FF,Piano
11.936936936936936,0.9728131952803144,Milne13,Milne (2013),harmonicity,#11A3FF,Piano
11.951951951951951,0.9759728892033142,Milne13,Milne (2013),harmonicity,#11A3FF,Piano
11.966966966966966,0.9776867423341797,Milne13,Milne (2013),harmonicity,#11A3FF,Piano
11.981981981981981,0.9784761868812609,Milne13,Milne (2013),harmonicity,#11A3FF,Piano
11.996996996996996,0.9786836404437953,Milne13,Milne (2013),harmonicity,#11A3FF,Piano
12.012012012012011,0.9784867371821724,Milne13,Milne (2013),harmonicity,#11A3FF,Piano
12.027027027027026,0.9778580244474127,Milne13,Milne (2013),harmonicity,#11A3FF,Piano
12.042042042042041,0.9765078054743743,Milne13,Milne (2013),harmonicity,#11A3FF,Piano
12.057057057057056,0.9739129448455033,Milne13,Milne (2013),harmonicity,#11A3FF,Piano
12.072072072072071,0.9694119335682587,Milne13,Milne (2013),harmonicity,#11A3FF,Piano
12.087087087087086,0.9622611659608264,Milne13,Milne (2013),harmonicity,#11A3FF,Piano
12.102102102102101,0.9516520738451367,Milne13,Milne (2013),harmonicity,#11A3FF,Piano
12.117117117117116,0.9367890539786078,Milne13,Milne (2013),harmonicity,#11A3FF,Piano
12.132132132132131,0.9170736530707142,Milne13,Milne (2013),harmonicity,#11A3FF,Piano
12.147147147147146,0.8923659632359224,Milne13,Milne (2013),harmonicity,#11A3FF,Piano
12.162162162162161,0.8632904474761152,Milne13,Milne (2013),harmonicity,#11A3FF,Piano
12.177177177177176,0.8314833406275052,Milne13,Milne (2013),harmonicity,#11A3FF,Piano
12.192192192192191,0.7995200086696161,Milne13,Milne (2013),harmonicity,#11A3FF,Piano
12.207207207207206,0.7703021601671478,Milne13,Milne (2013),harmonicity,#11A3FF,Piano
12.222222222222221,0.7460956869125647,Milne13,Milne (2013),harmonicity,#11A3FF,Piano
12.237237237237236,0.7278202627492173,Milne13,Milne (2013),harmonicity,#11A3FF,Piano
12.252252252252251,0.7150579795560246,Milne13,Milne (2013),harmonicity,#11A3FF,Piano
12.267267267267266,0.7066426694474341,Milne13,Milne (2013),harmonicity,#11A3FF,Piano
12.282282282282281,0.7013015340155726,Milne13,Milne (2013),harmonicity,#11A3FF,Piano
12.297297297297296,0.6979969206774325,Milne13,Milne (2013),harmonicity,#11A3FF,Piano
12.312312312312311,0.6959874293633167,Milne13,Milne (2013),harmonicity,#11A3FF,Piano
12.327327327327327,0.6947756393955548,Milne13,Milne (2013),harmonicity,#11A3FF,Piano
12.342342342342342,0.6940442281637211,Milne13,Milne (2013),harmonicity,#11A3FF,Piano
12.357357357357357,0.6936009454681296,Milne13,Milne (2013),harmonicity,#11A3FF,Piano
12.372372372372372,0.6933326433403303,Milne13,Milne (2013),harmonicity,#11A3FF,Piano
12.387387387387387,0.6931719574171682,Milne13,Milne (2013),harmonicity,#11A3FF,Piano
12.402402402402402,0.6930774259874848,Milne13,Milne (2013),harmonicity,#11A3FF,Piano
12.417417417417417,0.693022994785286,Milne13,Milne (2013),harmonicity,#11A3FF,Piano
12.432432432432432,0.6929923546345877,Milne13,Milne (2013),harmonicity,#11A3FF,Piano
12.447447447447447,0.6929754969182303,Milne13,Milne (2013),harmonicity,#11A3FF,Piano
12.462462462462462,0.692966432709033,Milne13,Milne (2013),harmonicity,#11A3FF,Piano
12.477477477477477,0.6929616701578191,Milne13,Milne (2013),harmonicity,#11A3FF,Piano
12.492492492492492,0.6929592252654211,Milne13,Milne (2013),harmonicity,#11A3FF,Piano
12.507507507507507,0.6929579992491508,Milne13,Milne (2013),harmonicity,#11A3FF,Piano
12.522522522522522,0.6929573988013429,Milne13,Milne (2013),harmonicity,#11A3FF,Piano
12.537537537537537,0.6929571116353987,Milne13,Milne (2013),harmonicity,#11A3FF,Piano
12.552552552552552,0.6929569775168519,Milne13,Milne (2013),harmonicity,#11A3FF,Piano
12.567567567567567,0.6929569161981987,Milne13,Milne (2013),harmonicity,#11A3FF,Piano
12.582582582582582,0.6929568884886589,Milne13,Milne (2013),harmonicity,#11A3FF,Piano
12.597597597597597,0.6929568758952946,Milne13,Milne (2013),harmonicity,#11A3FF,Piano
12.612612612612612,0.692956870084158,Milne13,Milne (2013),harmonicity,#11A3FF,Piano
12.627627627627627,0.6929568674138572,Milne13,Milne (2013),harmonicity,#11A3FF,Piano
12.642642642642642,0.6929568662416434,Milne13,Milne (2013),harmonicity,#11A3FF,Piano
12.657657657657657,0.6929568657660105,Milne13,Milne (2013),harmonicity,#11A3FF,Piano
12.672672672672672,0.6929568655883228,Milne13,Milne (2013),harmonicity,#11A3FF,Piano
12.687687687687687,0.6929568655256615,Milne13,Milne (2013),harmonicity,#11A3FF,Piano
12.702702702702702,0.6929568655040185,Milne13,Milne (2013),harmonicity,#11A3FF,Piano
12.717717717717717,0.6929568654965154,Milne13,Milne (2013),harmonicity,#11A3FF,Piano
12.732732732732732,0.6929568654939016,Milne13,Milne (2013),harmonicity,#11A3FF,Piano
12.747747747747747,0.6929568654929972,Milne13,Milne (2013),harmonicity,#11A3FF,Piano
12.762762762762762,0.6929568654926903,Milne13,Milne (2013),harmonicity,#11A3FF,Piano
12.777777777777777,0.6929568654925915,Milne13,Milne (2013),harmonicity,#11A3FF,Piano
12.792792792792792,0.6929568654925699,Milne13,Milne (2013),harmonicity,#11A3FF,Piano
12.807807807807807,0.6929568654925933,Milne13,Milne (2013),harmonicity,#11A3FF,Piano
12.822822822822824,0.6929568654926852,Milne13,Milne (2013),harmonicity,#11A3FF,Piano
12.837837837837839,0.6929568654929537,Milne13,Milne (2013),harmonicity,#11A3FF,Piano
12.852852852852854,0.6929568654937096,Milne13,Milne (2013),harmonicity,#11A3FF,Piano
12.867867867867869,0.6929568654957293,Milne13,Milne (2013),harmonicity,#11A3FF,Piano
12.882882882882884,0.6929568655005643,Milne13,Milne (2013),harmonicity,#11A3FF,Piano
12.897897897897899,0.6929568655103454,Milne13,Milne (2013),harmonicity,#11A3FF,Piano
12.912912912912914,0.6929568655262973,Milne13,Milne (2013),harmonicity,#11A3FF,Piano
12.927927927927929,0.6929568655470915,Milne13,Milne (2013),harmonicity,#11A3FF,Piano
12.942942942942944,0.6929568655742712,Milne13,Milne (2013),harmonicity,#11A3FF,Piano
12.957957957957959,0.6929568656418342,Milne13,Milne (2013),harmonicity,#11A3FF,Piano
12.972972972972974,0.6929568658956016,Milne13,Milne (2013),harmonicity,#11A3FF,Piano
12.987987987987989,0.6929568667403062,Milne13,Milne (2013),harmonicity,#11A3FF,Piano
13.003003003003004,0.6929568690323454,Milne13,Milne (2013),harmonicity,#11A3FF,Piano
13.018018018018019,0.6929568742569832,Milne13,Milne (2013),harmonicity,#11A3FF,Piano
13.033033033033034,0.6929568846183651,Milne13,Milne (2013),harmonicity,#11A3FF,Piano
13.048048048048049,0.6929569028195276,Milne13,Milne (2013),harmonicity,#11A3FF,Piano
13.063063063063064,0.6929569312164884,Milne13,Milne (2013),harmonicity,#11A3FF,Piano
13.078078078078079,0.6929569717944116,Milne13,Milne (2013),harmonicity,#11A3FF,Piano
13.093093093093094,0.6929570323348793,Milne13,Milne (2013),harmonicity,#11A3FF,Piano
13.108108108108109,0.6929571405229712,Milne13,Milne (2013),harmonicity,#11A3FF,Piano
13.123123123123124,0.692957348275726,Milne13,Milne (2013),harmonicity,#11A3FF,Piano
13.138138138138139,0.6929577100475972,Milne13,Milne (2013),harmonicity,#11A3FF,Piano
13.153153153153154,0.692958290099889,Milne13,Milne (2013),harmonicity,#11A3FF,Piano
13.168168168168169,0.6929592842997091,Milne13,Milne (2013),harmonicity,#11A3FF,Piano
13.183183183183184,0.6929611413738681,Milne13,Milne (2013),harmonicity,#11A3FF,Piano
13.198198198198199,0.692964419903686,Milne13,Milne (2013),harmonicity,#11A3FF,Piano
13.213213213213214,0.6929696532491768,Milne13,Milne (2013),harmonicity,#11A3FF,Piano
13.228228228228229,0.6929781604485471,Milne13,Milne (2013),harmonicity,#11A3FF,Piano
13.243243243243244,0.6929937242736983,Milne13,Milne (2013),harmonicity,#11A3FF,Piano
13.258258258258259,0.6930228424367841,Milne13,Milne (2013),harmonicity,#11A3FF,Piano
13.273273273273274,0.6930718003869532,Milne13,Milne (2013),harmonicity,#11A3FF,Piano
13.288288288288289,0.6931430324685501,Milne13,Milne (2013),harmonicity,#11A3FF,Piano
13.303303303303304,0.6932351697712301,Milne13,Milne (2013),harmonicity,#11A3FF,Piano
13.318318318318319,0.6933469504891762,Milne13,Milne (2013),harmonicity,#11A3FF,Piano
13.333333333333334,0.6934803497162484,Milne13,Milne (2013),harmonicity,#11A3FF,Piano
13.348348348348349,0.6936393179624732,Milne13,Milne (2013),harmonicity,#11A3FF,Piano
13.363363363363364,0.6938256234932235,Milne13,Milne (2013),harmonicity,#11A3FF,Piano
13.378378378378379,0.69403620368450325,Milne13,Milne (2013),harmonicity,#11A3FF,Piano
13.393393393393394,0.6942640585845076,Milne13,Milne (2013),harmonicity,#11A3FF,Piano
13.408408408408409,0.6945005287934772,Milne13,Milne (2013),harmonicity,#11A3FF,Piano
13.423423423423424,0.694736275337578,Milne13,Milne (2013),harmonicity,#11A3FF,Piano
13.438438438438439,0.6949609738501455,Milne13,Milne (2013),harmonicity,#11A3FF,Piano
13.453453453453454,0.6951632270342373,Milne13,Milne (2013),harmonicity,#11A3FF,Piano
13.468468468468469,0.6953315695829624,Milne13,Milne (2013),harmonicity,#11A3FF,Piano
13.483483483483484,0.6954564821512966,Milne13,Milne (2013),harmonicity,#11A3FF,Piano
13.498498498498499,0.6955324484756386,Milne13,Milne (2013),harmonicity,#11A3FF,Piano
13.513513513513514,0.6955586945022684,Milne13,Milne (2013),harmonicity,#11A3FF,Piano
13.528528528528529,0.6955390029279784,Milne13,Milne (2013),harmonicity,#11A3FF,Piano
13.543543543543544,0.6954833009832421,Milne13,Milne (2013),harmonicity,#11A3FF,Piano
13.558558558558559,0.6954113322413885,Milne13,Milne (2013),harmonicity,#11A3FF,Piano
13.573573573573574,0.6953525370375276,Milne13,Milne (2013),harmonicity,#11A3FF,Piano
13.588588588588589,0.6953361738747552,Milne13,Milne (2013),harmonicity,#11A3FF,Piano
13.603603603603604,0.6953760954943543,Milne13,Milne (2013),harmonicity,#11A3FF,Piano
13.618618618618619,0.6954634938365574,Milne13,Milne (2013),harmonicity,#11A3FF,Piano
13.633633633633634,0.6955745916002021,Milne13,Milne (2013),harmonicity,#11A3FF,Piano
13.64864864864865,0.6956854766509728,Milne13,Milne (2013),harmonicity,#11A3FF,Piano
13.663663663663664,0.6957819204315705,Milne13,Milne (2013),harmonicity,#11A3FF,Piano
13.67867867867868,0.6958606053082044,Milne13,Milne (2013),harmonicity,#11A3FF,Piano
13.693693693693694,0.6959260529658667,Milne13,Milne (2013),harmonicity,#11A3FF,Piano
13.70870870870871,0.6959876921526845,Milne13,Milne (2013),harmonicity,#11A3FF,Piano
13.723723723723724,0.6960583932964615,Milne13,Milne (2013),harmonicity,#11A3FF,Piano
13.73873873873874,0.6961540672726508,Milne13,Milne (2013),harmonicity,#11A3FF,Piano
13.753753753753754,0.6962937814131344,Milne13,Milne (2013),harmonicity,#11A3FF,Piano
13.76876876876877,0.6965000755484969,Milne13,Milne (2013),harmonicity,#11A3FF,Piano
13.783783783783784,0.6967992415432389,Milne13,Milne (2013),harmonicity,#11A3FF,Piano
13.7987987987988,0.6972212938230559,Milne13,Milne (2013),harmonicity,#11A3FF,Piano
13.813813813813814,0.6977993134012481,Milne13,Milne (2013),harmonicity,#11A3FF,Piano
13.82882882882883,0.6985678607695018,Milne13,Milne (2013),harmonicity,#11A3FF,Piano
13.843843843843844,0.6995602495982056,Milne13,Milne (2013),harmonicity,#11A3FF,Piano
13.85885885885886,0.7008046576942051,Milne13,Milne (2013),harmonicity,#11A3FF,Piano
13.873873873873874,0.70231930971563294,Milne13,Milne (2013),harmonicity,#11A3FF,Piano
13.88888888888889,0.7041072410796045,Milne13,Milne (2013),harmonicity,#11A3FF,Piano
13.903903903903904,0.706151320499565,Milne13,Milne (2013),harmonicity,#11A3FF,Piano
13.91891891891892,0.7084100667316354,Milne13,Milne (2013),harmonicity,#11A3FF,Piano
13.933933933933934,0.7108146880712007,Milne13,Milne (2013),harmonicity,#11A3FF,Piano
13.94894894894895,0.713269678244689,Milne13,Milne (2013),harmonicity,#11A3FF,Piano
13.963963963963964,0.7156646376551895,Milne13,Milne (2013),harmonicity,#11A3FF,Piano
13.97897897897898,0.7179051707828007,Milne13,Milne (2013),harmonicity,#11A3FF,Piano
13.993993993993994,0.7199472349233885,Milne13,Milne (2013),harmonicity,#11A3FF,Piano
14.00900900900901,0.7217819054514724,Milne13,Milne (2013),harmonicity,#11A3FF,Piano
14.024024024024024,0.7233375124295335,Milne13,Milne (2013),harmonicity,#11A3FF,Piano
14.03903903903904,0.7243869396389349,Milne13,Milne (2013),harmonicity,#11A3FF,Piano
14.054054054054054,0.7246258535869486,Milne13,Milne (2013),harmonicity,#11A3FF,Piano
14.06906906906907,0.723917792597461,Milne13,Milne (2013),harmonicity,#11A3FF,Piano
14.084084084084084,0.7224440693163462,Milne13,Milne (2013),harmonicity,#11A3FF,Piano
14.0990990990991,0.7205755540912808,Milne13,Milne (2013),harmonicity,#11A3FF,Piano
14.114114114114114,0.7186328958858319,Milne13,Milne (2013),harmonicity,#11A3FF,Piano
14.12912912912913,0.7167924638692004,Milne13,Milne (2013),harmonicity,#11A3FF,Piano
14.144144144144144,0.7151555538655866,Milne13,Milne (2013),harmonicity,#11A3FF,Piano
14.15915915915916,0.7138394612549696,Milne13,Milne (2013),harmonicity,#11A3FF,Piano
14.174174174174174,0.7130036392820299,Milne13,Milne (2013),harmonicity,#11A3FF,Piano
14.18918918918919,0.7128041158207773,Milne13,Milne (2013),harmonicity,#11A3FF,Piano
14.204204204204204,0.7133025059912369,Milne13,Milne (2013),harmonicity,#11A3FF,Piano
14.21921921921922,0.7143965647804956,Milne13,Milne (2013),harmonicity,#11A3FF,Piano
14.234234234234235,0.7158519381934354,Milne13,Milne (2013),harmonicity,#11A3FF,Piano
14.24924924924925,0.7174248843964065,Milne13,Milne (2013),harmonicity,#11A3FF,Piano
14.264264264264265,0.7189524045834726,Milne13,Milne (2013),harmonicity,#11A3FF,Piano
14.27927927927928,0.7203196215015343,Milne13,Milne (2013),harmonicity,#11A3FF,Piano
14.294294294294295,0.721376001408835,Milne13,Milne (2013),harmonicity,#11A3FF,Piano
14.30930930930931,0.7219330402984608,Milne13,Milne (2013),harmonicity,#11A3FF,Piano
14.324324324324325,0.7218491103760776,Milne13,Milne (2013),harmonicity,#11A3FF,Piano
14.33933933933934,0.7210943595198289,Milne13,Milne (2013),harmonicity,#11A3FF,Piano
14.354354354354355,0.7197380578744451,Milne13,Milne (2013),harmonicity,#11A3FF,Piano
14.36936936936937,0.7178981225054466,Milne13,Milne (2013),harmonicity,#11A3FF,Piano
14.384384384384385,0.7157056029949945,Milne13,Milne (2013),harmonicity,#11A3FF,Piano
14.3993993993994,0.7132940016947308,Milne13,Milne (2013),harmonicity,#11A3FF,Piano
14.414414414414415,0.7107972672468817,Milne13,Milne (2013),harmonicity,#11A3FF,Piano
14.42942942942943,0.7083440455577433,Milne13,Milne (2013),harmonicity,#11A3FF,Piano
14.444444444444445,0.7060480383326957,Milne13,Milne (2013),harmonicity,#11A3FF,Piano
14.45945945945946,0.7040001361906658,Milne13,Milne (2013),harmonicity,#11A3FF,Piano
14.474474474474475,0.7022654389579783,Milne13,Milne (2013),harmonicity,#11A3FF,Piano
14.48948948948949,0.7008830433932642,Milne13,Milne (2013),harmonicity,#11A3FF,Piano
14.504504504504505,0.6998655140053177,Milne13,Milne (2013),harmonicity,#11A3FF,Piano
14.51951951951952,0.6991992908541892,Milne13,Milne (2013),harmonicity,#11A3FF,Piano
14.534534534534535,0.6988501333485627,Milne13,Milne (2013),harmonicity,#11A3FF,Piano
14.54954954954955,0.6987726454796276,Milne13,Milne (2013),harmonicity,#11A3FF,Piano
14.564564564564565,0.6989162268439583,Milne13,Milne (2013),harmonicity,#11A3FF,Piano
14.57957957957958,0.6992233553355843,Milne13,Milne (2013),harmonicity,#11A3FF,Piano
14.594594594594595,0.699624322822118,Milne13,Milne (2013),harmonicity,#11A3FF,Piano
14.60960960960961,0.7000317568037439,Milne13,Milne (2013),harmonicity,#11A3FF,Piano
14.624624624624625,0.7003385538976208,Milne13,Milne (2013),harmonicity,#11A3FF,Piano
14.63963963963964,0.7004398577164385,Milne13,Milne (2013),harmonicity,#11A3FF,Piano
14.654654654654655,0.7003003379927357,Milne13,Milne (2013),harmonicity,#11A3FF,Piano
14.66966966966967,0.7000193275300743,Milne13,Milne (2013),harmonicity,#11A3FF,Piano
14.684684684684685,0.6997805418649241,Milne13,Milne (2013),harmonicity,#11A3FF,Piano
14.6996996996997,0.6996810741265206,Milne13,Milne (2013),harmonicity,#11A3FF,Piano
14.714714714714715,0.6996294434390776,Milne13,Milne (2013),harmonicity,#11A3FF,Piano
14.72972972972973,0.6994470067840941,Milne13,Milne (2013),harmonicity,#11A3FF,Piano
14.744744744744745,0.6990392047351526,Milne13,Milne (2013),harmonicity,#11A3FF,Piano
14.75975975975976,0.698443318963921,Milne13,Milne (2013),harmonicity,#11A3FF,Piano
14.774774774774775,0.6977549218732509,Milne13,Milne (2013),harmonicity,#11A3FF,Piano
14.78978978978979,0.6970522463156176,Milne13,Milne (2013),harmonicity,#11A3FF,Piano
14.804804804804805,0.6963770182906175,Milne13,Milne (2013),harmonicity,#11A3FF,Piano
14.81981981981982,0.695750641606711,Milne13,Milne (2013),harmonicity,#11A3FF,Piano
14.834834834834835,0.695190843665949,Milne13,Milne (2013),harmonicity,#11A3FF,Piano
14.84984984984985,0.6947152431976923,Milne13,Milne (2013),harmonicity,#11A3FF,Piano
14.864864864864865,0.6943372394255672,Milne13,Milne (2013),harmonicity,#11A3FF,Piano
14.87987987987988,0.6940641929924595,Milne13,Milne (2013),harmonicity,#11A3FF,Piano
14.894894894894895,0.6939006001894472,Milne13,Milne (2013),harmonicity,#11A3FF,Piano
14.90990990990991,0.6938507393643654,Milne13,Milne (2013),harmonicity,#11A3FF,Piano
14.924924924924925,0.6939155306378605,Milne13,Milne (2013),harmonicity,#11A3FF,Piano
14.93993993993994,0.6940842852190235,Milne13,Milne (2013),harmonicity,#11A3FF,Piano
14.954954954954955,0.6943275898994233,Milne13,Milne (2013),harmonicity,#11A3FF,Piano
14.96996996996997,0.6946008527825384,Milne13,Milne (2013),harmonicity,#11A3FF,Piano
14.984984984984985,0.6948605964485322,Milne13,Milne (2013),harmonicity,#11A3FF,Piano
15,0.6950800154864335,Milne13,Milne (2013),harmonicity,#11A3FF,Piano
