interval,rating,rating_boot_mean,rating_boot_se
3.65,-0.08037198238090365,-0.08113428671083542,0.024304681313806257
3.6505005005005002,-0.08010412006073037,-0.08086219707122043,0.024217231422941684
3.651001001001001,-0.07983504925299681,-0.0805888450368543,0.02412984006813981
3.6515015015015013,-0.0795647821845524,-0.08031424264324893,0.02404251304131205
3.652002002002002,-0.07929333171906748,-0.08003840257664122,0.023955256305278505
3.6525025025025024,-0.07902071136578509,-0.07976133818322116,0.023868075995628533
3.6530030030030027,-0.07874693528809357,-0.07948306347817985,0.023780978422455083
3.6535035035035035,-0.07847201831189045,-0.07920359315456808,0.0236939700719555
3.654004004004004,-0.07819597593375363,-0.07892294259195085,0.02360705760788971
3.6545045045045046,-0.07791882432887141,-0.0786411278648387,0.023520247872883857
3.655005005005005,-0.07764058035875748,-0.07835816575089798,0.023433547889574965
3.6555055055055052,-0.0773612615786974,-0.07807407373890596,0.023346964861580898
3.656006006006006,-0.07708088624494921,-0.0777888700364539,0.02326050617429052
3.6565065065065063,-0.076799473321655,-0.07750257357737594,0.023174179395462166
3.657007007007007,-0.07651704248747736,-0.07721520402889034,0.023087992275619446
3.6575075075075074,-0.07623361414191751,-0.07692678179844208,0.023001952748235424
3.6580080080080077,-0.07594920941132571,-0.07663732804022474,0.022916068929693365
3.6585085085085085,-0.07566385015457851,-0.07634686466138021,0.02283034911901599
3.659009009009009,-0.07537755896840843,-0.07605541432784704,0.022744801797348807
3.6595095095095096,-0.07509035919237585,-0.07576300046985214,0.02265943562719064
3.66001001001001,-0.07480227491346411,-0.0754696472870291,0.02257425945135779
3.6605105105105102,-0.07451333097028878,-0.07517537975314499,0.022489282291673216
3.661011011011011,-0.07422355295690637,-0.07488022362042704,0.022404513347369346
3.6615115115115113,-0.07393296722619705,-0.07458420542346536,0.022319961993192552
3.662012012012012,-0.07364160089282741,-0.07428735248268561,0.02223563777720192
3.6625125125125124,-0.07334948183576073,-0.07398969290737413,0.02215155041824924
3.6630130130130127,-0.07305663870031195,-0.07369125559823642,0.02206770980313184
3.6635135135135135,-0.07276310089971984,-0.07339207024947617,0.021984125983405666
3.664014014014014,-0.0724688986162474,-0.07309216735039113,0.021900809171854788
3.6645145145145146,-0.07217406280176714,-0.07279157818644781,0.021817769738600196
3.665015015015015,-0.07187862517783838,-0.07249033483984733,0.021735018206845702
3.6655155155155152,-0.0715826182352527,-0.0721884701895456,0.021652565248248296
3.666016016016016,-0.07128607523304281,-0.07188601791073218,0.021570421677907542
3.6665165165165163,-0.07098903019693334,-0.07158301247373847,0.021488598448964277
3.667017017017017,-0.07069151791722432,-0.07127948914237474,0.021407106646802735
3.6675175175175174,-0.07039357394610024,-0.07097548397167282,0.02132595748285018
3.6680180180180177,-0.07009523459434167,-0.07067103380502802,0.021245162287968102
3.6685185185185185,-0.06979653692743876,-0.07036617627072474,0.021164732505428836
3.669019019019019,-0.06949751876109146,-0.07006094977783495,0.021084679683476035
3.6695195195195196,-0.06919821865607557,-0.06975539351147517,0.021005015467463212
3.67002002002002,-0.06889867591249015,-0.06944954742741609,0.020925751591570393
3.6705205205205202,-0.06859893056334034,-0.06914345224602644,0.020846899870095373
3.671021021021021,-0.06829902336748493,-0.06883714944554754,0.020768472188321726
3.6715215215215213,-0.06799899580190726,-0.06853068125468567,0.02069048049296275
3.672022022022022,-0.06769889005331683,-0.06822409064451143,0.020612936782184066
3.6725225225225224,-0.0673987490090778,-0.06791742131966023,0.020535853095208317
3.6730230230230227,-0.06709861624744504,-0.06761071770882546,0.02045924150150732
3.6735235235235235,-0.0667985360271084,-0.06730402495453439,0.020383114089585628
3.674024024024024,-0.06649855327604633,-0.06699738890220489,0.02030748295536663
3.6745245245245246,-0.0661987135796602,-0.06669085608846875,0.020232360190185025
3.675025025025025,-0.06589906316822049,-0.06638447372876877,0.02015775786840253
3.6755255255255253,-0.06559964890358777,-0.0660782897042105,0.020083688034652495
3.676026026026026,-0.0653005182652237,-0.06577235254767562,0.020010162690731664
3.6765265265265263,-0.06500171933549397,-0.06546671142919452,0.019937193782153237
3.677027027027027,-0.06470330078424345,-0.06516141614056359,0.01986479318437638
3.6775275275275274,-0.06440531185266465,-0.06485651707922396,0.019792972688734083
3.6780280280280278,-0.06410780233644589,-0.06455206523138618,0.019721743988076676
3.6785285285285285,-0.06381082256820444,-0.06424811215441098,0.019651118662155766
3.679029029029029,-0.06351442339921833,-0.06394470995844531,0.0195811081627715
3.6795295295295296,-0.06321865618043447,-0.06364191128731184,0.01951172379870673
3.68003003003003,-0.06292357274279389,-0.0633397692986665,0.019442976720481276
3.6805305305305303,-0.06262922537684272,-0.06303833764341583,0.019374877904947026
3.681031031031031,-0.062335666811666315,-0.06273767044440946,0.019307438139762677
3.6815315315315313,-0.06204295019313346,-0.062437822274413954,0.0192406680077752
3.682032032032032,-0.06175112906147103,-0.06213884813336743,0.019174577871343204
3.6825325325325324,-0.061460257328176594,-0.06184080342493787,0.01910917785663959
3.6830330330330328,-0.06117038925227449,-0.06154374393238363,0.019044477837967023
3.6835335335335335,-0.06088157941593538,-0.06124772579373224,0.018980487422126283
3.684034034034034,-0.06059388269947155,-0.06095280547629505,0.018917215932878026
3.6845345345345346,-0.06030735425571172,-0.06065903975051891,0.018854672395534552
3.685035035035035,-0.06002204948379219,-0.060366485663205,0.018792865521727438
3.6855355355355357,-0.059738024002352966,-0.06007520051009853,0.01873180369439011
3.686036036036036,-0.05945533362218495,-0.05978524180787521,0.018671494953000575
3.6865365365365363,-0.059174034318325096,-0.059496667265536936,0.018611946979126007
3.687037037037037,-0.05889418220163118,-0.059209534755240385,0.018553167082314807
3.6875375375375374,-0.05861583348985666,-0.058923902282579085,0.018495162186379765
3.688038038038038,-0.058339044478239566,-0.0586398279563367,0.018437938816115603
3.6885385385385385,-0.05806387150963944,-0.05835736995774202,0.018381503084496688
3.689039039039039,-0.057790370944240985,-0.05807658650924293,0.01832586068039786
3.6895395395395396,-0.0575185991288446,-0.05779753584282834,0.018271016856880335
3.69004004004004,-0.05724861236578766,-0.05752027616792736,0.01821697642008834
3.6905405405405407,-0.05698046688149706,-0.05724486563890356,0.018163743718793143
3.691041041041041,-0.056714218794729085,-0.05697136232218659,0.01811132263462958
3.6915415415415413,-0.05644992408450588,-0.05669982416305859,0.018059716573060543
3.692042042042042,-0.0561876385577888,-0.056430308952134384,0.018008928455108167
3.6925425425425424,-0.055927417816914994,-0.05616287429156291,0.01795896070988583
3.693043043043043,-0.0556693172268271,-0.05589757756098196,0.017909815267966513
3.6935435435435435,-0.055413391882145314,-0.0556344758832653,0.017861493555615126
3.694044044044044,-0.05515969657408229,-0.05537362609008845,0.0178139964899171
3.6945445445445446,-0.054908285757271136,-0.055115084687353544,0.017767324474825746
3.695045045045045,-0.054659213516516,-0.05485890782051005,0.017721477398154842
3.6955455455455457,-0.05441253353351062,-0.054605151239800795,0.017676454629532757
3.696046046046046,-0.054168299053561436,-0.05435387026548141,0.017632255019339255
3.6965465465465464,-0.05392656285234339,-0.05410511975303843,0.01758887689863474
3.697047047047047,-0.05368737720273743,-0.05385895405845535,0.017546318080094936
3.6975475475475474,-0.05345079384177522,-0.053615427003559264,0.017504575859956725
3.698048048048048,-0.0532168639377375,-0.05337459184148801,0.017463647020978055
3.6985485485485485,-0.05298563805743322,-0.05313650122231997,0.01742352783641201
3.699049049049049,-0.05275716613370648,-0.052901207158899254,0.017384214074989596
3.6995495495495496,-0.05253149743321158,-0.052668760992908965,0.01734570100690554
3.70005005005005,-0.05230868052447871,-0.0524392133612171,0.017307983410791875
3.7005505505505507,-0.052088763246319496,-0.05221261416254577,0.01727105558166672
3.701051051051051,-0.051871792676619705,-0.05198901252450555,0.017234911339838482
3.7015515515515514,-0.05165781510152537,-0.05176845677101835,0.017199544040739794
3.702052052052052,-0.05144687598509807,-0.05155099439019182,0.01716494658566824
3.7025525525525524,-0.051239019939445754,-0.051336672002667484,0.017131111433402624
3.703053053053053,-0.051034290695381575,-0.05112553533048604,0.01709803061265839
3.7035535535535535,-0.05083273107364308,-0.050917629166514426,0.017065695735351664
3.704054054054054,-0.050634382956702896,-0.05071299734446308,0.017034098010625283
3.7045545545545546,-0.05043928726120989,-0.05051168270953721,0.017003228259598487
3.705055055055055,-0.05024748391109924,-0.050313727089759536,0.016973076930794716
3.7055555555555557,-0.05005901181138886,-0.050119171267995526,0.0169436341161965
3.706056056056056,-0.04987390882271567,-0.0499280549547194,0.016914889567880967
3.7065565565565564,-0.04969221173662277,-0.049740416761556536,0.016886832715180967
3.707057057057057,-0.04951395625164118,-0.04955629417563086,0.016859452682318782
3.7075575575575574,-0.0493391769501942,-0.04937572353475615,0.016832738306457647
3.708058058058058,-0.04916790727634084,-0.0491987400034924,0.016806678156111438
3.7085585585585585,-0.049000179514399146,-0.04902537755010849,0.01678126054985773
3.709059059059059,-0.048836024768470286,-0.04885566892446966,0.016756473575293713
3.7095595595595596,-0.04867547294287861,-0.048689645636881634,0.01673230510817491
3.71006006006006,-0.04851855272356478,-0.048527337937916,0.016708742831679762
3.7105605605605607,-0.0483652915604421,-0.04836877479923974,0.016685774255738643
3.711061061061061,-0.04821571565073892,-0.04821398389547287,0.016663386736368788
3.7115615615615614,-0.04806984992334609,-0.04806299158709282,0.016641567494957078
3.712062062062062,-0.04792771802418384,-0.047915822904404715,0.016620303637432148
3.7125625625625625,-0.04778934230260446,-0.047772501532596885,0.016599582173271347
3.713063063063063,-0.047654743798836934,-0.047633049797893706,0.01657939003428453
3.7135635635635635,-0.047523942232496647,-0.047497488654819564,0.0165597140931237
3.714064064064064,-0.04739695599215771,-0.047365837674589836,0.016540541181466178
3.7145645645645646,-0.04727380212599724,-0.04723811503462825,0.01652185810781964
3.715065065065065,-0.047154496333523525,-0.04711433750923156,0.016503651674905303
3.7155655655655657,-0.04703905295838229,-0.04699452046137302,0.016485908696570708
3.716066066066066,-0.046927484982248614,-0.04687867783565973,0.01646861601419158
3.7165665665665664,-0.046819804019801334,-0.04676682215243544,0.016451760512522676
3.717067067067067,-0.046716020314774655,-0.04665896450303473,0.016435329134960153
3.7175675675675675,-0.04661614273709231,-0.04655511454618337,0.016419308898183112
3.7180680680680682,-0.04652017878106112,-0.04645528050553583,0.016403686906140517
3.7185685685685685,-0.046428134564633176,-0.04635946916835117,0.016388450363360122
3.719069069069069,-0.04634001482971241,-0.04626768588528709,0.016373586587550944
3.7195695695695696,-0.04625582294350084,-0.04617993457131058,0.016359083021481157
3.72007007007007,-0.046175560900866615,-0.046096217707705125,0.01634492724411157
3.7205705705705707,-0.04609922932771733,-0.046016536345161084,0.016331106980972065
3.721071071071071,-0.046026827485366344,-0.045940890107932515,0.016317610113768827
3.7215715715715714,-0.045958353275858704,-0.04586927719903664,0.01630442468921524
3.722072072072072,-0.04589380324824933,-0.04580169440647862,0.016291538927080743
3.7225725725725725,-0.04583317260580653,-0.04573813711047894,0.0162789412274599
3.7230730730730732,-0.04577645521410136,-0.04567859929166921,0.016266620177259283
3.7235735735735735,-0.045723643609979187,-0.045623073540239714,0.016254564555910976
3.724074074074074,-0.04567472901136511,-0.04557155106600433,0.016242763340319676
3.7245745745745746,-0.04562970132788429,-0.045524021709350465,0.016231205709054727
3.725075075075075,-0.045588549172259615,-0.04548047395304457,0.016219881045800418
3.7255755755755757,-0.045551259872457284,-0.045440894934858776,0.016208778942084147
3.726076076076076,-0.04551781948454493,-0.04540527046098093,0.016197889199298578
3.7265765765765764,-0.0454882128062249,-0.04537358502017388,0.01618720183004163
3.727077077077077,-0.045462423391007666,-0.045345821798642896,0.016176707058798968
3.7275775775775775,-0.0454404335629893,-0.04532196269557361,0.01616639532199393
3.7280780780780782,-0.045422224432186686,-0.04530198833929942,0.016156257267434877
3.7285785785785786,-0.045407775910401627,-0.0452858781040556,0.01614628375318932
3.729079079079079,-0.04539706672756251,-0.045273610127278326,0.016136465845917543
3.7295795795795796,-0.04539007444851209,-0.04526516132740523,0.016126794818698914
3.73008008008008,-0.04538677549018762,-0.04526050742213085,0.016117262148385155
3.7305805805805807,-0.045387145139163296,-0.045259622947075924,0.016107859512518634
3.731081081081081,-0.04539115756950279,-0.0452624812748217,0.01609857878585003
3.7315815815815814,-0.04539878586088424,-0.04526905463426299,0.01608941203649523
3.732082082082082,-0.04541000201694729,-0.045279314130236094,0.016080351521768583
3.7325825825825825,-0.04542477698382871,-0.0452932297633745,0.01607138968373268
3.7330830830830832,-0.045443080668831105,-0.0453107704501426,0.016062519144502355
3.7335835835835836,-0.04546488195919229,-0.04533190404300466,0.016053732701342992
3.734084084084084,-0.04549014874090046,-0.04535659735068051,0.016045023321602684
3.7345845845845846,-0.045518847917522975,-0.04538481615844063,0.01603638413751545
3.735085085085085,-0.04555094542899775,-0.04541652524839696,0.016027808440916363
3.7355855855855857,-0.045586406270348205,-0.04545168841974286,0.01601928967790447
3.736086086086086,-0.04562519451027762,-0.04549026850889339,0.01601082144349135
3.7365865865865864,-0.04566727330960776,-0.04553222740949074,0.01600239747627362
3.737087087087087,-0.0457126049395109,-0.04557752609221806,0.01599401165315977
3.7375875875875875,-0.04576115079950592,-0.045626124624391376,0.015985657984192273
3.7380880880880882,-0.0458128714351742,-0.04567798218928053,0.015977330607492724
3.7385885885885886,-0.04586772655555594,-0.04573305710511726,0.015969023784363375
3.739089089089089,-0.04592567505019868,-0.04579130684375771,0.01596073189457623
3.7395895895895896,-0.045986675005811405,-0.04585268804895268,0.015952449431877107
3.74009009009009,-0.046050683722498764,-0.04591715655419342,0.01594417099973233
3.7405905905905907,-0.04611765772953958,-0.04598466740009691,0.01593589130734301
3.741091091091091,-0.0461875528006771,-0.04605517485129281,0.015927605165950643
3.7415915915915914,-0.04626032396889197,-0.046128632412783824,0.01591930748545594
3.742092092092092,-0.04633592554063369,-0.0462049928457454,0.015910993271370126
3.7425925925925925,-0.04641431110947317,-0.04628420818273592,0.015902657622117244
3.7430930930930932,-0.04649543356916668,-0.04636622974229036,0.01589429572670261
3.7435935935935936,-0.04657924512609159,-0.04645100814287147,0.01588590286276258
3.744094094094094,-0.04666569731104648,-0.046538493316153784,0.015877474395005732
3.7445945945945946,-0.04675474099038697,-0.0466286345196188,0.015869005774057043
3.745095095095095,-0.046846326376481416,-0.046721380348442115,0.015860492535712804
3.7455955955955957,-0.046940403037475716,-0.04681667874665487,0.015851930300610866
3.746096096096096,-0.04703691990634345,-0.04691447701755949,0.015843314774321535
3.7465965965965964,-0.04713582528922043,-0.047014721833394224,0.015834641747861172
3.747097097097097,-0.04723706687300579,-0.047117359244224666,0.015825907098627075
3.7475975975975975,-0.04734059173222425,-0.04722233468606197,0.01581710679175412
3.7480980980980982,-0.0474463463351478,-0.04732959298819531,0.01580823688188754
3.7485985985985986,-0.047554276549162444,-0.04743907837973439,0.01579929351536754
3.749099099099099,-0.04766432764539249,-0.047550734495360715,0.01579027293281861
3.7495995995995997,-0.04777644430257294,-0.04766450438028551,0.01578117147213373
3.7501001001001,-0.04789057061017185,-0.047780330494417426,0.015771985571844914
3.7506006006006007,-0.04800665007077866,-0.04789815471574299,0.015762711774865535
3.751101101101101,-0.04812462560175149,-0.04801791834292547,0.015753346732594115
3.7516016016016014,-0.04824443953613896,-0.048139562097132646,0.01574388720936144
3.752102102102102,-0.04836603362289184,-0.04826302612310339,0.015734330087207104
3.7526026026026025,-0.04848934902636611,-0.04838824998946401,0.01572467237096765
3.7531031031031032,-0.04861432632514671,-0.0485151726883132,0.01571491119365641
3.7536036036036036,-0.048740905510195796,-0.04864373263408866,0.015705043822116054
3.754104104104104,-0.04886902598235499,-0.04877386766173929,0.015695067662923515
3.7546046046046047,-0.04899862654921747,-0.04890551502422138,0.01568498026852458
3.755105105105105,-0.04912964542139511,-0.049038611389344004,0.015674779343575654
3.7556056056056057,-0.04926202020820531,-0.049173092835988114,0.015664462751468686
3.756106106106106,-0.049395687912804145,-0.04930889484972915,0.015654028521016047
3.7566066066066064,-0.049530584926798474,-0.0494459523178918,0.01564347485326902
3.757107107107107,-0.049666647024361535,-0.049584199524068576,0.015632800128444653
3.7576076076076075,-0.04980380935588748,-0.049723570142135,0.015622002912934887
3.7581081081081082,-0.049942006441227545,-0.049863997229801366,0.015611081966371228
3.7586086086086086,-0.05008117216252447,-0.05000541322173112,0.015600036248716908
3.759109109109109,-0.05022123975670733,-0.05014774992227225,0.01558886492736001
3.7596096096096097,-0.05036214180766457,-0.05029093849783828,0.015577567384179194
3.76011011011011,-0.050503810238151134,-0.0504349094689815,0.015566143222552937
3.7606106106106107,-0.05064617630146248,-0.05057959270220359,0.015554592274284844
3.761111111111111,-0.05078917057293059,-0.05072491740155161,0.01554291460641755
3.7616116116116114,-0.05093272294126866,-0.05087081210003912,0.015531110527901806
3.762112112112112,-0.05107676259983886,-0.051017204650950325,0.015519180596098725
3.7626126126126125,-0.051221218037858694,-0.05116402221906684,0.015507125623079727
3.7631131131131133,-0.05136601703162584,-0.05131119127188033,0.015494946681700513
3.7636136136136136,-0.051511086635788315,-0.051458637570828886,0.01548264511141603
3.764114114114114,-0.051656353174724313,-0.05160628616262304,0.015470222523811323
3.7646146146146147,-0.05180174223408474,-0.051754061370708926,0.015457680807817118
3.765115115115115,-0.05194717865253798,-0.05190188678692414,0.015445022134583009
3.7656156156156158,-0.05209258651379193,-0.052049685263407953,0.015432248961980448
3.766116116116116,-0.0522378891389303,-0.05219737890481265,0.01541936403870576
3.766616616616617,-0.05238300907912899,-0.05234488906088533,0.015406370407958144
3.767117117117117,-0.052527868108803694,-0.05249213631947133,0.015393271410664315
3.7676176176176175,-0.05267238721925244,-0.05263904049999714,0.015380070688222017
3.7681181181181183,-0.05281648661284288,-0.052785520647499314,0.015366772184738446
3.7686186186186186,-0.05296008569780362,-0.05293149502725093,0.015353380148736414
3.7691191191191193,-0.05310310308368409,-0.053076881120050365,0.015339899134302535
3.7696196196196197,-0.053245456577534406,-0.053221595618233475,0.015326334001655095
3.77012012012012,-0.05338706318086417,-0.05336555442246319,0.015312689917105557
3.7706206206206208,-0.053527839087444476,-0.053508672639366386,0.015298972352392512
3.771121121121121,-0.053667699682002724,-0.053650864580067154,0.015285187083364347
3.771621621621622,-0.0538065595398788,-0.05379204375968663,0.015271340187990933
3.772122122122122,-0.05394433242769105,-0.053932122897863685,0.015257438043683562
3.7726226226226225,-0.05408093130507484,-0.05407101392035371,0.01524348732390312
3.7731231231231233,-0.05421626832755045,-0.054208627961771616,0.01522949499403985
3.7736236236236236,-0.05435025485057873,-0.054344875369530726,0.015215468306548614
3.7741241241241243,-0.05448280143485294,-0.05447966570903658,0.015201414795321073
3.7746246246246247,-0.05461381785289341,-0.054612907770194015,0.015187342269285217
3.775125125125125,-0.05474321309698859,-0.05474450957528256,0.015173258805216786
3.7756256256256258,-0.0548708953885462,-0.05487437838825322,0.015159172739753255
3.776126126126126,-0.05499677218889494,-0.055002420725501294,0.015145092660601434
3.776626626626627,-0.05512075021160114,-0.055128542368170844,0.015131027396931434
3.777127127127127,-0.05524273543633796,-0.055252648376032526,0.01511698600895152
3.7776276276276275,-0.05536263312436384,-0.0553746431029968,0.015102977776662557
3.7781281281281283,-0.05548034783565915,-0.05549443021429966,0.015089012187789191
3.7786286286286286,-0.05559578344774634,-0.05561191270541038,0.015075098924890212
3.7791291291291293,-0.05570884317627616,-0.055726992922711105,0.015061247851653489
3.7796296296296297,-0.055819429597373516,-0.05583957258597822,0.015047468998378409
3.78013013013013,-0.055927444671824415,-0.055949552812722424,0.01503377254666013
3.7806306306306308,-0.056032789771115914,-0.056056834144407604,0.015020168813282234
3.781131131131131,-0.056135365705374037,-0.056161316574597095,0.01500666823333508
3.781631631631632,-0.0562350727532338,-0.05626289957905889,0.0149932813425797
3.782132132132132,-0.05633181069366533,-0.05636148214785318,0.014980018759071938
3.7826326326326325,-0.05642547883979127,-0.05645696281943906,0.014966891164076354
3.7831331331331333,-0.05651597607471622,-0.05654923971682175,0.0149539092822936
3.7836336336336336,-0.056603200889393065,-0.056638210585762135,0.0149410838614317
3.7841341341341344,-0.05668705142254299,-0.056723772835070393,0.01492842565115454
3.7846346346346347,-0.056767425502650626,-0.056805823579000554,0.014915945381445528
3.785135135135135,-0.056844220692041265,-0.05688425968175415,0.014903653740421963
3.7856356356356358,-0.056917334333058046,-0.05695897780411074,0.014891561351648524
3.786136136136136,-0.0569866635963378,-0.05702987445218519,0.014879678750991662
3.786636636636637,-0.05705210553119687,-0.05709684602831844,0.014868016363066065
3.787137137137137,-0.05711355711812212,-0.0571597888841007,0.014856584477325912
3.7876376376376375,-0.057170915323363575,-0.057218599375521415,0.014845393223855767
3.7881381381381383,-0.05722407715562324,-0.05727317392023804,0.014834452548918835
3.7886386386386386,-0.05727293972483049,-0.05732340905695541,0.014823772190326535
3.7891391391391394,-0.05731740030298218,-0.05736920150689399,0.014813361652689816
3.7896396396396397,-0.05735735638703961,-0.05741044823733466,0.014803230182622803
3.79014014014014,-0.05739270576384655,-0.05744704652720519,0.014793386743962193
3.7906406406406408,-0.05742334657705093,-0.05747889403469235,0.014783839993079475
3.791141141141141,-0.057449177396000084,-0.057505888866843664,0.014774598254355821
3.791641641641642,-0.05747009728656027,-0.0575279296511121,0.014765669495892085
3.792142142142142,-0.0574860058838418,-0.05754491560882269,0.014757061305535672
3.7926426426426425,-0.05749680346676761,-0.057556746630495745,0.014748780867295638
3.7931431431431433,-0.057502391034447084,-0.0575633233529915,0.014740834938227964
3.7936436436436436,-0.05750267038430039,-0.057564547238414754,0.014733229825867056
3.7941441441441444,-0.057497544191877185,-0.05756032065472509,0.014725971366284332
3.7946446446446447,-0.057486916092303664,-0.057550546957987156,0.014719064902850267
3.795145145145145,-0.05747069076330175,-0.05753513057619564,0.014712515265779795
3.7956456456456458,-0.05744877400970292,-0.057513977094604325,0.014706326752536905
3.796146146146146,-0.057421072849382575,-0.057486993342479024,0.014700503109175197
3.796646646646647,-0.05738749560054262,-0.05745408748120135,0.014695047512688741
3.797147147147147,-0.057347951970253226,-0.05741516909362986,0.014689962554444602
3.7976476476476475,-0.05730235314417092,-0.05737014927463896,0.014685250224768971
3.7981481481481483,-0.05725061187733589,-0.05731894072273381,0.014680911898752416
3.7986486486486486,-0.057192642585962676,-0.05726145783265184,0.014676948323339881
3.7991491491491494,-0.057128361440115245,-0.057197616788843525,0.014673359605765596
3.7996496496496497,-0.057057686457168785,-0.05712733565972942,0.014670145203390515
3.80015015015015,-0.05698053759595234,-0.057050534492626606,0.01466730391499635
3.8006506506506508,-0.05689683685144971,-0.056967135409224996,0.014664833873582384
3.801151151151151,-0.05680650834996389,-0.0568770627015047,0.014662732540713095
3.801651651651652,-0.05670947844460606,-0.056780242927968606,0.01466099670245348
3.802152152152152,-0.056605675811005146,-0.056676605010068375,0.014659622466927254
3.8026526526526525,-0.05649503154309485,-0.05656608032869501,0.014658605263526851
3.8031531531531533,-0.05637747924887033,-0.056448602820608304,0.014657939843800592
3.8036536536536536,-0.056252955145964414,-0.056324109074666465,0.01465762028403163
3.8041541541541544,-0.056121398156924795,-0.056192538427721865,0.014657639989525807
3.8046546546546547,-0.055982750004044755,-0.05605383306004903,0.014657991700611585
3.805155155155155,-0.055836955303611484,-0.05590793809015147,0.014658667500353946
3.8056556556556558,-0.05568396165943887,-0.055754801668821664,0.014659658823979755
3.806156156156156,-0.055523719755525336,-0.05559437507229158,0.01466095646999986
3.806656656656657,-0.05535618344770826,-0.05542661279433623,0.014662550613015708
3.807157157157157,-0.05518130985415528,-0.05525147263718161,0.014664430818186339
3.8076576576576575,-0.054999059444555264,-0.05506891580106055,0.014666586057328316
3.8081581581581583,-0.05480939612784514,-0.05487890697227251,0.014669004726617925
3.8086586586586586,-0.054612287338341815,-0.054681414409586904,0.014671674665853934
3.8091591591591594,-0.05440770412010967,-0.0544764100288484,0.014674583179243047
3.8096596596596597,-0.054195621209424366,-0.054263869485617754,0.014677717057654931
3.81016016016016,-0.053976017115175634,-0.0540437722557048,0.014681062602298423
3.810660660660661,-0.053748874197056304,-0.05381610171343466,0.014684605649760915
3.811161161161161,-0.05351417874139667,-0.05358084520749986,0.014688331598350316
3.811661661661662,-0.05327192103447912,-0.053337994134239036,0.01469222543567577
3.812162162162162,-0.0530220954331943,-0.053087544008196395,0.014696271767397932
3.8126626626626625,-0.05276470043288547,-0.052829494529810554,0.014700454847081153
3.8131631631631633,-0.05249973873223517,-0.0525638496500846,0.014704758607070365
3.8136636636636636,-0.05222721729505323,-0.052290617632090954,0.01470916669031866
3.8141641641641644,-0.05194714740881368,-0.0520098111091648,0.014713662483087073
3.8146646646646647,-0.05165954473980593,-0.051721447139646194,0.014718229148434977
3.815165165165165,-0.051364429384768914,-0.05142554725803293,0.01472284966042256
3.815665665665666,-0.051061825918854276,-0.05112213752240368,0.014727506838938321
3.816166166166166,-0.05075176343980435,-0.05081124855798208,0.014732183385070988
3.816666666666667,-0.05043427560820905,-0.050492915596710604,0.014736861916939964
3.817167167167167,-0.05010940068371781,-0.05016717851271066,0.014741525005899401
3.8176676676676675,-0.04977718155707851,-0.04983408185350372,0.01474615521303166
3.8181681681681683,-0.0494376657779055,-0.049493674866881825,0.01475073512584386
3.8186686686686686,-0.04909090557804286,-0.049146011523310926,0.014755247395084466
3.8191691691691694,-0.048736957890427965,-0.04879115053375982,0.014759674771595281
3.8196696696696697,-0.048375884363355624,-0.048429155362859806,0.014764000143116131
3.82017017017017,-0.04800775137003546,-0.048060094237284905,0.014768206570958797
3.820670670670671,-0.04763263001336163,-0.04768404014927719,0.014772277326471878
3.821171171171171,-0.047250596125805226,-0.04730107085522172,0.014776195927213513
3.821671671671672,-0.04686173026434633,-0.04691126886919502,0.01477994617275737
3.822172172172172,-0.046466117700387055,-0.04651472145142162,0.014783512180052355
3.822672672672673,-0.046063848404555977,-0.046111520591558756,0.014786878418261764
3.8231731731731733,-0.04565501702637219,-0.045701762986768965,0.0147900297430107
3.8236736736736736,-0.04523972286868838,-0.04528555001451311,0.014792951429967347
3.8241741741741744,-0.04481806985689341,-0.04486298770003026,0.014795629207691402
3.8246746746746747,-0.044390166502814035,-0.0444341866784631,0.01479804928968035
3.8251751751751755,-0.04395612586330327,-0.043999262151598266,0.014800198405549046
3.825675675675676,-0.04351606549347556,-0.04355833383920633,0.014802063831279575
3.826176176176176,-0.043070107394589045,-0.04311152592496097,0.01480363341847894
3.826676676676677,-0.04261837795655363,-0.042658966996936,0.014804895622586764
3.827177177177177,-0.04216100789508024,-0.04220078998268459,0.014805839529975004
3.827677677677678,-0.04169813218345928,-0.04173713207890436,0.01480645488388495
3.8281781781781783,-0.04122988997901121,-0.041268134675717064,0.01480673210914849
3.8286786786786786,-0.04075642454420626,-0.04079394327558175,0.014806662335643267
3.8291791791791794,-0.040277883162510804,-0.04031470740688407,0.01480623742043244
3.8296796796796797,-0.0397944170489873,-0.03983058053224378,0.014805449968543213
3.8301801801801805,-0.039306181255702455,-0.03934171995159007,0.014804293352339267
3.830680680680681,-0.03881333457200242,-0.03884828670007455,0.014802761729443925
3.831181181181181,-0.03831603941971966,-0.038350445440879934,0.014800850059175006
3.831681681681682,-0.03781446174338959,-0.0378483643530161,0.0147985541174531
3.832182182182182,-0.037308770895558466,-0.03734221501418075,0.01479587051014565
3.832682682682683,-0.03679913951727323,-0.03683217227878046,0.014792796684814376
3.8331831831831833,-0.0362857434138561,-0.03631841415122478,0.014789330940834898
3.8336836836836836,-0.035768761426068614,-0.03580112165458899,0.014785472437855463
3.8341841841841844,-0.0352483752967834,-0.035280478694781514,0.014781221202571717
3.8346846846846847,-0.034724769533287035,-0.03475667192033347,0.014776578133789674
3.8351851851851855,-0.03419813126534407,-0.03422989057794666,0.01477154500575463
3.835685685685686,-0.03366865009916297,-0.03370032636394843,0.014766124469726086
3.836186186186186,-0.03313651796740951,-0.03316817327179475,0.014760320053779499
3.836686686686687,-0.03260192897542207,-0.032633627435790256,0.01475413616082217
3.837187187187187,-0.03206507924379078,-0.03209688697118002,0.014747578064806546
3.837687687687688,-0.031526166747463225,-0.03155815181078777,0.014740651905134268
3.8381881881881883,-0.030985391151557566,-0.03101762353838355,0.014733364679242036
3.8386886886886886,-0.030442953644058336,-0.030475505218956013,0.014725724233366018
3.8391891891891894,-0.029899056765584475,-0.0299320012260868,0.0147177392514824
3.8396896896896897,-0.02935390423642339,-0.02938731706662401,0.014709419242428048
3.8401901901901905,-0.028807700781020167,-0.02884165920284616,0.014700774525205395
3.840690690690691,-0.02826065195013938,-0.028295234872338586,0.014691816212480108
3.841191191191191,-0.02771296394089666,-0.02774825190578134,0.014682556192286656
3.841691691691692,-0.027164843414872113,-0.02720091854287016,0.014673007107954932
3.842192192192192,-0.02661649731453629,-0.02665344324659452,0.014663182336281366
3.842692692692693,-0.02606813267818876,-0.026106034516085695,0.014653095963966706
3.8431931931931933,-0.02551995645365451,-0.025558900698278698,0.01464276276235169
3.8436936936936936,-0.02497217531094908,-0.02501224979860191,0.014632198160481249
3.8441941941941944,-0.02442499545415448,-0.024466289290941915,0.014621418216537233
3.8446946946946947,-0.02387862243273465,-0.02392122592711318,0.014610439587680983
3.8451951951951955,-0.02333326095252289,-0.023377265546067824,0.014599279498353584
3.845695695695696,-0.02278911468662676,-0.022834612883094414,0.01458795570708541
3.846196196196196,-0.022246386086474237,-0.022293471379234642,0.014576486471873158
3.846696696696697,-0.02170527619325763,-0.021754042991169027,0.014564890514185042
3.847197197197197,-0.02116598445000425,-0.021216528001812,0.014553186981664768
3.847697697697698,-0.02062870851451066,-0.02068112483185031,0.014541395409602597
3.8481981981981983,-0.020093644073392876,-0.020148029852478995,0.014529535681254991
3.8486986986986986,-0.01956098465747786,-0.019617437199563784,0.014517627987094188
3.8491991991991994,-0.019030921458782688,-0.019089538589477786,0.014505692783076177
3.8496996996996997,-0.018503643149316188,-0.018564523136847266,0.01449375074801982
3.8502002002002005,-0.017979335701933295,-0.018042577174439276,0.014481822740196612
3.850700700700701,-0.017458182213481888,-0.017523884075431637,0.014469929753231647
3.851201201201201,-0.016940362730461907,-0.017008624078287904,0.014458092871426022
3.851701701701702,-0.016426054077434016,-0.01649697411447154,0.014446333224610268
3.852202202202202,-0.015915429688395218,-0.01598910763922046,0.014434671942645722
3.852702702702703,-0.015408659441336743,-0.015485194465598063,0.014423130109694001
3.8532032032032033,-0.014905909496211876,-0.014985400602045987,0.014411728718376697
3.8537037037037036,-0.014407342136509385,-0.01448988809363782,0.014400488623952505
3.8542042042042044,-0.013913115614651526,-0.013998814867250013,0.014389430498640447
3.8547047047047047,-0.013423384001411284,-0.013512334580846186,0.014378574786219608
3.8552052052052055,-0.012938297039540046,-0.013030596477066062,0.014367941657038984
3.855705705705706,-0.012458000001807768,-0.012553745241318987,0.014357550963570586
3.856206206206206,-0.011982633553624797,-0.01208192086455149,0.014347422196640433
3.856706706706707,-0.01151233362043142,-0.011615258510877104,0.01433757444247209
3.8572072072072072,-0.011047231260025612,-0.011153888390231579,0.014328026340674822
3.857707707707708,-0.010587452539983796,-0.010697935636214696,0.014318796043310482
3.8582082082082083,-0.010133118420343744,-0.010247520189282053,0.014309901175168118
3.8587087087087086,-0.009684344641685473,-0.00980275668542315,0.014301358795373604
3.8592092092092094,-0.009241241618761584,-0.00936375435047587,0.01429318536045922
3.8597097097097097,-0.008803914339806831,-0.008930616900205194,0.014285396689011931
3.8602102102102105,-0.008372462271647271,-0.008503442446266236,0.014278007928016206
3.860710710710711,-0.007946979270738085,-0.008082323408177685,0.014271033521001288
3.861211211211211,-0.007527553500224868,-0.007667346431399508,0.014264487178094332
3.861711711711712,-0.0071142673531404705,-0.007258592311625933,0.01425838184807919
3.8622122122122122,-0.006707197381825011,-0.006856135925377412,0.01425272969254733
3.862712712712713,-0.006306414233647797,-0.0064600461669709714,0.01424754206222333
3.8632132132132133,-0.005911982593115851,-0.0060703858919495144,0.014242829475537839
3.8637137137137136,-0.005523961130423802,-0.005687211867023724,0.014238601599511383
3.8642142142142144,-0.0051424024565093094,-0.0053105747265893835,0.014234867233003226
3.8647147147147147,-0.00476735308466084,-0.004940518935862607,0.014231634292370322
3.8652152152152155,-0.004398853398711261,-0.004577082760666495,0.014228909799570632
3.865715715715716,-0.00403693762785687,-0.004220298243904796,0.014226699872734772
3.866216216216216,-0.003681633828112053,-0.003870191188731869,0.014225009719219863
3.866716716716717,-0.0033329638704208396,-0.0035267811484372296,0.014223843631148963
3.8672172172172172,-0.0029909434354250066,-0.0031900814230409126,0.014223204983427579
3.867717717717718,-0.002655582014880153,-0.002860099062590796,0.014223096234220547
3.8682182182182183,-0.0023268829197134566,-0.002536834877151102,0.014223518927859998
3.8687187187187186,-0.002004843294690784,-0.0022202834534489234,0.01422447370014579
3.8692192192192194,-0.0016894541396700166,-0.0019104331781515846,0.014225960285989867
3.8697197197197197,-0.001380700337397312,-0.0016072662677304144,0.014227977529346812
3.8702202202202205,-0.0010785606877956146,-0.0013107588048567901,0.014230523395362911
3.870720720720721,-7.830079486964606e-4,-0.001020880781279206,0.014233594984667423
3.871221221221221,-4.940088829422356e-4,-7.375961471063726e-4,0.014237188549722866
3.871721721721722,-2.1152431179380813e-4,-4.6086286642856505e-4,0.014241299513141318
3.8722222222222222,6.449082543808044e-5,-1.9063297919179103e-4,0.014245922487869827
3.872722722722723,3.3408740562899394e-4,7.314733076637178e-5,0.014251051299138166
3.8732232232232233,5.973220500309127e-4,3.305376616112658e-4,0.014256679008060024
3.8737237237237236,8.542570465263056e-4,5.8160331344645e-4,0.014262797936771768
3.8742242242242244,0.0011049602660484575,8.264152023950788e-4,0.014269399694989617
3.8747247247247247,0.001349505073284606,0.001065049768947489,0.014276475207862838
3.8752252252252255,0.0015879702317873248,0.0012975888807010714,0.014284014744997386
3.875725725725726,0.0018204398036146033,0.0015241197296178301,0.014292007950524587
3.876226226226226,0.002047003043639901,0.0017447347239409824,0.01430044387408531
3.876726726726727,0.002267754288666601,0.0019595313749090505,0.014309311002602885
3.8772272272272272,0.0024827928414927693,0.0021686121784156892,0.014318597292716903
3.877727727727728,0.002692222850080035,0.002372084491770705,0.01432829020375231
3.8782282282282283,0.0028961531819755846,0.0025700604057151775,0.014338376731097802
3.8787287287287286,0.0030946972941542352,0.002762656611858294,0.014348843439873832
3.8792292292292294,0.0032879730984397494,0.002949994265699052,0.014359676498769956
3.8797297297297297,0.0034761028226763012,0.0031321988454056354,0.014370861713936983
3.8802302302302305,0.003659212867825114,0.0033094000065293037,0.014382384562823751
3.880730730730731,0.0038374336611579655,0.003481731432827693,0.014394230227850911
3.881231231231231,0.004010899505733053,0.0036493306833852894,0.014406383629822434
3.881731731731732,0.00417974842633273,0.003812339036212094,0.014418829460977608
3.8822322322322322,0.004344122012050593,0.0039709013285114565,0.014431552217594542
3.882732732732733,0.004504165255719064,0.004125165793809571,0.014444536232061201
3.8832332332332333,0.004660026390364678,0.004275283896136831,0.014457765704335422
3.8837337337337337,0.004811856722890238,0.0044214101614617985,0.014471224732724625
3.8842342342342344,0.004959810465175113,0.0045637020065715074,0.014484897343917216
3.8847347347347347,0.005104044562793379,0.004702319565600717,0.014498767522210824
3.8852352352352355,0.005244718521549986,0.004837425514410872,0.014512819237883251
3.885735735735736,0.005381994232032,0.004969184893019415,0.014527036474661914
3.886236236236236,0.005516035792380015,0.005097764926285987,0.014541403256252741
3.886736736736737,0.00564700932947941,0.005223334843057056,0.014555903671896641
3.8872372372372372,0.005775082818774708,0.005346065693974918,0.014570521900926652
3.887737737737738,0.005900425902911828,0.005466130168156686,0.01458524223630638
3.8882382382382383,0.006023209709408179,0.005583702408946626,0.014600049107134718
3.8887387387387387,0.006143606667557906,0.005698957828949538,0.014614927100109084
3.8892392392392394,0.006261790324771348,0.0058120729245469275,0.014629860979942975
3.8897397397397397,0.006377935162553135,0.005923225090101843,0.01464483570874008
3.8902402402402405,0.006492216412320806,0.006032592432056148,0.014659836464331525
3.890740740740741,0.006604809871262355,0.006140353583120217,0.014674848657586321
3.891241241241241,0.006715891718436003,0.006246687516759052,0.014689857948712073
3.891741741741742,0.006825638331306469,0.006351773362172838,0.014704850262562559
3.8922422422422422,0.006934226102917091,0.006455790219969594,0.01471981180297619
3.892742742742743,0.007041831259892929,0.006558916978729412,0.014734729066170377
3.8932432432432433,0.007148629681465685,0.006661332132650112,0.014749588853219375
3.8937437437437437,0.007254796719715121,0.006763213600471431,0.01476437828164776
3.8942442442442444,0.0073605070212128506,0.00686473854586463,0.014779084796171278
3.8947447447447447,0.00746593435025608,0.006966083199475469,0.014793696178618865
3.8952452452452455,0.0075712514138771185,0.007067422682807698,0.014808200557073794
3.895745745745746,0.00767662968880597,0.007168930834125758,0.01482258641426882
3.896246246246246,0.007782239250569064,0.007270780036559213,0.014836842595274192
3.896746746746747,0.007888248604895585,0.007373141048581933,0.01485095831451565
3.8972472472472472,0.007994824521605208,0.007476182837040626,0.014864923162161713
3.897747747747748,0.008102131871147627,0.007580072412902066,0.014878727109917313
3.8982482482482483,0.00821033346395478,0.0076849746698823655,0.014892360516261688
3.8987487487487487,0.008319589892773302,0.007791052226123469,0.01490581413116729
3.8992492492492494,0.008430059378129564,0.007898465269072369,0.01491907910033565
3.8997497497497497,0.008541897617084926,0.008007371403717092,0.014932146968984301
3.9002502502502505,0.0086552576354304335,0.008117925504331974,0.014945009685219142
3.900750750750751,0.008770289643465242,0.008230279569873643,0.01495765960302264
3.901251251251251,0.008887140895502093,0.00834458258317216,0.014970089484887832
3.901751751751752,0.009005955553236186,0.00846098037405258,0.014982292504127444
3.9022522522522523,0.0091268745531089,0.008579615486517278,0.01499426224688078
3.902752752752753,0.00925003547779678,0.008700627050120188,0.01500599271384597
3.9032532532532533,0.009375572431945178,0.008824150655649341,0.015017478321754376
3.9037537537537537,0.009503615922268293,0.008950318235240697,0.015028713904609445
3.9042542542542544,0.009634292742125693,0.009079257947030553,0.015039694714703714
3.9047547547547548,0.009767725860685719,0.009211094064455605,0.015050416423429197
3.9052552552552555,0.009904034316776498,0.009345946870302217,0.01506087512189087
3.905755755755756,0.010043333117522507,0.009483932555598271,0.015071067321332208
3.906256256256256,0.010185733141860451,0.009625163123442287,0.015080989953379347
3.906756756756757,0.010331341049017772,0.009769746297849572,0.015090640370104838
3.9072572572572573,0.010480259192036616,0.009917785437697666,0.015100016343913844
3.907757757757758,0.010632585536418401,0.010069379455844397,0.015109116067249526
3.9082582582582583,0.010788413583957171,0.010224622743482252,0.015117938152113184
3.9087587587587587,0.0109478323018263,0.010383605099796045,0.015126481629393488
3.9092592592592594,0.011110926056975931,0.010546411666973505,0.0151347459479942
3.9097597597597598,0.011277774555890756,0.010713122870620574,0.015142730973750107
3.9102602602602605,0.011448452789757054,0.010883814365626961,0.015150436988118566
3.910760760760761,0.01162303098507498,0.01105855698751154,0.015157864686629436
3.911261261261261,0.011801574559751896,0.011237416709287299,0.015165015177079433
3.911761761761762,0.01198414408470044,0.011420454603861836,0.015171889977449757
3.9122622622622623,0.012170795250964924,0.011607726811995891,0.01517849101352949
3.912762762762763,0.012361578842389481,0.011799284515831145,0.015184820616222172
3.9132632632632633,0.012556540713833785,0.011995173917989467,0.015190881518514995
3.9137637637637637,0.012755721774941393,0.012195436226245625,0.015196676852086295
3.9142642642642644,0.012959157979452508,0.012400107643763824,0.015202210143529939
3.9147647647647648,0.01316688032005052,0.012609219364882119,0.015207485310171206
3.9152652652652655,0.01337891482872801,0.01282279757642905,0.015212506655451645
3.915765765765766,0.013595282582640953,0.0130408634645386,0.015217278863858492
3.916266266266266,0.013815999715428625,0.013263433226935763,0.015221806995375722
3.916766766766767,0.014041077433955102,0.01349051809064848,0.015226096479433618
3.9172672672672673,0.014270522040432918,0.01372212433510074,0.015230153108335665
3.917767767767768,0.014504334959878728,0.01395825332053624,0.015233983030140235
3.9182682682682684,0.014742512772842125,0.014198901521708189,0.015237592740979342
3.9187687687687687,0.014985047253349317,0.014444060566776551,0.015240989076794956
3.9192692692692694,0.01523192541198883,0.01469371728133478,0.015244179204476576
3.9197697697697698,0.015483129544066141,0.01494785373749147,0.01524717061238596
3.9202702702702705,0.01573863728274869,0.015206447307925208,0.015249971100256386
3.920770770770771,0.015998421657107645,0.015469470724815743,0.015252588768455628
3.921271271271271,0.016262451154972147,0.01573689214356532,0.01525503200660702
3.921771771771772,0.01653068979048998,0.01600867521120043,0.01525730948156111
3.9222722722722723,0.016803097176292373,0.01628477913935014,0.015259430124717907
3.922772772772773,0.01707962860015594,0.016565158781691715,0.015261403118700355
3.9232732732732734,0.017360235106040543,0.016849764715737417,0.015263237883381839
3.9237737737737737,0.01764486357938721,0.017138543328848215,0.015264944061277465
3.9242742742742744,0.017933456836545205,0.01743143690833931,0.015266531502307787
3.9247747747747748,0.018225953718200738,0.017728383735545854,0.01526801024795056
3.9252752752752755,0.018522289186668983,0.018029318183713755,0.015269390514797214
3.925775775775776,0.01882239442690777,0.0183341708195663,0.015270682677536495
3.926276276276276,0.019126196951110733,0.0186428685084069,0.015271897251389464
3.926776776776777,0.01943362070672384,0.018955334522599634,0.015273044874023917
3.9272772772772773,0.019744586187737525,0.019271488653274757,0.015274136286981318
3.927777777777778,0.020059010549091826,0.01959124732510152,0.01527518231665024
3.9282782782782784,0.02037680772403385,0.019914523713960713,0.015276193854827352
3.9287787787787787,0.020697888544262702,0.02024122786735481,0.015277181838905302
3.9292792792792794,0.02102216086268981,0.020571266827381085,0.015278157231734858
3.9297797797797798,0.02134952967864749,0.02090454475609951,0.015279131001210415
3.9302802802802805,0.0216798972653654,0.021240963063117492,0.015280114099627335
3.930780780780781,0.02201316329954039,0.021580420535211215,0.015281117442867961
3.9312812812812816,0.02234922499282004,0.0219228134678098,0.01528215188947112
3.931781781781782,0.022687977225011743,0.022268035798150173,0.015283228219644257
3.9322822822822823,0.023029312678845892,0.022615979239930747,0.015284357114280006
3.932782782782783,0.023373121976090455,0.022966533419265987,0.015285549134036784
3.9332832832832834,0.023719293814843192,0.023319586011763108,0.015286814698549978
3.933783783783784,0.02406771510780927,0.02367502288053329,0.015288164065837013
3.9342842842842844,0.024418271121371096,0.024032728214942185,0.015289607311961745
3.9347847847847848,0.024770845615268624,0.024392584669921547,0.015291154311025843
3.9352852852852855,0.025125320982694252,0.024754473505644147,0.01529281471555051
3.935785785785786,0.02548157839061058,0.02511827472737614,0.015294597937316206
3.9362862862862866,0.025839497920116226,0.025483867225325217,0.015296513128725
3.936786786786787,0.026198958706646767,0.025851128914284684,0.015298569164748687
3.9372872872872873,0.026559839079850153,0.026219936872902482,0.015300774625526604
3.937787787787788,0.026922016702926273,0.02659016748237735,0.015303137779672281
3.9382882882882884,0.027285368711261544,0.02696169656440559,0.015305666568348992
3.938788788788789,0.02764977185017032,0.027334399518199076,0.01530836859016854
3.9392892892892895,0.028015102611557173,0.027708151456389114,0.015311251086969175
3.9397897897897898,0.028381237369330976,0.028082827339646253,0.0153143209305187
3.9402902902902905,0.028748052513387818,0.02845830210983984,0.015317584610193908
3.940790790790791,0.02911542458198773,0.028834450821563048,0.015321048221674134
3.9412912912912916,0.02948323039236728,0.02921114877186708,0.015324717456692108
3.941791791791792,0.029851347169404,0.029588271628025544,0.015328597593872215
3.9422922922922923,0.030219652672187947,0.029965695553184974,0.015332693490688751
3.942792792792793,0.030588025318328098,0.030343297329734877,0.015337009576567459
3.9432932932932934,0.030956344305846133,0.03072095448024819,0.015341549847150353
3.943793793793794,0.031324489732508023,0.03109854538585356,0.015346317859739077
3.9442942942942945,0.031692342712443915,0.031475949401883536,0.015351316729925719
3.944794794794795,0.03205978548992195,0.031853046970676056,0.015356549129415786
3.9452952952952955,0.032426701550138604,0.032229719731388315,0.015362017285041416
3.945795795795796,0.0327929757268916,0.03260585062669918,0.015367722978959617
3.9462962962962966,0.033158494307022515,0.032981324006286505,0.015373667550022506
3.946796796796797,0.03352314513150153,0.033356025726951975,0.015379851896302718
3.9472972972972973,0.033886817693046724,0.033729843249299035,0.015386276478753248
3.947797797797798,0.034249403230171435,0.034102665730851904,0.015392941325970922
3.9482982982982984,0.03461079481756032,0.03447438411552381,0.015399846040035938
3.948798798798799,0.03497088745268418,0.034844891219347134,0.015406989803387054
3.9492992992992995,0.035329578138559053,0.03521408181237688,0.015414371386692443
3.9497997997998,0.03568676596258426,0.03558185269669947,0.015421989157671175
3.9503003003003005,0.036042352171372555,0.03594810278047104,0.015429841090814592
3.950800800800801,0.03639624024151229,0.0363127331479257,0.015437924777955787
3.9513013013013016,0.0367483359462137,0.03667564712530322,0.015446237439630162
3.951801801801802,0.03709854741776479,0.0370367503426374,0.015454775937167159
3.9523023023023023,0.037446785205779,0.037395950791379313,0.015463536785452944
3.952802802802803,0.03779296233117757,0.03775315887780714,0.01547251616629699
3.9533033033033034,0.038136994335886513,0.038108287472205564,0.015481709942339304
3.953803803803804,0.03847879932822956,0.03846125195379562,0.015491113671429031
3.9543043043043045,0.03881829802398791,0.03881197025139552,0.015500722621405706
3.954804804804805,0.039155413783137596,0.0391603628798182,0.015510531785214663
3.9553053053053056,0.039490072642249116,0.0395063529720001,0.015520535896285891
3.955805805805806,0.039822203342563776,0.03984986630687327,0.015530729444107858
3.9563063063063066,0.04015173735376093,0.04019083133300098,0.015541106689925513
3.956806806806807,0.0404786088934318,0.040529179187995146,0.015551661682496701
3.9573073073073077,0.040802754942296335,0.04086484371374977,0.01556238827383613
3.957807807807808,0.04112411525518861,0.041197761467526274,0.015573280134885865
3.9583083083083084,0.04144263236786444,0.04152787172893693,0.015584330771044909
3.958808808808809,0.0417582515996666,0.04185511650287553,0.01559553353749925
3.9593093093093095,0.04207092105211285,0.042179440518449136,0.015606881654290772
3.9598098098098102,0.042380591603468194,0.0425007912239855,0.015618368221072067
3.9603103103103106,0.04268721689936027,0.0428191187781697,0.015629986231491828
3.960810810810811,0.04299075333952311,0.04313437603740194,0.015641728587161882
3.9613113113113116,0.04329116006074238,0.04344651853944361,0.015653588111159734
3.961811811811812,0.04358839891608786,0.04375550448344938,0.015665557561024793
3.9623123123123127,0.043882434450532144,0.04406129470647151,0.015677629641207773
3.962812812812813,0.044173233873037045,0.04436385265653488,0.015689797014941248
3.9633133133133134,0.044460767025226416,0.04466314436238656,0.01570205231549816
3.963813813813814,0.04474500634674225,0.044959138400027354,0.015714388156815466
3.9643143143143145,0.04502592683739228,0.04525180585613114,0.01572679714345613
3.9648148148148152,0.045303506016214135,0.04554112028847803,0.015739271879896946
3.9653153153153156,0.0455777238775684,0.0458270576835096,0.015751804979124557
3.965815815815816,0.04584856284438846,0.04610959641113951,0.01576438907053388
3.9663163163163166,0.046116007718708746,0.04638871717693915,0.01577701680712068
3.966816816816817,0.04638004562960694,0.04666440297183016,0.015789680871971256
3.9673173173173177,0.04664066597869312,0.04693663901942175,0.015802373984049586
3.967817817817818,0.04689786038327864,0.047205412721118147,0.015815088903291925
3.9683183183183184,0.04715162261736588,0.04747071359914516,0.01582781843501784
3.968818818818819,0.047401948550602126,0.04773253323762473,0.015840555433674155
3.9693193193193195,0.04764883608533127,0.047990865221848505,0.01585329280593123
3.9698198198198202,0.0478922850919044,0.04824570507588794,0.015866023513151372
3.9703203203203206,0.04813229734237614,0.04849705019868572,0.015878740573256847
3.970820820820821,0.048368876442746365,0.0487448997987757,0.01589143706202388
3.9713213213213217,0.048602027763892656,0.04898925482777346,0.015904106113835668
3.971821821821822,0.04883175837133387,0.049230117912786725,0.015916740921926215
3.9723223223223227,0.04905807695398679,0.04946749328789098,0.015929334738151914
3.972822822822823,0.04928099375205373,0.04970138672481394,0.01594188087232882
3.9733233233233234,0.04950052048418775,0.04993180546297653,0.01595437269117475
3.973823823823824,0.049716670274094106,0.05015875813903339,0.01596680361689824
3.9743243243243245,0.049929457576697846,0.05038225471605502,0.015979167125476677
3.9748248248248252,0.05013889810404071,0.050602306412498195,0.015991456744667145
3.9753253253253256,0.05034500875103175,0.05081892563109838,0.01600366605179505
3.975825825825826,0.05054780752121306,0.05103212588782977,0.016015788671364353
3.9763263263263267,0.050747313452662236,0.05124192174106116,0.016027818272535202
3.976826826826827,0.05094354654418216,0.05144832872104955,0.01603974856651475
3.9773273273273277,0.05113652768190781,0.051651363259898934,0.016051573303903235
3.977827827827828,0.05132627856646307,0.05185104262211368,0.01606328627204507
3.9783283283283284,0.05151282164079838,0.05204738483587061,0.01607488129242101
3.978828828828829,0.0516961800188333,0.05224040862513585,0.016086352218130727
3.9793293293293295,0.05187637741502749,0.05243013334274093,0.01609769293150268
3.9798298298298302,0.05205343807500651,0.05261657890454023,0.016108897341874
3.9803303303303306,0.05222738670734417,0.052799765724750224,0.01611995938357542
3.980830830830831,0.05239824841663059,0.05297971465259283,0.0161308730141615
3.9813313313313317,0.05256604863791437,0.05315644691033032,0.016141632212916247
3.981831831831832,0.05273081307264425,0.053329984032806775,0.016152230979670213
3.9823323323323327,0.052892567626189865,0.053500347808577695,0.016162663333956
3.982832832832833,0.053051338347049296,0.05366756022272487,0.016172923314530664
3.9833333333333334,0.05320715136782549,0.05383164340144204,0.016183004979290695
3.983833833833834,0.0533600328480663,0.0539926195584684,0.016192902405599292
3.9843343343343345,0.05351000891903278,0.054150510943448825,0.016202609691047743
3.9848348348348352,0.05365710563049347,0.054305339792291414,0.016212120954666318
3.9853353353353356,0.05380134889959192,0.05445712827958564,0.016221430338597628
3.985835835835836,0.053942764461869554,0.05460589847314412,0.01623053201024413
3.9863363363363367,0.054081377824497824,0.05475167229072406,0.016239420164897087
3.986836836836837,0.05421721422176811,0.054894471458973526,0.01624808902885176
3.9873373373373378,0.05435029857290726,0.055034317474656716,0.016256532863010792
3.987837837837838,0.054480655442239366,0.055171231568185944,0.016264745966973172
3.9883383383383384,0.05460830900175261,0.05530523466950667,0.016272722683608097
3.988838838838839,0.05473328299609297,0.05543634737635455,0.01628045740410234
3.9893393393393395,0.054855600710016966,0.05556458992491329,0.016287944573475342
3.9898398398398403,0.054975284938325236,0.0556899821628936,0.01629517869654773
3.9903403403403406,0.05509235795829955,0.05581254352503904,0.01630215434434831
3.990840840840841,0.055206841504644916,0.05593229301107507,0.016308866160943517
3.9913413413413417,0.055318756746954446,0.056049249166098235,0.016315308870667032
3.991841841841842,0.05542812426968863,0.05616343006340238,0.016321477285729673
3.9923423423423428,0.055534964054681356,0.056274853289742716,0.016327366314185073
3.992842842842843,0.055639295466140375,0.05638353593301351,0.016332970968223604
3.9933433433433434,0.055741137238152307,0.05648949457232969,0.016338286372767713
3.993843843843844,0.05584050746466084,0.056592745270490095,0.016343307774339032
3.9943443443443445,0.055937423591893465,0.05669330356879005,0.016348030550165222
3.9948448448448453,0.056031902413219946,0.05679118448415629,0.0163524502174947
3.9953453453453456,0.05612396006639543,0.05688640250856918,0.01635656244308601
3.995845845845846,0.05621361203316243,0.056978971610723295,0.016360363052834507
3.9963463463463467,0.05630087314116516,0.05706890523989545,0.01636384804150577
3.996846846846847,0.05638575756812996,0.05715621633195763,0.01636701358253356
3.9973473473473478,0.05646827884826455,0.057240917317489204,0.01636985603785027
3.997847847847848,0.05654844988081748,0.05732302013193154,0.01637237196771052
3.9983483483483484,0.056626282940745766,0.05740253622772209,0.016374558140471625
3.998848848848849,0.056701789691428035,0.057479476588347365,0.016376411542293443
3.9993493493493495,0.056774981199348526,0.05755385174424122,0.01637792938672
3.9998498498498503,0.056845867950703406,0.057625671790467445,0.01637910912410822
4.000350350350351,0.05691445986983448,0.05769494640610456,0.016379948450865635
4.000850850850851,0.05698076633943703,0.05776168487526115,0.016380445318461796
4.001351351351351,0.05704479622244594,0.057825896109640874,0.016380597942180726
4.001851851851852,0.05710655788553727,0.057887588672578,0.01638040480957767
4.002352352352353,0.057166059224146866,0.057946770804455115,0.01637986468860999
4.002852852852853,0.057223307688932544,0.0580034504494228,0.01637897663540883
4.003353353353353,0.057278310313589126,0.058057635283330404,0.016377740001663196
4.003853853853854,0.057331073743924044,0.058109332742776465,0.016376154441584932
4.004354354354355,0.05738160426811087,0.05815855005519222,0.01637421991843028
4.004854854854855,0.05742990784802127,0.05820529426986576,0.01637193671055077
4.005355355355356,0.05747599015154176,0.0582495722898034,0.0163693054169479
4.005855855855856,0.05751985658579454,0.05829139090435381,0.016366326962313046
4.006356356356356,0.05756151233114289,0.058330756822475543,0.016363002601527996
4.006856856856857,0.05760096237590901,0.0583676767065748,0.016359333923610334
4.007357357357358,0.05763821155169238,0.05840215720679906,0.016355322855085015
4.007857857857858,0.057673264569196095,0.058434204995704044,0.01635097166276883
4.008358358358358,0.05770612605446996,0.058463826803190434,0.016346282955954045
4.008858858858859,0.05773680058545984,0.05849102945161642,0.016341259687979812
4.00935935935936,0.05776529272878269,0.058515819890991375,0.016335905157184114
4.00985985985986,0.05779160707661671,0.05853820523415519,0.016330223007227675
4.010360360360361,0.05781574828362094,0.05855819279185035,0.01632421722678627
4.010860860860861,0.05783772110378662,0.05857579010759167,0.016317892148607346
4.011361361361361,0.057857530427122224,0.058591004992244684,0.01631125244793162
4.0118618618618624,0.0578751813160859,0.058603845558222525,0.01630430314027914
4.012362362362363,0.057890679041672444,0.058614320253206724,0.016297049578603503
4.012862862862863,0.057904029119059314,0.058622437893314824,0.0162894974498192
4.013363363363363,0.05791523734273771,0.05862820769562102,0.01628165277070822
4.013863863863864,0.05792430982102432,0.058631639309950585,0.016273521883215087
4.014364364364365,0.05793125300988591,0.058632742849867726,0.016265111449139304
4.014864864864865,0.057936073745986624,0.05863152892277502,0.01625642844423781
4.015365365365366,0.05793877927888034,0.058628008659053106,0.016247480151750544
4.015865865865866,0.05793937730227198,0.05862219374016448,0.01623827415536445
4.016366366366366,0.05793787598427525,0.05861409642565061,0.016228818331631
4.0168668668668674,0.05793428399658929,0.05860372957895446,0.016219120841855346
4.017367367367368,0.057928610542535286,0.05859110669200801,0.016209190123477237
4.017867867867868,0.05792086538388099,0.05857624190851848,0.01619903488096161
4.018368368368368,0.05791105886639039,0.05855915004589684,0.016188664076221375
4.018868868868869,0.05789920194404352,0.058539846615773924,0.016178086918593654
4.01936936936937,0.05788530620187243,0.058518347843054264,0.016167312854393767
4.01986986986987,0.05786938387735352,0.05849467068345873,0.016156351556069152
4.020370370370371,0.05785144788031449,0.058468832839510064,0.016145212910978816
4.020870870870871,0.057831511811309196,0.05844085277492491,0.01613390700982254
4.021371371371371,0.05780958997842146,0.058410749727374874,0.01612244413474779
4.0218718718718725,0.05778569741245169,0.058378543719579054,0.01611083474715629
4.022372372372373,0.05775984988046622,0.058344255568708106,0.01609908947524125
4.022872872872873,0.05773206389767197,0.05830790689406753,0.016087219101278073
4.023373373373373,0.05770235673758546,0.05826952012304114,0.01607523454869823
4.023873873873874,0.05767074644049015,0.05822911849528196,0.01606314686897169
4.024374374374375,0.05763725182014679,0.05818672606513195,0.016050967228324265
4.024874874874875,0.05760189246875793,0.058142367702266044,0.016038706894319205
4.025375375375376,0.05756468876016354,0.05809606909055419,0.016026377222326103
4.025875875875876,0.05752566185127305,0.05804785672513734,0.016013989641906066
4.026376376376376,0.05748483368172773,0.05799775790773036,0.016001555643138786
4.0268768768768775,0.05744222697179123,0.05794580074014724,0.015989086762916264
4.027377377377378,0.057397865218486076,0.057892014116068424,0.015976594571229005
4.027877877877878,0.057351772689970944,0.05783642771106091,0.01596409065746943
4.028378378378378,0.05730397441818474,0.0577790719708711,0.015951586616776398
4.028878878878879,0.057254496189771575,0.0577199780980184,0.015939094036445337
4.02937937937938,0.05720336453530987,0.05765917803670341,0.01592662448242481
4.02987987987988,0.05715060671685932,0.05759670445607641,0.015914189485924927
4.030380380380381,0.05709625071387782,0.0575325907318873,0.015901800530155517
4.030880880880881,0.057040325207514044,0.057466870926563156,0.0158894690372185
4.031381381381381,0.056982859563334036,0.057399579767746275,0.015877206355171602
4.0318818818818825,0.05692388381250733,0.05733075262534588,0.015865023745285266
4.032382382382383,0.0568634286314998,0.05726042548713953,0.015852932369508747
4.032882882882883,0.05680152532031713,0.05718863493298549,0.015840943278165327
4.033383383383383,0.05673820577935064,0.057115418107690885,0.015829067397893415
4.033883883883884,0.05667350248487645,0.05704081269259559,0.015817315519847785
4.034384384384385,0.056607448463255564,0.056964856875931356,0.015805698288180004
4.034884884884885,0.05654007726390112,0.05688758932201281,0.015794226188809254
4.035385385385386,0.05647142293107015,0.05680904913932919,0.01578290953849998
4.035885885885886,0.056401519974535706,0.05672927584760057,0.015771758474259368
4.036386386386386,0.05633040333920724,0.05664830934386256,0.015760782943066036
4.0368868868868875,0.056258108373768635,0.05656618986765713,0.015749992691943868
4.037387387387388,0.056184670798398534,0.056482957965396034,0.015739397258391536
4.037887887887888,0.05611012667163724,0.056398654453967884,0.01572900596117809
4.038388388388388,0.056034512356482394,0.05631332038366996,0.01571882789151576
4.038888888888889,0.055957864485779295,0.05622699700053548,0.01570887190461993
4.03938938938939,0.05588021992697759,0.05613972570813585,0.01569914661166484
4.03988988988989,0.05580161574633608,0.05605154802893254,0.0156896603721438
4.040390390390391,0.05572208917264422,0.05596250556526129,0.015680421286643525
4.040890890890891,0.05564167756054036,0.05587263996002389,0.01567143719003956
4.041391391391391,0.05556041835350752,0.05578199285717098,0.015662715645120846
4.0418918918918925,0.05547834904661192,0.05569060586204966,0.015654263936651043
4.042392392392393,0.05539550714907503,0.05559852050170115,0.015646089065873094
4.042892892892893,0.055311930146748296,0.055505778185183464,0.015638197745463798
4.043393393393393,0.0552276554645715,0.05541242016400205,0.01563059639494607
4.043893893893894,0.05514272042908541,0.055318487492722015,0.015623291136563364
4.044394394394395,0.055057162231085546,0.05522402098984267,0.01561628779162313
4.044894894894895,0.05497101788848269,0.05512906119901258,0.01560959187731555
4.045395395395396,0.05488432420944789,0.05503364835065416,0.015603208604011064
4.045895895895896,0.054797117755918515,0.05493782232408066,0.015597142873044818
4.046396396396396,0.05470943480753104,0.054841622610171316,0.015591399274989879
4.0468968968968975,0.054621311326058984,0.05474508827467924,0.015585982088425926
4.047397397397398,0.054532782920420866,0.0546482579222435,0.01558089527920766
4.047897897897898,0.0544438848123224,0.0545511696611663,0.0155761425002349
4.048398398398398,0.054354651802608726,0.05445386106902823,0.015571727091731522
4.048898898898899,0.0542651182383781,0.054356369159201584,0.015567652082032772
4.0493993993994,0.05417531798092985,0.05425873034832193,0.01556392018888699
4.0498998998999,0.05408528437460092,0.05416098042477834,0.01556053382127193
4.050400400400401,0.05399505021654054,0.05406315451827734,0.015557495081728365
4.050900900900901,0.05390464772749477,0.053965287070534405,0.015554805769213127
4.051401401401401,0.05381410852363725,0.053867411807143106,0.015552467382470361
4.0519019019019025,0.05372346358949976,0.05376956171066785,0.015550481123922833
4.052402402402403,0.05363274325205493,0.053671768995011304,0.015548847904082043
4.052902902902903,0.05354197715598376,0.05357406508108725,0.015547568346475095
4.053403403403403,0.05345119424017836,0.05347648057384642,0.015546642793086768
4.053903903903904,0.05336042271551022,0.05337904524068755,0.015546071310314236
4.054404404404405,0.05326969004390416,0.053281787991283476,0.015545853695428113
4.054904904904905,0.05317902291873975,0.053184736858852784,0.015545989483537853
4.055405405405406,0.053088447246621186,0.05308791898290148,0.01554647795505227
4.055905905905906,0.05299798813052876,0.05299136059345657,0.015547318143631151
4.056406406406406,0.0529076698543769,0.05289508699680849,0.015548508844616279
4.0569069069069075,0.05281751586900132,0.052799122562780965,0.015550048623935829
4.057407407407408,0.05272754877958097,0.05270349071353265,0.015551935827468694
4.057907907907908,0.05263779033451301,0.05260821391390404,0.015554168590857518
4.058408408408408,0.05254826141574743,0.05251331366331433,0.015556744849758948
4.058908908908909,0.052458982030584286,0.052418810489203785,0.015559662350514068
4.05940940940941,0.05236997130493306,0.05232472394202353,0.015562918661224476
4.05990990990991,0.05228124747804279,0.05223107259176745,0.015566511183217498
4.060410410410411,0.05219282789867785,0.052137874026031726,0.015570437162880549
4.060910910910911,0.05210472902275316,0.052045144849594945,0.015574693703846187
4.061411411411411,0.05201696641240383,0.05195290068550316,0.015579277779507298
4.0619119119119125,0.05192955473647399,0.05186115617763355,0.015584186245837123
4.062412412412413,0.051842507772420346,0.051769924994727504,0.015589415854495322
4.062912912912913,0.05175583840959045,0.05167921983585418,0.015594963266190986
4.0634134134134134,0.051669558653871954,0.051589052437287536,0.015600825064278892
4.063913913913914,0.051583679633670526,0.05149943358076367,0.01560699776856234
4.064414414414415,0.05149821160720188,0.051410373103081046,0.015613477849272858
4.064914914914915,0.051413163971053395,0.05132187990701315,0.015620261741199156
4.065415415415416,0.051328545269993704,0.051233961973493565,0.015627345857934426
4.065915915915916,0.05124436320798281,0.05114662637503107,0.015634726606211406
4.066416416416416,0.0511606246603594,0.05105987929031761,0.01564240040029499
4.0669169169169175,0.051077335687144614,0.05097372601997713,0.0156503636763969
4.067417417417418,0.05099450154744329,0.050888171003415715,0.015658612907082984
4.067917917917918,0.0509121267148788,0.0508032178367201,0.01566714461563822
4.0684184184184184,0.050830214894028156,0.050718869291555335,0.01567595539035471
4.06891891891892,0.050748769037807014,0.05063512733501378,0.015685041898711383
4.06941941941942,0.05066779136575065,0.05055199315035823,0.015694400901408598
4.06991991991992,0.05058728338315351,0.050469467158606576,0.015704029266224752
4.070420420420421,0.05050724590099874,0.050387549040905484,0.015713923981660324
4.070920920920921,0.05042767905664504,0.050306237761634245,0.01572408217033563
4.071421421421421,0.050348582335201855,0.05022553159218423,0.01573450110210864
4.0719219219219225,0.05026995459154962,0.05014542813535529,0.015745178206878298
4.072422422422423,0.05019179407294795,0.05006592435031443,0.01575611108704201
4.072922922922923,0.05011409844217558,0.04998701657805672,0.01576729752957559
4.0734234234234235,0.05003686480114949,0.04990870056730956,0.015778735517700607
4.073923923923925,0.04996008971497013,0.049830971500827194,0.015790423242113365
4.074424424424425,0.04988376923633242,0.0497538240220124,0.015802359111741597
4.074924924924925,0.04980789893025822,0.0496772522618124,0.015814541764003504
4.075425425425426,0.04973247389908081,0.049601249865830026,0.01582697007453864
4.075925925925926,0.049657488807645055,0.04952581002159255,0.015839643166386634
4.076426426426426,0.04958293790865566,0.049450925485928506,0.01585256041858766
4.0769269269269275,0.04950881506812942,0.04937658861238924,0.015865721474181138
4.077427427427428,0.04943511379089728,0.04930279137867057,0.015879126247581095
4.077927927927928,0.0493618272461038,0.049229525413973574,0.015892774931307033
4.0784284284284285,0.049288948292658015,0.04915678202626043,0.01590666800205196
4.07892892892893,0.04921646950458273,0.049084552229349626,0.015920806226070526
4.07942942942943,0.0491443831962191,0.04901282676980658,0.015935190663870915
4.07992992992993,0.04907268144723503,0.04894159615357745,0.015949822674198325
4.080430430430431,0.049001356127400114,0.04887085067232446,0.015964703917296815
4.080930930930931,0.048930398921076944,0.048800580429419635,0.015979836357441844
4.081431431431431,0.04885980135139182,0.04873077536554795,0.01599522226473203
4.0819319319319325,0.04878955480404053,0.04866142528388855,0.016010864216139287
4.082432432432433,0.048719650550697303,0.04859251987482923,0.016026765095808027
4.082932932932933,0.048650079771983906,0.04852404874017961,0.016042928094605592
4.0834334334334335,0.04858083357996607,0.048456001416846736,0.016059356708921592
4.083933933933935,0.04851190304014903,0.048388367399946085,0.01607605473872014
4.084434434434435,0.04844327919293329,0.04832113616530837,0.016093026284846112
4.084934934934935,0.04837495307451024,0.04825429719136119,0.0161102757455957
4.085435435435436,0.04830691573715907,0.04818783998035474,0.016127807812554636
4.085935935935936,0.0482391582689353,0.04812175407890951,0.016145627465718092
4.086436436436436,0.04817167181271069,0.04805602909786232,0.01616373996790081
4.0869369369369375,0.048104447584559167,0.0479906547313921,0.01618215085845442
4.087437437437438,0.04803747689145881,0.04792562077540361,0.01620086594630413
4.087937937937938,0.04797075114829539,0.04786091714515962,0.01621989130232548
4.0884384384384385,0.04790426189415504,0.047796533892139746,0.01623923325107705
4.08893893893894,0.04783800080788997,0.04773246122012083,0.0162588983619126
4.08943943943944,0.04777195972294801,0.047668689500466106,0.016278893439493593
4.08993993993994,0.04770613064145299,0.047605209286614304,0.016299225513725774
4.090440440440441,0.04764050574753347,0.047542011327764644,0.016319901829146288
4.090940940940941,0.0475750774198905,0.04747908658175415,0.016340929833787335
4.091441441441441,0.0475098382436013,0.047416426227123165,0.016362317167543834
4.0919419419419425,0.04744478102115633,0.04735402167437001,0.016384071650075983
4.092442442442443,0.047379898782735234,0.04729186457639804,0.01640620126827605
4.092942942942943,0.047315184795709724,0.04722994683815258,0.016428714163330135
4.0934434434434435,0.04725063257339462,0.0471682606254626,0.016451618617409354
4.093943943943945,0.047186235883030996,0.04710679837308092,0.016474923040021225
4.094444444444445,0.047121988753028296,0.047045552791944265,0.016498635954056977
4.094944944944945,0.047057885479456746,0.04698451687564992,0.016522765981569102
4.095445445445446,0.04699392063180576,0.04692368390617232,0.01654732182931287
4.095945945945946,0.04693008905802145,0.04686304745882034,0.016572312274089347
4.096446446446446,0.046866385888826086,0.046802601406456305,0.016597746147924117
4.0969469469469475,0.04680280654134171,0.04674233992298995,0.016623632323118795
4.097447447447448,0.04673934672202545,0.04668225748616099,0.016649979697210736
4.097947947947948,0.046676002428933966,0.046622348879626935,0.016676797177877276
4.0984484484484485,0.04661276995332921,0.04656260919437854,0.01670409366782084
4.09894894894895,0.046549645880652774,0.04650303382949601,0.016731878049670697
4.09944944944945,0.04648662709086899,0.0464436184922685,0.016760159170935006
4.09994994994995,0.04642371075821313,0.046384359197694916,0.01678894582904091
4.100450450450451,0.046360894350352115,0.04632525226738992,0.016818246756495268
4.100950950950951,0.04629817562698301,0.04626629432791461,0.016848070606199916
4.101451451451451,0.04623555263788415,0.046207482308552504,0.016878425936954662
4.1019519519519525,0.046173023720448715,0.046148813438556285,0.016909321199180226
4.102452452452453,0.046110587496712444,0.046090285243886586,0.01694076472089248
4.102952952952953,0.04604824286990142,0.04603189554346378,0.016972764693956907
4.1034534534534535,0.045985989020524025,0.04597364244496122,0.017005329160654625
4.103953953953955,0.045923825402024485,0.045915524340157506,0.017038466000584916
4.104454454454455,0.04586175173602391,0.04585753989987638,0.017072182917933793
4.104954954954955,0.04579976800716802,0.04579968806853422,0.017106487429130946
4.105455455455456,0.04573787445760939,0.045741968058321286,0.017141386850921116
4.105955955955956,0.045676071581140246,0.045684379343038796,0.017176888288871112
4.106456456456456,0.04561436011700106,0.04562692165161612,0.017212998626333555
4.1069569569569575,0.04555274104339029,0.04556959496133177,0.01724972451388688
4.107457457457458,0.04549121557069301,0.04551239949075961,0.01728707235926792
4.107957957957958,0.04542978513445183,0.04545533569246474,0.017325048317815908
4.1084584584584585,0.04536845138810177,0.04539840424547164,0.017363658283438818
4.10895895895896,0.04530721619549554,0.04534160604752642,0.01740290788011774
4.10945945945946,0.04524608162322849,0.04528494220717396,0.01744280245395781
4.10995995995996,0.04518504993279846,0.04522841403567211,0.017483347065797034
4.110460460460461,0.04512412357260816,0.045172023038766336,0.017524546484379365
4.110960960960961,0.045063305169843054,0.04511577090834115,0.01756640518009809
4.111461461461461,0.04500259752222961,0.04505965951396984,0.01760892731931404
4.1119619619619625,0.04494200358970638,0.045003690894384815,0.01765211675925163
4.112462462462463,0.04488152648601789,0.04494786724888253,0.01769597704347173
4.112962962962963,0.04482116947025446,0.04489219092868605,0.01774051139792418
4.1134634634634635,0.04476093593835075,0.044836664428278196,0.01778572272757363
4.113963963963965,0.04470082941456569,0.04478129037672663,0.01783161361359807
4.114464464464465,0.044640853542955,0.044726071529017496,0.017878186311153763
4.114964964964965,0.044581012078855765,0.04467101075740648,0.017925442747699742
4.115465465465466,0.04452130888039624,0.044616111042813385,0.017973384521874136
4.115965965965966,0.04446174790004439,0.04456137546626477,0.018022012902913224
4.116466466466467,0.044402333176213775,0.04450680720040528,0.018071328830602428
4.1169669669669675,0.044343068824935446,0.0444524095010877,0.018121332915747825
4.117467467467468,0.04428395903161145,0.04439818569905536,0.018172025441155554
4.117967967967968,0.044225008042857644,0.044344139191726854,0.018223406363104808
4.1184684684684685,0.04416622015845463,0.04429027343509808,0.0182754753133004
4.11896896896897,0.04410759972341122,0.04423659193576942,0.01832823160128895
4.11946946946947,0.04404915112015246,0.04418309824310669,0.01838167421732177
4.11996996996997,0.043990878760843635,0.04412979594155,0.018435801835650086
4.120470470470471,0.0439327870798562,0.044076688643072896,0.018490612818230043
4.120970970970971,0.043874880526387244,0.04402377997980593,0.018546105218824934
4.121471471471472,0.04381716355723558,0.043971073596826206,0.018602276787481116
4.1219719719719725,0.043759640629748034,0.04391857314512582,0.018659124975362224
4.122472472472473,0.04370231619493564,0.043866282274757924,0.018716646939919496
4.122972972972973,0.04364519469077108,0.04381420462817354,0.01877483955038059
4.1234734734734735,0.04358828053566812,0.04376234383374911,0.018833699393536334
4.123973973973975,0.04353157812215541,0.043710703499510395,0.018893222779804947
4.124474474474475,0.043475091810734695,0.043659287207057224,0.018953405749554886
4.124974974974975,0.04341882592394721,0.043608098505693006,0.019014244079666186
4.125475475475476,0.043362784740632834,0.043557140906759405,0.019075733290309985
4.125975975975976,0.04330697249039536,0.04350641787818056,0.019137868651926786
4.126476476476477,0.04325139334827347,0.043455932839218836,0.019200645192384794
4.1269769769769775,0.04319605142961882,0.04340568915544225,0.019264057704298353
4.127477477477478,0.043140950785182985,0.04335569013390414,0.019328100752487924
4.127977977977978,0.043086095396413525,0.04330593901853899,0.01939276868156372
4.1284784784784785,0.04303148917096316,0.04325643898576948,0.019458055623614193
4.12897897897898,0.04297713593840306,0.04320719314032778,0.01952395550598159
4.12947947947948,0.04292303944615418,0.043158204511292014,0.019590462059109224
4.12997997997998,0.042869203355622734,0.043109476048329765,0.0196575688244419
4.130480480480481,0.042815631238544836,0.04306101061815632,0.01972526916236382
4.130980980980981,0.04276232657354199,0.04301281100120051,0.019793556260160234
4.131481481481482,0.04270929274287597,0.04296487988847596,0.01986242313998531
4.1319819819819825,0.04265653302941446,0.04291721987865848,0.019931862666823317
4.132482482482483,0.04260405061379174,0.04286983347536501,0.020001867556431113
4.132982982982983,0.04255184857177554,0.042822723084631066,0.02007243038324475
4.1334834834834835,0.0424999298718233,0.04277589101258579,0.020143543588242097
4.133983983983985,0.04244829737283513,0.04272933946331834,0.020215199486746965
4.134484484484485,0.04239695382210067,0.04268307053693493,0.020287390276164545
4.134984984984985,0.04234590185342508,0.042637086227801796,0.020360108043638737
4.135485485485486,0.04229514398544598,0.04259138842296948,0.020433344773619227
4.135985985985986,0.04224468262012671,0.04254597890077612,0.020507092355331616
4.136486486486487,0.04219452004142559,0.04250085932962351,0.020581342590139707
4.1369869869869875,0.042144658414140425,0.042456031266925785,0.020656087198794713
4.137487487487488,0.042095099782916125,0.04241149615822047,0.0207313178285617
4.137987987987988,0.04204584607141944,0.042367255336441825,0.02080702606021785
4.1384884884884885,0.0419968990816725,0.042323310021352166,0.020883203414916254
4.13898898898899,0.04194826049354274,0.042279661319123044,0.020959841360909538
4.13948948948949,0.04189993186437914,0.042236310222065754,0.021036931320127957
4.13998998998999,0.0418519146288009,0.0421932576085027,0.021114464674609586
4.140490490490491,0.04180421009862103,0.04215050424277833,0.021192432772775344
4.140990990990991,0.04175681946291283,0.0421080507754024,0.021270826935548503
4.141491491491492,0.04170974378820417,0.042065897743321944,0.02134963846231453
4.1419919919919925,0.04166298401880161,0.04202404557031634,0.02142885863671763
4.142492492492493,0.04161654097723723,0.04198249456751288,0.021508478732295992
4.142992992992993,0.04157041536483183,0.04194124493401358,0.02158849001794837
4.1434934934934935,0.0415246077623746,0.04190029675763433,0.02166888376323658
4.143993993993995,0.04147911863090905,0.041859650015746104,0.021749651243518887
4.144494494494495,0.0414339483126244,0.04181930457621785,0.021830783744916222
4.144994994994995,0.04138909703184744,0.041779260198454155,0.021912272569111237
4.145495495495496,0.041344564896124904,0.04173951653452112,0.021994109037978393
4.145995995995996,0.04130035189740356,0.041700073130363,0.0220762844980485
4.146496496496497,0.041256457913290384,0.0416609294270957,0.022158790324806266
4.1469969969969975,0.041212882708394884,0.04162208476238002,0.022241617926823123
4.147497497497498,0.041169625935752116,0.041583538371866194,0.022324758749727263
4.147997997997998,0.04112668713831532,0.041545289390707466,0.022408204280010505
4.1484984984984985,0.041084065750516346,0.041507336855137654,0.022491946048676416
4.148998998999,0.04104176109989511,0.04146967970410876,0.022575975634730027
4.1494994994995,0.04099977240878338,0.04143231678098322,0.022660284668510413
4.15,0.040958098796049024,0.04139524683528057,0.02274486483487274
