interval,output,model_id,model_label,model_theory,model_colour,timbre_label
0,0.9580074353111873,Milne13,Milne (2013),harmonicity,#11A3FF,Guitar
0.015015015015015015,0.9575016847315978,Milne13,Milne (2013),harmonicity,#11A3FF,Guitar
0.03003003003003003,0.9565923860949267,Milne13,Milne (2013),harmonicity,#11A3FF,Guitar
0.04504504504504504,0.9549083576140547,Milne13,Milne (2013),harmonicity,#11A3FF,Guitar
0.06006006006006006,0.9518718485834228,Milne13,Milne (2013),harmonicity,#11A3FF,Guitar
0.07507507507507508,0.9467483522607438,Milne13,Milne (2013),harmonicity,#11A3FF,Guitar
0.09009009009009009,0.9387447647203532,Milne13,Milne (2013),harmonicity,#11A3FF,Guitar
0.10510510510510511,0.927076446490692,Milne13,Milne (2013),harmonicity,#11A3FF,Guitar
0.12012012012012012,0.9110265546331917,Milne13,Milne (2013),harmonicity,#11A3FF,Guitar
0.13513513513513514,0.8901032990818336,Milne13,Milne (2013),harmonicity,#11A3FF,Guitar
0.15015015015015015,0.8643393356954735,Milne13,Milne (2013),harmonicity,#11A3FF,Guitar
0.16516516516516516,0.8346494698219091,Milne13,Milne (2013),harmonicity,#11A3FF,Guitar
0.18018018018018017,0.8030254570725189,Milne13,Milne (2013),harmonicity,#11A3FF,Guitar
0.19519519519519518,0.7722662815292558,Milne13,Milne (2013),harmonicity,#11A3FF,Guitar
0.21021021021021022,0.7451516267723819,Milne13,Milne (2013),harmonicity,#11A3FF,Guitar
0.22522522522522523,0.7234790035094286,Milne13,Milne (2013),harmonicity,#11A3FF,Guitar
0.24024024024024024,0.70762076363470106,Milne13,Milne (2013),harmonicity,#11A3FF,Guitar
0.2552552552552553,0.69681272934138,Milne13,Milne (2013),harmonicity,#11A3FF,Guitar
0.2702702702702703,0.6897966292217194,Milne13,Milne (2013),harmonicity,#11A3FF,Guitar
0.2852852852852853,0.6853539153678694,Milne13,Milne (2013),harmonicity,#11A3FF,Guitar
0.3003003003003003,0.6825580540589116,Milne13,Milne (2013),harmonicity,#11A3FF,Guitar
0.3153153153153153,0.680800984538466,Milne13,Milne (2013),harmonicity,#11A3FF,Guitar
0.3303303303303303,0.6797086987055277,Milne13,Milne (2013),harmonicity,#11A3FF,Guitar
0.34534534534534533,0.6790443438650969,Milne13,Milne (2013),harmonicity,#11A3FF,Guitar
0.36036036036036034,0.6786490710865901,Milne13,Milne (2013),harmonicity,#11A3FF,Guitar
0.37537537537537535,0.6784170515178783,Milne13,Milne (2013),harmonicity,#11A3FF,Guitar
0.39039039039039036,0.6782818566326811,Milne13,Milne (2013),harmonicity,#11A3FF,Guitar
0.40540540540540543,0.6782037922374187,Milne13,Milne (2013),harmonicity,#11A3FF,Guitar
0.42042042042042044,0.6781593821536548,Milne13,Milne (2013),harmonicity,#11A3FF,Guitar
0.43543543543543545,0.678134608484289,Milne13,Milne (2013),harmonicity,#11A3FF,Guitar
0.45045045045045046,0.6781210885057024,Milne13,Milne (2013),harmonicity,#11A3FF,Guitar
0.46546546546546547,0.6781138761583508,Milne13,Milne (2013),harmonicity,#11A3FF,Guitar
0.4804804804804805,0.6781101164899483,Milne13,Milne (2013),harmonicity,#11A3FF,Guitar
0.4954954954954955,0.6781082018125388,Milne13,Milne (2013),harmonicity,#11A3FF,Guitar
0.5105105105105106,0.6781072493511191,Milne13,Milne (2013),harmonicity,#11A3FF,Guitar
0.5255255255255256,0.6781067865634448,Milne13,Milne (2013),harmonicity,#11A3FF,Guitar
0.5405405405405406,0.678106566940783,Milne13,Milne (2013),harmonicity,#11A3FF,Guitar
0.5555555555555556,0.678106465103741,Milne13,Milne (2013),harmonicity,#11A3FF,Guitar
0.5705705705705706,0.6781064188126245,Milne13,Milne (2013),harmonicity,#11A3FF,Guitar
0.5855855855855856,0.6781063979875439,Milne13,Milne (2013),harmonicity,#11A3FF,Guitar
0.6006006006006006,0.6781063886022124,Milne13,Milne (2013),harmonicity,#11A3FF,Guitar
0.6156156156156156,0.6781063843687026,Milne13,Milne (2013),harmonicity,#11A3FF,Guitar
0.6306306306306306,0.6781063825026042,Milne13,Milne (2013),harmonicity,#11A3FF,Guitar
0.6456456456456456,0.6781063817235876,Milne13,Milne (2013),harmonicity,#11A3FF,Guitar
0.6606606606606606,0.678106381419787,Milne13,Milne (2013),harmonicity,#11A3FF,Guitar
0.6756756756756757,0.6781063813076907,Milne13,Milne (2013),harmonicity,#11A3FF,Guitar
0.6906906906906907,0.6781063812674644,Milne13,Milne (2013),harmonicity,#11A3FF,Guitar
0.7057057057057057,0.6781063812531222,Milne13,Milne (2013),harmonicity,#11A3FF,Guitar
0.7207207207207207,0.678106381248022,Milne13,Milne (2013),harmonicity,#11A3FF,Guitar
0.7357357357357357,0.6781063812462261,Milne13,Milne (2013),harmonicity,#11A3FF,Guitar
0.7507507507507507,0.6781063812456043,Milne13,Milne (2013),harmonicity,#11A3FF,Guitar
0.7657657657657657,0.6781063812453939,Milne13,Milne (2013),harmonicity,#11A3FF,Guitar
0.7807807807807807,0.6781063812453252,Milne13,Milne (2013),harmonicity,#11A3FF,Guitar
0.7957957957957957,0.6781063812453051,Milne13,Milne (2013),harmonicity,#11A3FF,Guitar
0.8108108108108109,0.6781063812453061,Milne13,Milne (2013),harmonicity,#11A3FF,Guitar
0.8258258258258259,0.6781063812453251,Milne13,Milne (2013),harmonicity,#11A3FF,Guitar
0.8408408408408409,0.6781063812453813,Milne13,Milne (2013),harmonicity,#11A3FF,Guitar
0.8558558558558559,0.6781063812455271,Milne13,Milne (2013),harmonicity,#11A3FF,Guitar
0.8708708708708709,0.6781063812458855,Milne13,Milne (2013),harmonicity,#11A3FF,Guitar
0.8858858858858859,0.6781063812466982,Milne13,Milne (2013),harmonicity,#11A3FF,Guitar
0.9009009009009009,0.6781063812483251,Milne13,Milne (2013),harmonicity,#11A3FF,Guitar
0.9159159159159159,0.6781063812510717,Milne13,Milne (2013),harmonicity,#11A3FF,Guitar
0.9309309309309309,0.6781063812549738,Milne13,Milne (2013),harmonicity,#11A3FF,Guitar
0.9459459459459459,0.6781063812609308,Milne13,Milne (2013),harmonicity,#11A3FF,Guitar
0.960960960960961,0.678106381277182,Milne13,Milne (2013),harmonicity,#11A3FF,Guitar
0.975975975975976,0.6781063813376325,Milne13,Milne (2013),harmonicity,#11A3FF,Guitar
0.990990990990991,0.678106381536596,Milne13,Milne (2013),harmonicity,#11A3FF,Guitar
1.006006006006006,0.6781063820744317,Milne13,Milne (2013),harmonicity,#11A3FF,Guitar
1.021021021021021,0.6781063832992293,Milne13,Milne (2013),harmonicity,#11A3FF,Guitar
1.0360360360360361,0.6781063857277931,Milne13,Milne (2013),harmonicity,#11A3FF,Guitar
1.0510510510510511,0.6781063899941174,Milne13,Milne (2013),harmonicity,#11A3FF,Guitar
1.0660660660660661,0.6781063966520983,Milne13,Milne (2013),harmonicity,#11A3FF,Guitar
1.0810810810810811,0.6781064061771801,Milne13,Milne (2013),harmonicity,#11A3FF,Guitar
1.0960960960960962,0.6781064204621571,Milne13,Milne (2013),harmonicity,#11A3FF,Guitar
1.1111111111111112,0.6781064464016451,Milne13,Milne (2013),harmonicity,#11A3FF,Guitar
1.1261261261261262,0.6781064980588721,Milne13,Milne (2013),harmonicity,#11A3FF,Guitar
1.1411411411411412,0.6781065951195447,Milne13,Milne (2013),harmonicity,#11A3FF,Guitar
1.1561561561561562,0.6781067726560934,Milne13,Milne (2013),harmonicity,#11A3FF,Guitar
1.1711711711711712,0.6781071234581404,Milne13,Milne (2013),harmonicity,#11A3FF,Guitar
1.1861861861861862,0.6781078441331146,Milne13,Milne (2013),harmonicity,#11A3FF,Guitar
1.2012012012012012,0.6781092145789601,Milne13,Milne (2013),harmonicity,#11A3FF,Guitar
1.2162162162162162,0.6781115486146274,Milne13,Milne (2013),harmonicity,#11A3FF,Guitar
1.2312312312312312,0.678115288667886,Milne13,Milne (2013),harmonicity,#11A3FF,Guitar
1.2462462462462462,0.6781212182627795,Milne13,Milne (2013),harmonicity,#11A3FF,Guitar
1.2612612612612613,0.6781304078493954,Milne13,Milne (2013),harmonicity,#11A3FF,Guitar
1.2762762762762763,0.6781437392096085,Milne13,Milne (2013),harmonicity,#11A3FF,Guitar
1.2912912912912913,0.6781615347869359,Milne13,Milne (2013),harmonicity,#11A3FF,Guitar
1.3063063063063063,0.6781838020086826,Milne13,Milne (2013),harmonicity,#11A3FF,Guitar
1.3213213213213213,0.6782108107644372,Milne13,Milne (2013),harmonicity,#11A3FF,Guitar
1.3363363363363363,0.6782433132855614,Milne13,Milne (2013),harmonicity,#11A3FF,Guitar
1.3513513513513513,0.6782820827800092,Milne13,Milne (2013),harmonicity,#11A3FF,Guitar
1.3663663663663663,0.6783271091898154,Milne13,Milne (2013),harmonicity,#11A3FF,Guitar
1.3813813813813813,0.6783772268288031,Milne13,Milne (2013),harmonicity,#11A3FF,Guitar
1.3963963963963963,0.6784305759466057,Milne13,Milne (2013),harmonicity,#11A3FF,Guitar
1.4114114114114114,0.6784853165596818,Milne13,Milne (2013),harmonicity,#11A3FF,Guitar
1.4264264264264264,0.6785397085162741,Milne13,Milne (2013),harmonicity,#11A3FF,Guitar
1.4414414414414414,0.6785915599404934,Milne13,Milne (2013),harmonicity,#11A3FF,Guitar
1.4564564564564564,0.6786379328025036,Milne13,Milne (2013),harmonicity,#11A3FF,Guitar
1.4714714714714714,0.6786756868120378,Milne13,Milne (2013),harmonicity,#11A3FF,Guitar
1.4864864864864864,0.6787024628453892,Milne13,Milne (2013),harmonicity,#11A3FF,Guitar
1.5015015015015014,0.6787173618691088,Milne13,Milne (2013),harmonicity,#11A3FF,Guitar
1.5165165165165164,0.6787210708619507,Milne13,Milne (2013),harmonicity,#11A3FF,Guitar
1.5315315315315314,0.6787158548006319,Milne13,Milne (2013),harmonicity,#11A3FF,Guitar
1.5465465465465464,0.6787059140200709,Milne13,Milne (2013),harmonicity,#11A3FF,Guitar
1.5615615615615615,0.6786975534288252,Milne13,Milne (2013),harmonicity,#11A3FF,Guitar
1.5765765765765765,0.678697626980622,Milne13,Milne (2013),harmonicity,#11A3FF,Guitar
1.5915915915915915,0.6787101486254417,Milne13,Milne (2013),harmonicity,#11A3FF,Guitar
1.6066066066066067,0.6787338014709658,Milne13,Milne (2013),harmonicity,#11A3FF,Guitar
1.6216216216216217,0.6787630094254564,Milne13,Milne (2013),harmonicity,#11A3FF,Guitar
1.6366366366366367,0.6787916645970816,Milne13,Milne (2013),harmonicity,#11A3FF,Guitar
1.6516516516516517,0.6788163542766158,Milne13,Milne (2013),harmonicity,#11A3FF,Guitar
1.6666666666666667,0.678837501039247,Milne13,Milne (2013),harmonicity,#11A3FF,Guitar
1.6816816816816818,0.6788592047443546,Milne13,Milne (2013),harmonicity,#11A3FF,Guitar
1.6966966966966968,0.6788890300092623,Milne13,Milne (2013),harmonicity,#11A3FF,Guitar
1.7117117117117118,0.6789382123896843,Milne13,Milne (2013),harmonicity,#11A3FF,Guitar
1.7267267267267268,0.679022191359251,Milne13,Milne (2013),harmonicity,#11A3FF,Guitar
1.7417417417417418,0.6791612680224816,Milne13,Milne (2013),harmonicity,#11A3FF,Guitar
1.7567567567567568,0.6793812107568021,Milne13,Milne (2013),harmonicity,#11A3FF,Guitar
1.7717717717717718,0.679713620081289,Milne13,Milne (2013),harmonicity,#11A3FF,Guitar
1.7867867867867868,0.6801958163323154,Milne13,Milne (2013),harmonicity,#11A3FF,Guitar
1.8018018018018018,0.6808699716372181,Milne13,Milne (2013),harmonicity,#11A3FF,Guitar
1.8168168168168168,0.6817812063065185,Milne13,Milne (2013),harmonicity,#11A3FF,Guitar
1.8318318318318318,0.6829744418228875,Milne13,Milne (2013),harmonicity,#11A3FF,Guitar
1.8468468468468469,0.6844899639041814,Milne13,Milne (2013),harmonicity,#11A3FF,Guitar
1.8618618618618619,0.6863578699513351,Milne13,Milne (2013),harmonicity,#11A3FF,Guitar
1.8768768768768769,0.6885917786272598,Milne13,Milne (2013),harmonicity,#11A3FF,Guitar
1.8918918918918919,0.69118237145658,Milne13,Milne (2013),harmonicity,#11A3FF,Guitar
1.906906906906907,0.6940915272626549,Milne13,Milne (2013),harmonicity,#11A3FF,Guitar
1.921921921921922,0.6972477718998795,Milne13,Milne (2013),harmonicity,#11A3FF,Guitar
1.936936936936937,0.7005435033162546,Milne13,Milne (2013),harmonicity,#11A3FF,Guitar
1.951951951951952,0.7038357035976622,Milne13,Milne (2013),harmonicity,#11A3FF,Guitar
1.966966966966967,0.706956251478711,Milne13,Milne (2013),harmonicity,#11A3FF,Guitar
1.981981981981982,0.7097389175218335,Milne13,Milne (2013),harmonicity,#11A3FF,Guitar
1.996996996996997,0.7120543886084792,Milne13,Milne (2013),harmonicity,#11A3FF,Guitar
2.012012012012012,0.7138222361092168,Milne13,Milne (2013),harmonicity,#11A3FF,Guitar
2.027027027027027,0.7149820389502027,Milne13,Milne (2013),harmonicity,#11A3FF,Guitar
2.042042042042042,0.7154575858678799,Milne13,Milne (2013),harmonicity,#11A3FF,Guitar
2.057057057057057,0.7151660470686435,Milne13,Milne (2013),harmonicity,#11A3FF,Guitar
2.0720720720720722,0.714073615779546,Milne13,Milne (2013),harmonicity,#11A3FF,Guitar
2.0870870870870872,0.7122471783488854,Milne13,Milne (2013),harmonicity,#11A3FF,Guitar
2.1021021021021022,0.7098607245142095,Milne13,Milne (2013),harmonicity,#11A3FF,Guitar
2.1171171171171173,0.7071689646256071,Milne13,Milne (2013),harmonicity,#11A3FF,Guitar
2.1321321321321323,0.7044939675986245,Milne13,Milne (2013),harmonicity,#11A3FF,Guitar
2.1471471471471473,0.7022344574170489,Milne13,Milne (2013),harmonicity,#11A3FF,Guitar
2.1621621621621623,0.7008382757329804,Milne13,Milne (2013),harmonicity,#11A3FF,Guitar
2.1771771771771773,0.700678325685445,Milne13,Milne (2013),harmonicity,#11A3FF,Guitar
2.1921921921921923,0.7018771533632933,Milne13,Milne (2013),harmonicity,#11A3FF,Guitar
2.2072072072072073,0.7042218825568175,Milne13,Milne (2013),harmonicity,#11A3FF,Guitar
2.2222222222222223,0.7072549864216432,Milne13,Milne (2013),harmonicity,#11A3FF,Guitar
2.2372372372372373,0.7104662362181721,Milne13,Milne (2013),harmonicity,#11A3FF,Guitar
2.2522522522522523,0.7134475595244623,Milne13,Milne (2013),harmonicity,#11A3FF,Guitar
2.2672672672672673,0.7159478607389255,Milne13,Milne (2013),harmonicity,#11A3FF,Guitar
2.2822822822822824,0.7178402383125874,Milne13,Milne (2013),harmonicity,#11A3FF,Guitar
2.2972972972972974,0.7190429040834065,Milne13,Milne (2013),harmonicity,#11A3FF,Guitar
2.3123123123123124,0.7194619620177777,Milne13,Milne (2013),harmonicity,#11A3FF,Guitar
2.3273273273273274,0.7190085217875299,Milne13,Milne (2013),harmonicity,#11A3FF,Guitar
2.3423423423423424,0.7176599794659381,Milne13,Milne (2013),harmonicity,#11A3FF,Guitar
2.3573573573573574,0.7154915592245487,Milne13,Milne (2013),harmonicity,#11A3FF,Guitar
2.3723723723723724,0.7126552714220922,Milne13,Milne (2013),harmonicity,#11A3FF,Guitar
2.3873873873873874,0.70934006224158,Milne13,Milne (2013),harmonicity,#11A3FF,Guitar
2.4024024024024024,0.7057432070852064,Milne13,Milne (2013),harmonicity,#11A3FF,Guitar
2.4174174174174174,0.7020552638178966,Milne13,Milne (2013),harmonicity,#11A3FF,Guitar
2.4324324324324325,0.6984508792790766,Milne13,Milne (2013),harmonicity,#11A3FF,Guitar
2.4474474474474475,0.6950810475127525,Milne13,Milne (2013),harmonicity,#11A3FF,Guitar
2.4624624624624625,0.6920635433373052,Milne13,Milne (2013),harmonicity,#11A3FF,Guitar
2.4774774774774775,0.6894689884192488,Milne13,Milne (2013),harmonicity,#11A3FF,Guitar
2.4924924924924925,0.6873110277872341,Milne13,Milne (2013),harmonicity,#11A3FF,Guitar
2.5075075075075075,0.6855591003022008,Milne13,Milne (2013),harmonicity,#11A3FF,Guitar
2.5225225225225225,0.6841721753714979,Milne13,Milne (2013),harmonicity,#11A3FF,Guitar
2.5375375375375375,0.6831201407578207,Milne13,Milne (2013),harmonicity,#11A3FF,Guitar
2.5525525525525525,0.682374465945416,Milne13,Milne (2013),harmonicity,#11A3FF,Guitar
2.5675675675675675,0.6818931141204033,Milne13,Milne (2013),harmonicity,#11A3FF,Guitar
2.5825825825825826,0.6816228293719222,Milne13,Milne (2013),harmonicity,#11A3FF,Guitar
2.5975975975975976,0.6815086007052444,Milne13,Milne (2013),harmonicity,#11A3FF,Guitar
2.6126126126126126,0.6814970394165767,Milne13,Milne (2013),harmonicity,#11A3FF,Guitar
2.6276276276276276,0.6815375980509857,Milne13,Milne (2013),harmonicity,#11A3FF,Guitar
2.6426426426426426,0.6815866157854661,Milne13,Milne (2013),harmonicity,#11A3FF,Guitar
2.6576576576576576,0.6816112268043681,Milne13,Milne (2013),harmonicity,#11A3FF,Guitar
2.6726726726726726,0.681590062116548,Milne13,Milne (2013),harmonicity,#11A3FF,Guitar
2.6876876876876876,0.6815117013146482,Milne13,Milne (2013),harmonicity,#11A3FF,Guitar
2.7027027027027026,0.6813728201697731,Milne13,Milne (2013),harmonicity,#11A3FF,Guitar
2.7177177177177176,0.6811767319051545,Milne13,Milne (2013),harmonicity,#11A3FF,Guitar
2.7327327327327327,0.6809321705862812,Milne13,Milne (2013),harmonicity,#11A3FF,Guitar
2.7477477477477477,0.680651929330079,Milne13,Milne (2013),harmonicity,#11A3FF,Guitar
2.7627627627627627,0.6803509441189723,Milne13,Milne (2013),harmonicity,#11A3FF,Guitar
2.7777777777777777,0.6800439634418323,Milne13,Milne (2013),harmonicity,#11A3FF,Guitar
2.7927927927927927,0.6797437612025923,Milne13,Milne (2013),harmonicity,#11A3FF,Guitar
2.8078078078078077,0.6794606323063163,Milne13,Milne (2013),harmonicity,#11A3FF,Guitar
2.8228228228228227,0.6792027586138798,Milne13,Milne (2013),harmonicity,#11A3FF,Guitar
2.8378378378378377,0.6789765349817378,Milne13,Milne (2013),harmonicity,#11A3FF,Guitar
2.8528528528528527,0.6787865108135216,Milne13,Milne (2013),harmonicity,#11A3FF,Guitar
2.8678678678678677,0.6786353834805515,Milne13,Milne (2013),harmonicity,#11A3FF,Guitar
2.8828828828828827,0.67852470855088165,Milne13,Milne (2013),harmonicity,#11A3FF,Guitar
2.8978978978978978,0.6784561340709231,Milne13,Milne (2013),harmonicity,#11A3FF,Guitar
2.9129129129129128,0.6784318353850571,Milne13,Milne (2013),harmonicity,#11A3FF,Guitar
2.9279279279279278,0.6784534141980537,Milne13,Milne (2013),harmonicity,#11A3FF,Guitar
2.942942942942943,0.6785205229842504,Milne13,Milne (2013),harmonicity,#11A3FF,Guitar
2.957957957957958,0.6786309134660564,Milne13,Milne (2013),harmonicity,#11A3FF,Guitar
2.972972972972973,0.6787817080718422,Milne13,Milne (2013),harmonicity,#11A3FF,Guitar
2.987987987987988,0.6789702912616868,Milne13,Milne (2013),harmonicity,#11A3FF,Guitar
3.003003003003003,0.6791939780967363,Milne13,Milne (2013),harmonicity,#11A3FF,Guitar
3.018018018018018,0.679448949064979,Milne13,Milne (2013),harmonicity,#11A3FF,Guitar
3.033033033033033,0.6797292576088718,Milne13,Milne (2013),harmonicity,#11A3FF,Guitar
3.048048048048048,0.6800263062812923,Milne13,Milne (2013),harmonicity,#11A3FF,Guitar
3.063063063063063,0.6803288380571791,Milne13,Milne (2013),harmonicity,#11A3FF,Guitar
3.078078078078078,0.6806233939352723,Milne13,Milne (2013),harmonicity,#11A3FF,Guitar
3.093093093093093,0.6808951760824058,Milne13,Milne (2013),harmonicity,#11A3FF,Guitar
3.108108108108108,0.6811292195538908,Milne13,Milne (2013),harmonicity,#11A3FF,Guitar
3.123123123123123,0.6813117307957783,Milne13,Milne (2013),harmonicity,#11A3FF,Guitar
3.138138138138138,0.6814314216473653,Milne13,Milne (2013),harmonicity,#11A3FF,Guitar
3.153153153153153,0.6814806609185549,Milne13,Milne (2013),harmonicity,#11A3FF,Guitar
3.168168168168168,0.6814562808219092,Milne13,Milne (2013),harmonicity,#11A3FF,Guitar
3.183183183183183,0.6813599198503747,Milne13,Milne (2013),harmonicity,#11A3FF,Guitar
3.198198198198198,0.681197849957261,Milne13,Milne (2013),harmonicity,#11A3FF,Guitar
3.2132132132132134,0.680980313120106,Milne13,Milne (2013),harmonicity,#11A3FF,Guitar
3.2282282282282284,0.6807204650230184,Milne13,Milne (2013),harmonicity,#11A3FF,Guitar
3.2432432432432434,0.6804330767903459,Milne13,Milne (2013),harmonicity,#11A3FF,Guitar
3.2582582582582584,0.6801331725365458,Milne13,Milne (2013),harmonicity,#11A3FF,Guitar
3.2732732732732734,0.6798347746428003,Milne13,Milne (2013),harmonicity,#11A3FF,Guitar
3.2882882882882885,0.6795498972163109,Milne13,Milne (2013),harmonicity,#11A3FF,Guitar
3.3033033033033035,0.6792878763111229,Milne13,Milne (2013),harmonicity,#11A3FF,Guitar
3.3183183183183185,0.6790550676940771,Milne13,Milne (2013),harmonicity,#11A3FF,Guitar
3.3333333333333335,0.6788548885393779,Milne13,Milne (2013),harmonicity,#11A3FF,Guitar
3.3483483483483485,0.6786881388404621,Milne13,Milne (2013),harmonicity,#11A3FF,Guitar
3.3633633633633635,0.6785535161887505,Milne13,Milne (2013),harmonicity,#11A3FF,Guitar
3.3783783783783785,0.678448234541566,Milne13,Milne (2013),harmonicity,#11A3FF,Guitar
3.3933933933933935,0.6783686716276285,Milne13,Milne (2013),harmonicity,#11A3FF,Guitar
3.4084084084084085,0.6783109949636295,Milne13,Milne (2013),harmonicity,#11A3FF,Guitar
3.4234234234234235,0.6782717484137823,Milne13,Milne (2013),harmonicity,#11A3FF,Guitar
3.4384384384384385,0.6782484139469219,Milne13,Milne (2013),harmonicity,#11A3FF,Guitar
3.4534534534534536,0.6782399932829325,Milne13,Milne (2013),harmonicity,#11A3FF,Guitar
3.4684684684684686,0.6782476778671783,Milne13,Milne (2013),harmonicity,#11A3FF,Guitar
3.4834834834834836,0.6782756902743515,Milne13,Milne (2013),harmonicity,#11A3FF,Guitar
3.4984984984984986,0.6783323819261453,Milne13,Milne (2013),harmonicity,#11A3FF,Guitar
3.5135135135135136,0.6784316558342612,Milne13,Milne (2013),harmonicity,#11A3FF,Guitar
3.5285285285285286,0.6785947429185643,Milne13,Milne (2013),harmonicity,#11A3FF,Guitar
3.5435435435435436,0.6788522907524344,Milne13,Milne (2013),harmonicity,#11A3FF,Guitar
3.5585585585585586,0.6792466275135445,Milne13,Milne (2013),harmonicity,#11A3FF,Guitar
3.5735735735735736,0.6798339732697612,Milne13,Milne (2013),harmonicity,#11A3FF,Guitar
3.5885885885885886,0.680686382504002,Milne13,Milne (2013),harmonicity,#11A3FF,Guitar
3.6036036036036037,0.6818934268960132,Milne13,Milne (2013),harmonicity,#11A3FF,Guitar
3.6186186186186187,0.6835638194849053,Milne13,Milne (2013),harmonicity,#11A3FF,Guitar
3.6336336336336337,0.6858262063582362,Milne13,Milne (2013),harmonicity,#11A3FF,Guitar
3.6486486486486487,0.6888250893055375,Milne13,Milne (2013),harmonicity,#11A3FF,Guitar
3.6636636636636637,0.6927046065135851,Milne13,Milne (2013),harmonicity,#11A3FF,Guitar
3.6786786786786787,0.697576412553467,Milne13,Milne (2013),harmonicity,#11A3FF,Guitar
3.6936936936936937,0.7034806345378088,Milne13,Milne (2013),harmonicity,#11A3FF,Guitar
3.7087087087087087,0.7103591016921287,Milne13,Milne (2013),harmonicity,#11A3FF,Guitar
3.7237237237237237,0.7180527504307168,Milne13,Milne (2013),harmonicity,#11A3FF,Guitar
3.7387387387387387,0.7263166930168767,Milne13,Milne (2013),harmonicity,#11A3FF,Guitar
3.7537537537537538,0.7348401065074893,Milne13,Milne (2013),harmonicity,#11A3FF,Guitar
3.7687687687687688,0.7432685620715372,Milne13,Milne (2013),harmonicity,#11A3FF,Guitar
3.7837837837837838,0.7512336298560898,Milne13,Milne (2013),harmonicity,#11A3FF,Guitar
3.798798798798799,0.7583860683801933,Milne13,Milne (2013),harmonicity,#11A3FF,Guitar
3.813813813813814,0.7644173189919566,Milne13,Milne (2013),harmonicity,#11A3FF,Guitar
3.828828828828829,0.7690604025677562,Milne13,Milne (2013),harmonicity,#11A3FF,Guitar
3.843843843843844,0.772085439244299,Milne13,Milne (2013),harmonicity,#11A3FF,Guitar
3.858858858858859,0.7733172013239314,Milne13,Milne (2013),harmonicity,#11A3FF,Guitar
3.873873873873874,0.7726769339613039,Milne13,Milne (2013),harmonicity,#11A3FF,Guitar
3.888888888888889,0.7702117431807181,Milne13,Milne (2013),harmonicity,#11A3FF,Guitar
3.903903903903904,0.7660773389706971,Milne13,Milne (2013),harmonicity,#11A3FF,Guitar
3.918918918918919,0.7604910555064966,Milne13,Milne (2013),harmonicity,#11A3FF,Guitar
3.933933933933934,0.753705585782669,Milne13,Milne (2013),harmonicity,#11A3FF,Guitar
3.948948948948949,0.7460222512676534,Milne13,Milne (2013),harmonicity,#11A3FF,Guitar
3.963963963963964,0.7378085104831765,Milne13,Milne (2013),harmonicity,#11A3FF,Guitar
3.978978978978979,0.7294703999567959,Milne13,Milne (2013),harmonicity,#11A3FF,Guitar
3.993993993993994,0.7213676787900295,Milne13,Milne (2013),harmonicity,#11A3FF,Guitar
4.009009009009009,0.7137312218706833,Milne13,Milne (2013),harmonicity,#11A3FF,Guitar
4.024024024024024,0.7066808489474928,Milne13,Milne (2013),harmonicity,#11A3FF,Guitar
4.039039039039039,0.7003405234388315,Milne13,Milne (2013),harmonicity,#11A3FF,Guitar
4.054054054054054,0.6948951332292934,Milne13,Milne (2013),harmonicity,#11A3FF,Guitar
4.069069069069069,0.6904922207091506,Milne13,Milne (2013),harmonicity,#11A3FF,Guitar
4.084084084084084,0.6871157128111849,Milne13,Milne (2013),harmonicity,#11A3FF,Guitar
4.099099099099099,0.6845950602092707,Milne13,Milne (2013),harmonicity,#11A3FF,Guitar
4.114114114114114,0.6827230605186257,Milne13,Milne (2013),harmonicity,#11A3FF,Guitar
4.129129129129129,0.6813437470064987,Milne13,Milne (2013),harmonicity,#11A3FF,Guitar
4.1441441441441444,0.6803553921382848,Milne13,Milne (2013),harmonicity,#11A3FF,Guitar
4.1591591591591595,0.6796801109104762,Milne13,Milne (2013),harmonicity,#11A3FF,Guitar
4.1741741741741745,0.6792479107867548,Milne13,Milne (2013),harmonicity,#11A3FF,Guitar
4.1891891891891895,0.6789933280806696,Milne13,Milne (2013),harmonicity,#11A3FF,Guitar
4.2042042042042045,0.6788554085493029,Milne13,Milne (2013),harmonicity,#11A3FF,Guitar
4.2192192192192195,0.678783656397836,Milne13,Milne (2013),harmonicity,#11A3FF,Guitar
4.2342342342342345,0.6787461559595991,Milne13,Milne (2013),harmonicity,#11A3FF,Guitar
4.2492492492492495,0.6787300669517318,Milne13,Milne (2013),harmonicity,#11A3FF,Guitar
4.2642642642642645,0.6787331414302399,Milne13,Milne (2013),harmonicity,#11A3FF,Guitar
4.2792792792792795,0.6787536654883698,Milne13,Milne (2013),harmonicity,#11A3FF,Guitar
4.2942942942942945,0.6787857872821826,Milne13,Milne (2013),harmonicity,#11A3FF,Guitar
4.3093093093093096,0.6788210538068856,Milne13,Milne (2013),harmonicity,#11A3FF,Guitar
4.324324324324325,0.6788518882194279,Milne13,Milne (2013),harmonicity,#11A3FF,Guitar
4.33933933933934,0.6788730163374869,Milne13,Milne (2013),harmonicity,#11A3FF,Guitar
4.354354354354355,0.6788807773144311,Milne13,Milne (2013),harmonicity,#11A3FF,Guitar
4.36936936936937,0.6788725161283438,Milne13,Milne (2013),harmonicity,#11A3FF,Guitar
4.384384384384385,0.6788470663907148,Milne13,Milne (2013),harmonicity,#11A3FF,Guitar
4.3993993993994,0.6788054606242147,Milne13,Milne (2013),harmonicity,#11A3FF,Guitar
4.414414414414415,0.67875077828677155,Milne13,Milne (2013),harmonicity,#11A3FF,Guitar
4.42942942942943,0.6786871079621968,Milne13,Milne (2013),harmonicity,#11A3FF,Guitar
4.444444444444445,0.6786184741889647,Milne13,Milne (2013),harmonicity,#11A3FF,Guitar
4.45945945945946,0.6785483632290444,Milne13,Milne (2013),harmonicity,#11A3FF,Guitar
4.474474474474475,0.678479712589019,Milne13,Milne (2013),harmonicity,#11A3FF,Guitar
4.48948948948949,0.6784149546141672,Milne13,Milne (2013),harmonicity,#11A3FF,Guitar
4.504504504504505,0.6783559885909486,Milne13,Milne (2013),harmonicity,#11A3FF,Guitar
4.51951951951952,0.6783042190840556,Milne13,Milne (2013),harmonicity,#11A3FF,Guitar
4.534534534534535,0.6782608356330538,Milne13,Milne (2013),harmonicity,#11A3FF,Guitar
4.54954954954955,0.6782274068869291,Milne13,Milne (2013),harmonicity,#11A3FF,Guitar
4.564564564564565,0.6782066470426179,Milne13,Milne (2013),harmonicity,#11A3FF,Guitar
4.57957957957958,0.6782031367149699,Milne13,Milne (2013),harmonicity,#11A3FF,Guitar
4.594594594594595,0.6782243428615559,Milne13,Milne (2013),harmonicity,#11A3FF,Guitar
4.60960960960961,0.6782829012248348,Milne13,Milne (2013),harmonicity,#11A3FF,Guitar
4.624624624624625,0.6783999815547724,Milne13,Milne (2013),harmonicity,#11A3FF,Guitar
4.63963963963964,0.6786075383498874,Milne13,Milne (2013),harmonicity,#11A3FF,Guitar
4.654654654654655,0.6789486511303361,Milne13,Milne (2013),harmonicity,#11A3FF,Guitar
4.66966966966967,0.6794789493782933,Milne13,Milne (2013),harmonicity,#11A3FF,Guitar
4.684684684684685,0.6802708669275244,Milne13,Milne (2013),harmonicity,#11A3FF,Guitar
4.6996996996997,0.6814176008415967,Milne13,Milne (2013),harmonicity,#11A3FF,Guitar
4.714714714714715,0.6830376039332497,Milne13,Milne (2013),harmonicity,#11A3FF,Guitar
4.72972972972973,0.6852931030197342,Milne13,Milne (2013),harmonicity,#11A3FF,Guitar
4.744744744744745,0.6884279808698786,Milne13,Milne (2013),harmonicity,#11A3FF,Guitar
4.75975975975976,0.6927779799155351,Milne13,Milne (2013),harmonicity,#11A3FF,Guitar
4.774774774774775,0.6986757468854726,Milne13,Milne (2013),harmonicity,#11A3FF,Guitar
4.78978978978979,0.7062773698402633,Milne13,Milne (2013),harmonicity,#11A3FF,Guitar
4.804804804804805,0.7154911692191454,Milne13,Milne (2013),harmonicity,#11A3FF,Guitar
4.81981981981982,0.7261219357507499,Milne13,Milne (2013),harmonicity,#11A3FF,Guitar
4.834834834834835,0.7380569929706466,Milne13,Milne (2013),harmonicity,#11A3FF,Guitar
4.84984984984985,0.7512275318323922,Milne13,Milne (2013),harmonicity,#11A3FF,Guitar
4.864864864864865,0.7653950249749836,Milne13,Milne (2013),harmonicity,#11A3FF,Guitar
4.87987987987988,0.7800754930698375,Milne13,Milne (2013),harmonicity,#11A3FF,Guitar
4.894894894894895,0.7946554569366332,Milne13,Milne (2013),harmonicity,#11A3FF,Guitar
4.90990990990991,0.8084502593441542,Milne13,Milne (2013),harmonicity,#11A3FF,Guitar
4.924924924924925,0.8206872500923557,Milne13,Milne (2013),harmonicity,#11A3FF,Guitar
4.93993993993994,0.8306239044861246,Milne13,Milne (2013),harmonicity,#11A3FF,Guitar
4.954954954954955,0.8377448908578464,Milne13,Milne (2013),harmonicity,#11A3FF,Guitar
4.96996996996997,0.8418048761212107,Milne13,Milne (2013),harmonicity,#11A3FF,Guitar
4.984984984984985,0.8427241602970202,Milne13,Milne (2013),harmonicity,#11A3FF,Guitar
5,0.8405155864471476,Milne13,Milne (2013),harmonicity,#11A3FF,Guitar
5.015015015015015,0.8352959606065629,Milne13,Milne (2013),harmonicity,#11A3FF,Guitar
5.03003003003003,0.8272894730409088,Milne13,Milne (2013),harmonicity,#11A3FF,Guitar
5.045045045045045,0.8167745290774485,Milne13,Milne (2013),harmonicity,#11A3FF,Guitar
5.06006006006006,0.8040819174818145,Milne13,Milne (2013),harmonicity,#11A3FF,Guitar
5.075075075075075,0.7897260703390326,Milne13,Milne (2013),harmonicity,#11A3FF,Guitar
5.09009009009009,0.7744938729911823,Milne13,Milne (2013),harmonicity,#11A3FF,Guitar
5.105105105105105,0.7592905625339031,Milne13,Milne (2013),harmonicity,#11A3FF,Guitar
5.12012012012012,0.7448711808752021,Milne13,Milne (2013),harmonicity,#11A3FF,Guitar
5.135135135135135,0.7317183581697558,Milne13,Milne (2013),harmonicity,#11A3FF,Guitar
5.15015015015015,0.7200958462218877,Milne13,Milne (2013),harmonicity,#11A3FF,Guitar
5.165165165165165,0.710137743674298,Milne13,Milne (2013),harmonicity,#11A3FF,Guitar
5.18018018018018,0.7018902851912969,Milne13,Milne (2013),harmonicity,#11A3FF,Guitar
5.195195195195195,0.695313785799142,Milne13,Milne (2013),harmonicity,#11A3FF,Guitar
5.21021021021021,0.6902793435330775,Milne13,Milne (2013),harmonicity,#11A3FF,Guitar
5.225225225225225,0.6865907668726374,Milne13,Milne (2013),harmonicity,#11A3FF,Guitar
5.24024024024024,0.6840373880081211,Milne13,Milne (2013),harmonicity,#11A3FF,Guitar
5.255255255255255,0.6824452547397183,Milne13,Milne (2013),harmonicity,#11A3FF,Guitar
5.27027027027027,0.681687269410453,Milne13,Milne (2013),harmonicity,#11A3FF,Guitar
5.285285285285285,0.6816553992916343,Milne13,Milne (2013),harmonicity,#11A3FF,Guitar
5.3003003003003,0.6822369959242915,Milne13,Milne (2013),harmonicity,#11A3FF,Guitar
5.315315315315315,0.6833214782041752,Milne13,Milne (2013),harmonicity,#11A3FF,Guitar
5.33033033033033,0.6848209980248071,Milne13,Milne (2013),harmonicity,#11A3FF,Guitar
5.345345345345345,0.6866771727605758,Milne13,Milne (2013),harmonicity,#11A3FF,Guitar
5.36036036036036,0.6888481917798936,Milne13,Milne (2013),harmonicity,#11A3FF,Guitar
5.375375375375375,0.6912891151796714,Milne13,Milne (2013),harmonicity,#11A3FF,Guitar
5.39039039039039,0.6939371970256792,Milne13,Milne (2013),harmonicity,#11A3FF,Guitar
5.405405405405405,0.6967055456644815,Milne13,Milne (2013),harmonicity,#11A3FF,Guitar
5.42042042042042,0.6994836653169639,Milne13,Milne (2013),harmonicity,#11A3FF,Guitar
5.435435435435435,0.7021429224780785,Milne13,Milne (2013),harmonicity,#11A3FF,Guitar
5.45045045045045,0.7045455890328368,Milne13,Milne (2013),harmonicity,#11A3FF,Guitar
5.465465465465465,0.7065563073010324,Milne13,Milne (2013),harmonicity,#11A3FF,Guitar
5.48048048048048,0.7080546038341217,Milne13,Milne (2013),harmonicity,#11A3FF,Guitar
5.495495495495495,0.7089468380000684,Milne13,Milne (2013),harmonicity,#11A3FF,Guitar
5.51051051051051,0.7091759166517965,Milne13,Milne (2013),harmonicity,#11A3FF,Guitar
5.525525525525525,0.7087273832800796,Milne13,Milne (2013),harmonicity,#11A3FF,Guitar
5.54054054054054,0.7076310381827433,Milne13,Milne (2013),harmonicity,#11A3FF,Guitar
5.555555555555555,0.7059578994362794,Milne13,Milne (2013),harmonicity,#11A3FF,Guitar
5.57057057057057,0.7038128756719897,Milne13,Milne (2013),harmonicity,#11A3FF,Guitar
5.585585585585585,0.7013240265976893,Milne13,Milne (2013),harmonicity,#11A3FF,Guitar
5.6006006006006,0.6986298983300818,Milne13,Milne (2013),harmonicity,#11A3FF,Guitar
5.615615615615615,0.6958669076840828,Milne13,Milne (2013),harmonicity,#11A3FF,Guitar
5.63063063063063,0.6931586503427609,Milne13,Milne (2013),harmonicity,#11A3FF,Guitar
5.645645645645645,0.6906082205372432,Milne13,Milne (2013),harmonicity,#11A3FF,Guitar
5.66066066066066,0.6882936220101314,Milne13,Milne (2013),harmonicity,#11A3FF,Guitar
5.675675675675675,0.6862657548891794,Milne13,Milne (2013),harmonicity,#11A3FF,Guitar
5.6906906906906904,0.6845490105112805,Milne13,Milne (2013),harmonicity,#11A3FF,Guitar
5.7057057057057055,0.6831454476289229,Milne13,Milne (2013),harmonicity,#11A3FF,Guitar
5.7207207207207205,0.6820424144693181,Milne13,Milne (2013),harmonicity,#11A3FF,Guitar
5.7357357357357355,0.6812199730531434,Milne13,Milne (2013),harmonicity,#11A3FF,Guitar
5.7507507507507505,0.6806521938579033,Milne13,Milne (2013),harmonicity,#11A3FF,Guitar
5.7657657657657655,0.680299704804088,Milne13,Milne (2013),harmonicity,#11A3FF,Guitar
5.7807807807807805,0.6801008959233971,Milne13,Milne (2013),harmonicity,#11A3FF,Guitar
5.7957957957957955,0.6799787695844661,Milne13,Milne (2013),harmonicity,#11A3FF,Guitar
5.8108108108108105,0.6798726432040189,Milne13,Milne (2013),harmonicity,#11A3FF,Guitar
5.8258258258258255,0.6797716522411477,Milne13,Milne (2013),harmonicity,#11A3FF,Guitar
5.8408408408408405,0.6797062153773837,Milne13,Milne (2013),harmonicity,#11A3FF,Guitar
5.8558558558558556,0.6796947567548401,Milne13,Milne (2013),harmonicity,#11A3FF,Guitar
5.870870870870871,0.679707387172346,Milne13,Milne (2013),harmonicity,#11A3FF,Guitar
5.885885885885886,0.6796907274533054,Milne13,Milne (2013),harmonicity,#11A3FF,Guitar
5.900900900900901,0.6796156295947188,Milne13,Milne (2013),harmonicity,#11A3FF,Guitar
5.915915915915916,0.6794907577574832,Milne13,Milne (2013),harmonicity,#11A3FF,Guitar
5.930930930930931,0.6793424283140651,Milne13,Milne (2013),harmonicity,#11A3FF,Guitar
5.945945945945946,0.6791945243581413,Milne13,Milne (2013),harmonicity,#11A3FF,Guitar
5.960960960960961,0.6790637258181832,Milne13,Milne (2013),harmonicity,#11A3FF,Guitar
5.975975975975976,0.6789629939220325,Milne13,Milne (2013),harmonicity,#11A3FF,Guitar
5.990990990990991,0.678903792955301,Milne13,Milne (2013),harmonicity,#11A3FF,Guitar
6.006006006006006,0.6788943261872075,Milne13,Milne (2013),harmonicity,#11A3FF,Guitar
6.021021021021021,0.6789364729601997,Milne13,Milne (2013),harmonicity,#11A3FF,Guitar
6.036036036036036,0.6790249692642358,Milne13,Milne (2013),harmonicity,#11A3FF,Guitar
6.051051051051051,0.679149572570687,Milne13,Milne (2013),harmonicity,#11A3FF,Guitar
6.066066066066066,0.6792981912640277,Milne13,Milne (2013),harmonicity,#11A3FF,Guitar
6.081081081081081,0.679458909809936,Milne13,Milne (2013),harmonicity,#11A3FF,Guitar
6.096096096096096,0.679620535281189,Milne13,Milne (2013),harmonicity,#11A3FF,Guitar
6.111111111111111,0.6797724889917077,Milne13,Milne (2013),harmonicity,#11A3FF,Guitar
6.126126126126126,0.6799048561561689,Milne13,Milne (2013),harmonicity,#11A3FF,Guitar
6.141141141141141,0.6800089216200921,Milne13,Milne (2013),harmonicity,#11A3FF,Guitar
6.156156156156156,0.680078399402011,Milne13,Milne (2013),harmonicity,#11A3FF,Guitar
6.171171171171171,0.6801120236222896,Milne13,Milne (2013),harmonicity,#11A3FF,Guitar
6.186186186186186,0.6801185011641966,Milne13,Milne (2013),harmonicity,#11A3FF,Guitar
6.201201201201201,0.6801233494915377,Milne13,Milne (2013),harmonicity,#11A3FF,Guitar
6.216216216216216,0.6801732366841957,Milne13,Milne (2013),harmonicity,#11A3FF,Guitar
6.231231231231231,0.6803313119971474,Milne13,Milne (2013),harmonicity,#11A3FF,Guitar
6.246246246246246,0.6806627846477357,Milne13,Milne (2013),harmonicity,#11A3FF,Guitar
6.261261261261261,0.6812201187956591,Milne13,Milne (2013),harmonicity,#11A3FF,Guitar
6.276276276276276,0.6820384422024022,Milne13,Milne (2013),harmonicity,#11A3FF,Guitar
6.291291291291291,0.6831409492686548,Milne13,Milne (2013),harmonicity,#11A3FF,Guitar
6.306306306306306,0.6845449268110826,Milne13,Milne (2013),harmonicity,#11A3FF,Guitar
6.321321321321321,0.6862612819172883,Milne13,Milne (2013),harmonicity,#11A3FF,Guitar
6.336336336336336,0.6882879437108468,Milne13,Milne (2013),harmonicity,#11A3FF,Guitar
6.351351351351351,0.6906016259859955,Milne13,Milne (2013),harmonicity,#11A3FF,Guitar
6.366366366366366,0.6931521608641575,Milne13,Milne (2013),harmonicity,#11A3FF,Guitar
6.381381381381381,0.695861228194763,Milne13,Milne (2013),harmonicity,#11A3FF,Guitar
6.396396396396396,0.6986249271539432,Milne13,Milne (2013),harmonicity,#11A3FF,Guitar
6.411411411411412,0.7013191130440309,Milne13,Milne (2013),harmonicity,#11A3FF,Guitar
6.426426426426427,0.7038073596011287,Milne13,Milne (2013),harmonicity,#11A3FF,Guitar
6.441441441441442,0.7059516011265495,Milne13,Milne (2013),harmonicity,#11A3FF,Guitar
6.456456456456457,0.7076244355759653,Milne13,Milne (2013),harmonicity,#11A3FF,Guitar
6.471471471471472,0.7087212753247293,Milne13,Milne (2013),harmonicity,#11A3FF,Guitar
6.486486486486487,0.7091708346217389,Milne13,Milne (2013),harmonicity,#11A3FF,Guitar
6.501501501501502,0.708942771408798,Milne13,Milne (2013),harmonicity,#11A3FF,Guitar
6.516516516516517,0.7080512029443126,Milne13,Milne (2013),harmonicity,#11A3FF,Guitar
6.531531531531532,0.706553207593109,Milne13,Milne (2013),harmonicity,#11A3FF,Guitar
6.546546546546547,0.7045425455796028,Milne13,Milne (2013),harmonicity,#11A3FF,Guitar
6.561561561561562,0.702139765969581,Milne13,Milne (2013),harmonicity,#11A3FF,Guitar
6.576576576576577,0.6994802207420409,Milne13,Milne (2013),harmonicity,#11A3FF,Guitar
6.591591591591592,0.6967015966690796,Milne13,Milne (2013),harmonicity,#11A3FF,Guitar
6.606606606606607,0.6939324991246566,Milne13,Milne (2013),harmonicity,#11A3FF,Guitar
6.621621621621622,0.691283431537183,Milne13,Milne (2013),harmonicity,#11A3FF,Guitar
6.636636636636637,0.6888414052035658,Milne13,Milne (2013),harmonicity,#11A3FF,Guitar
6.651651651651652,0.6866696160881556,Milne13,Milne (2013),harmonicity,#11A3FF,Guitar
6.666666666666667,0.6848139820715805,Milne13,Milne (2013),harmonicity,#11A3FF,Guitar
6.681681681681682,0.6833176476096685,Milne13,Milne (2013),harmonicity,#11A3FF,Guitar
6.696696696696697,0.6822399824685706,Milne13,Milne (2013),harmonicity,#11A3FF,Guitar
6.711711711711712,0.6816685393709698,Milne13,Milne (2013),harmonicity,#11A3FF,Guitar
6.726726726726727,0.681712063698928,Milne13,Milne (2013),harmonicity,#11A3FF,Guitar
6.741741741741742,0.6824810277214082,Milne13,Milne (2013),harmonicity,#11A3FF,Guitar
6.756756756756757,0.6840826561687205,Milne13,Milne (2013),harmonicity,#11A3FF,Guitar
6.771771771771772,0.6866448568626705,Milne13,Milne (2013),harmonicity,#11A3FF,Guitar
6.786786786786787,0.6903427946353793,Milne13,Milne (2013),harmonicity,#11A3FF,Guitar
6.801801801801802,0.6953879494187915,Milne13,Milne (2013),harmonicity,#11A3FF,Guitar
6.816816816816817,0.70197685553287,Milne13,Milne (2013),harmonicity,#11A3FF,Guitar
6.831831831831832,0.7102364582814092,Milne13,Milne (2013),harmonicity,#11A3FF,Guitar
6.846846846846847,0.7201950599788008,Milne13,Milne (2013),harmonicity,#11A3FF,Guitar
6.861861861861862,0.7317712989892922,Milne13,Milne (2013),harmonicity,#11A3FF,Guitar
6.876876876876877,0.7447599469406624,Milne13,Milne (2013),harmonicity,#11A3FF,Guitar
6.891891891891892,0.7588141720610572,Milne13,Milne (2013),harmonicity,#11A3FF,Guitar
6.906906906906907,0.7734459709283674,Milne13,Milne (2013),harmonicity,#11A3FF,Guitar
6.921921921921922,0.7880596269976744,Milne13,Milne (2013),harmonicity,#11A3FF,Guitar
6.936936936936937,0.8020079190609565,Milne13,Milne (2013),harmonicity,#11A3FF,Guitar
6.951951951951952,0.814652627048662,Milne13,Milne (2013),harmonicity,#11A3FF,Guitar
6.966966966966967,0.8254225948180223,Milne13,Milne (2013),harmonicity,#11A3FF,Guitar
6.981981981981982,0.8338619778669166,Milne13,Milne (2013),harmonicity,#11A3FF,Guitar
6.996996996996997,0.8396503479022797,Milne13,Milne (2013),harmonicity,#11A3FF,Guitar
7.012012012012012,0.8425907706600935,Milne13,Milne (2013),harmonicity,#11A3FF,Guitar
7.027027027027027,0.8425897282292034,Milne13,Milne (2013),harmonicity,#11A3FF,Guitar
7.042042042042042,0.8396479008374996,Milne13,Milne (2013),harmonicity,#11A3FF,Guitar
7.057057057057057,0.8338594807784966,Milne13,Milne (2013),harmonicity,#11A3FF,Guitar
7.072072072072072,0.8254209201211946,Milne13,Milne (2013),harmonicity,#11A3FF,Guitar
7.087087087087087,0.814651820107029,Milne13,Milne (2013),harmonicity,#11A3FF,Guitar
7.102102102102102,0.8020076300473192,Milne13,Milne (2013),harmonicity,#11A3FF,Guitar
7.117117117117117,0.7880595496594461,Milne13,Milne (2013),harmonicity,#11A3FF,Guitar
7.132132132132132,0.7734459612395719,Milne13,Milne (2013),harmonicity,#11A3FF,Guitar
7.147147147147147,0.7588142025387358,Milne13,Milne (2013),harmonicity,#11A3FF,Guitar
7.162162162162162,0.744760077594095,Milne13,Milne (2013),harmonicity,#11A3FF,Guitar
7.177177177177177,0.7317717036248661,Milne13,Milne (2013),harmonicity,#11A3FF,Guitar
7.192192192192192,0.720196030236661,Milne13,Milne (2013),harmonicity,#11A3FF,Guitar
7.207207207207207,0.710238215488314,Milne13,Milne (2013),harmonicity,#11A3FF,Guitar
7.222222222222222,0.7019788755072529,Milne13,Milne (2013),harmonicity,#11A3FF,Guitar
7.237237237237237,0.6953868871640023,Milne13,Milne (2013),harmonicity,#11A3FF,Guitar
7.252252252252252,0.6903261736251193,Milne13,Milne (2013),harmonicity,#11A3FF,Guitar
7.267267267267267,0.686575590850168,Milne13,Milne (2013),harmonicity,#11A3FF,Guitar
7.282282282282282,0.683872637666208,Milne13,Milne (2013),harmonicity,#11A3FF,Guitar
7.297297297297297,0.6819644096904232,Milne13,Milne (2013),harmonicity,#11A3FF,Guitar
7.312312312312312,0.6806400148094411,Milne13,Milne (2013),harmonicity,#11A3FF,Guitar
7.327327327327327,0.6797371483622423,Milne13,Milne (2013),harmonicity,#11A3FF,Guitar
7.342342342342342,0.6791343407017405,Milne13,Milne (2013),harmonicity,#11A3FF,Guitar
7.357357357357357,0.6787413749716283,Milne13,Milne (2013),harmonicity,#11A3FF,Guitar
7.372372372372372,0.6784923166574707,Milne13,Milne (2013),harmonicity,#11A3FF,Guitar
7.387387387387387,0.6783405246220473,Milne13,Milne (2013),harmonicity,#11A3FF,Guitar
7.402402402402402,0.6782543477644642,Milne13,Milne (2013),harmonicity,#11A3FF,Guitar
7.4174174174174174,0.6782129713055044,Milne13,Milne (2013),harmonicity,#11A3FF,Guitar
7.4324324324324325,0.6782026183020196,Milne13,Milne (2013),harmonicity,#11A3FF,Guitar
7.4474474474474475,0.6782137881664795,Milne13,Milne (2013),harmonicity,#11A3FF,Guitar
7.4624624624624625,0.6782400047155513,Milne13,Milne (2013),harmonicity,#11A3FF,Guitar
7.4774774774774775,0.6782775580385523,Milne13,Milne (2013),harmonicity,#11A3FF,Guitar
7.4924924924924925,0.6783249837221791,Milne13,Milne (2013),harmonicity,#11A3FF,Guitar
7.5075075075075075,0.6783816301958051,Milne13,Milne (2013),harmonicity,#11A3FF,Guitar
7.5225225225225225,0.6784460880582515,Milne13,Milne (2013),harmonicity,#11A3FF,Guitar
7.5375375375375375,0.6785156619141276,Milne13,Milne (2013),harmonicity,#11A3FF,Guitar
7.5525525525525525,0.6785868335250368,Milne13,Milne (2013),harmonicity,#11A3FF,Guitar
7.5675675675675675,0.6786554664958107,Milne13,Milne (2013),harmonicity,#11A3FF,Guitar
7.5825825825825826,0.6787158918062066,Milne13,Milne (2013),harmonicity,#11A3FF,Guitar
7.597597597597598,0.6787598332661481,Milne13,Milne (2013),harmonicity,#11A3FF,Guitar
7.612612612612613,0.6787784004815548,Milne13,Milne (2013),harmonicity,#11A3FF,Guitar
7.627627627627628,0.6787696600305365,Milne13,Milne (2013),harmonicity,#11A3FF,Guitar
7.642642642642643,0.6787461674872747,Milne13,Milne (2013),harmonicity,#11A3FF,Guitar
7.657657657657658,0.678729604053365,Milne13,Milne (2013),harmonicity,#11A3FF,Guitar
7.672672672672673,0.6787320093236214,Milne13,Milne (2013),harmonicity,#11A3FF,Guitar
7.687687687687688,0.678745004758292,Milne13,Milne (2013),harmonicity,#11A3FF,Guitar
7.702702702702703,0.6787517881970242,Milne13,Milne (2013),harmonicity,#11A3FF,Guitar
7.717717717717718,0.6787461186315314,Milne13,Milne (2013),harmonicity,#11A3FF,Guitar
7.732732732732733,0.6787360791515369,Milne13,Milne (2013),harmonicity,#11A3FF,Guitar
7.747747747747748,0.678733705070353,Milne13,Milne (2013),harmonicity,#11A3FF,Guitar
7.762762762762763,0.6787459197922717,Milne13,Milne (2013),harmonicity,#11A3FF,Guitar
7.777777777777778,0.6787751546630686,Milne13,Milne (2013),harmonicity,#11A3FF,Guitar
7.792792792792793,0.6788274250239587,Milne13,Milne (2013),harmonicity,#11A3FF,Guitar
7.807807807807808,0.6789218513247229,Milne13,Milne (2013),harmonicity,#11A3FF,Guitar
7.822822822822823,0.6790963453038438,Milne13,Milne (2013),harmonicity,#11A3FF,Guitar
7.837837837837838,0.6794069386172427,Milne13,Milne (2013),harmonicity,#11A3FF,Guitar
7.852852852852853,0.6799225791636724,Milne13,Milne (2013),harmonicity,#11A3FF,Guitar
7.867867867867868,0.6807208767354035,Milne13,Milne (2013),harmonicity,#11A3FF,Guitar
7.882882882882883,0.6818892800349329,Milne13,Milne (2013),harmonicity,#11A3FF,Guitar
7.897897897897898,0.683530775513123,Milne13,Milne (2013),harmonicity,#11A3FF,Guitar
7.912912912912913,0.6857686271256043,Milne13,Milne (2013),harmonicity,#11A3FF,Guitar
7.927927927927928,0.6887427019036249,Milne13,Milne (2013),harmonicity,#11A3FF,Guitar
7.942942942942943,0.6925886271944757,Milne13,Milne (2013),harmonicity,#11A3FF,Guitar
7.957957957957958,0.6973953573694592,Milne13,Milne (2013),harmonicity,#11A3FF,Guitar
7.972972972972973,0.7031570643392365,Milne13,Milne (2013),harmonicity,#11A3FF,Guitar
7.987987987987988,0.7097638404956622,Milne13,Milne (2013),harmonicity,#11A3FF,Guitar
8.003003003003004,0.7170647841775557,Milne13,Milne (2013),harmonicity,#11A3FF,Guitar
8.018018018018019,0.7249469772625605,Milne13,Milne (2013),harmonicity,#11A3FF,Guitar
8.033033033033034,0.7333015232664406,Milne13,Milne (2013),harmonicity,#11A3FF,Guitar
8.048048048048049,0.74186837150533,Milne13,Milne (2013),harmonicity,#11A3FF,Guitar
8.063063063063064,0.7501592533195035,Milne13,Milne (2013),harmonicity,#11A3FF,Guitar
8.078078078078079,0.7576007535414809,Milne13,Milne (2013),harmonicity,#11A3FF,Guitar
8.093093093093094,0.7637573486042418,Milne13,Milne (2013),harmonicity,#11A3FF,Guitar
8.108108108108109,0.7684141883078826,Milne13,Milne (2013),harmonicity,#11A3FF,Guitar
8.123123123123124,0.7714925784267012,Milne13,Milne (2013),harmonicity,#11A3FF,Guitar
8.138138138138139,0.7729344909683669,Milne13,Milne (2013),harmonicity,#11A3FF,Guitar
8.153153153153154,0.772672135947654,Milne13,Milne (2013),harmonicity,#11A3FF,Guitar
8.168168168168169,0.7706659828248276,Milne13,Milne (2013),harmonicity,#11A3FF,Guitar
8.183183183183184,0.7669279794412568,Milne13,Milne (2013),harmonicity,#11A3FF,Guitar
8.198198198198199,0.7615384233475955,Milne13,Milne (2013),harmonicity,#11A3FF,Guitar
8.213213213213214,0.7547155695440234,Milne13,Milne (2013),harmonicity,#11A3FF,Guitar
8.228228228228229,0.746871247615641,Milne13,Milne (2013),harmonicity,#11A3FF,Guitar
8.243243243243244,0.7385301484381949,Milne13,Milne (2013),harmonicity,#11A3FF,Guitar
8.258258258258259,0.7301453334972927,Milne13,Milne (2013),harmonicity,#11A3FF,Guitar
8.273273273273274,0.7219762628469668,Milne13,Milne (2013),harmonicity,#11A3FF,Guitar
8.288288288288289,0.7141442619831624,Milne13,Milne (2013),harmonicity,#11A3FF,Guitar
8.303303303303304,0.7068027015950533,Milne13,Milne (2013),harmonicity,#11A3FF,Guitar
8.318318318318319,0.700218186502932,Milne13,Milne (2013),harmonicity,#11A3FF,Guitar
8.333333333333334,0.6946575556033494,Milne13,Milne (2013),harmonicity,#11A3FF,Guitar
8.348348348348349,0.6902248318986209,Milne13,Milne (2013),harmonicity,#11A3FF,Guitar
8.363363363363364,0.6868321494937148,Milne13,Milne (2013),harmonicity,#11A3FF,Guitar
8.378378378378379,0.6842944721543845,Milne13,Milne (2013),harmonicity,#11A3FF,Guitar
8.393393393393394,0.682425113320682,Milne13,Milne (2013),harmonicity,#11A3FF,Guitar
8.408408408408409,0.6810720407877237,Milne13,Milne (2013),harmonicity,#11A3FF,Guitar
8.423423423423424,0.6801145369234914,Milne13,Milne (2013),harmonicity,#11A3FF,Guitar
8.438438438438439,0.6794523387207584,Milne13,Milne (2013),harmonicity,#11A3FF,Guitar
8.453453453453454,0.6790015811249721,Milne13,Milne (2013),harmonicity,#11A3FF,Guitar
8.468468468468469,0.6786971159510927,Milne13,Milne (2013),harmonicity,#11A3FF,Guitar
8.483483483483484,0.6784937654263653,Milne13,Milne (2013),harmonicity,#11A3FF,Guitar
8.498498498498499,0.6783620178899367,Milne13,Milne (2013),harmonicity,#11A3FF,Guitar
8.513513513513514,0.6782818225282419,Milne13,Milne (2013),harmonicity,#11A3FF,Guitar
8.528528528528529,0.6782391786298901,Milne13,Milne (2013),harmonicity,#11A3FF,Guitar
8.543543543543544,0.678224627554772,Milne13,Milne (2013),harmonicity,#11A3FF,Guitar
8.558558558558559,0.6782314298840827,Milne13,Milne (2013),harmonicity,#11A3FF,Guitar
8.573573573573574,0.6782546056090993,Milne13,Milne (2013),harmonicity,#11A3FF,Guitar
8.588588588588589,0.6782922685688504,Milne13,Milne (2013),harmonicity,#11A3FF,Guitar
8.603603603603604,0.6783472182289033,Milne13,Milne (2013),harmonicity,#11A3FF,Guitar
8.618618618618619,0.678425648402261,Milne13,Milne (2013),harmonicity,#11A3FF,Guitar
8.633633633633634,0.6785332866717855,Milne13,Milne (2013),harmonicity,#11A3FF,Guitar
8.64864864864865,0.6786727065957452,Milne13,Milne (2013),harmonicity,#11A3FF,Guitar
8.663663663663664,0.6788440019172248,Milne13,Milne (2013),harmonicity,#11A3FF,Guitar
8.67867867867868,0.6790466913196508,Milne13,Milne (2013),harmonicity,#11A3FF,Guitar
8.693693693693694,0.6792798490661156,Milne13,Milne (2013),harmonicity,#11A3FF,Guitar
8.70870870870871,0.6795402705312316,Milne13,Milne (2013),harmonicity,#11A3FF,Guitar
8.723723723723724,0.6798206033312076,Milne13,Milne (2013),harmonicity,#11A3FF,Guitar
8.73873873873874,0.6801095707657359,Milne13,Milne (2013),harmonicity,#11A3FF,Guitar
8.753753753753754,0.6803951754529554,Milne13,Milne (2013),harmonicity,#11A3FF,Guitar
8.76876876876877,0.6806683727397572,Milne13,Milne (2013),harmonicity,#11A3FF,Guitar
8.783783783783784,0.680922203074461,Milne13,Milne (2013),harmonicity,#11A3FF,Guitar
8.7987987987988,0.6811461394024556,Milne13,Milne (2013),harmonicity,#11A3FF,Guitar
8.813813813813814,0.6813233152343262,Milne13,Milne (2013),harmonicity,#11A3FF,Guitar
8.82882882882883,0.6814357769607057,Milne13,Milne (2013),harmonicity,#11A3FF,Guitar
8.843843843843844,0.6814721012367183,Milne13,Milne (2013),harmonicity,#11A3FF,Guitar
8.85885885885886,0.6814298984054293,Milne13,Milne (2013),harmonicity,#11A3FF,Guitar
8.873873873873874,0.6813139777883608,Milne13,Milne (2013),harmonicity,#11A3FF,Guitar
8.88888888888889,0.681134576200684,Milne13,Milne (2013),harmonicity,#11A3FF,Guitar
8.903903903903904,0.680905910615634,Milne13,Milne (2013),harmonicity,#11A3FF,Guitar
8.91891891891892,0.6806429344818543,Milne13,Milne (2013),harmonicity,#11A3FF,Guitar
8.933933933933934,0.6803576072292452,Milne13,Milne (2013),harmonicity,#11A3FF,Guitar
8.94894894894895,0.680058990186656,Milne13,Milne (2013),harmonicity,#11A3FF,Guitar
8.963963963963964,0.6797575764002095,Milne13,Milne (2013),harmonicity,#11A3FF,Guitar
8.97897897897898,0.6794678472261048,Milne13,Milne (2013),harmonicity,#11A3FF,Guitar
8.993993993993994,0.6792047445886904,Milne13,Milne (2013),harmonicity,#11A3FF,Guitar
9.00900900900901,0.6789779263474791,Milne13,Milne (2013),harmonicity,#11A3FF,Guitar
9.024024024024024,0.6787900892900182,Milne13,Milne (2013),harmonicity,#11A3FF,Guitar
9.03903903903904,0.6786403443914385,Milne13,Milne (2013),harmonicity,#11A3FF,Guitar
9.054054054054054,0.6785287483805216,Milne13,Milne (2013),harmonicity,#11A3FF,Guitar
9.06906906906907,0.678457788955793,Milne13,Milne (2013),harmonicity,#11A3FF,Guitar
9.084084084084084,0.6784302334920816,Milne13,Milne (2013),harmonicity,#11A3FF,Guitar
9.0990990990991,0.6784466820502186,Milne13,Milne (2013),harmonicity,#11A3FF,Guitar
9.114114114114114,0.6785056197620721,Milne13,Milne (2013),harmonicity,#11A3FF,Guitar
9.12912912912913,0.6786050742653061,Milne13,Milne (2013),harmonicity,#11A3FF,Guitar
9.144144144144144,0.6787436662347945,Milne13,Milne (2013),harmonicity,#11A3FF,Guitar
9.15915915915916,0.6789204063448878,Milne13,Milne (2013),harmonicity,#11A3FF,Guitar
9.174174174174174,0.6791338222762693,Milne13,Milne (2013),harmonicity,#11A3FF,Guitar
9.18918918918919,0.6793809874203962,Milne13,Milne (2013),harmonicity,#11A3FF,Guitar
9.204204204204204,0.6796567374420516,Milne13,Milne (2013),harmonicity,#11A3FF,Guitar
9.21921921921922,0.6799532246722011,Milne13,Milne (2013),harmonicity,#11A3FF,Guitar
9.234234234234235,0.6802598963400741,Milne13,Milne (2013),harmonicity,#11A3FF,Guitar
9.24924924924925,0.6805639395905182,Milne13,Milne (2013),harmonicity,#11A3FF,Guitar
9.264264264264265,0.6808511725339798,Milne13,Milne (2013),harmonicity,#11A3FF,Guitar
9.27927927927928,0.6811072586513083,Milne13,Milne (2013),harmonicity,#11A3FF,Guitar
9.294294294294295,0.6813190803104443,Milne13,Milne (2013),harmonicity,#11A3FF,Guitar
9.30930930930931,0.6814762462222729,Milne13,Milne (2013),harmonicity,#11A3FF,Guitar
9.324324324324325,0.6815729103396659,Milne13,Milne (2013),harmonicity,#11A3FF,Guitar
9.33933933933934,0.6816099500921405,Milne13,Milne (2013),harmonicity,#11A3FF,Guitar
9.354354354354355,0.6815968602151737,Milne13,Milne (2013),harmonicity,#11A3FF,Guitar
9.36936936936937,0.681552257379202,Milne13,Milne (2013),harmonicity,#11A3FF,Guitar
9.384384384384385,0.6815029357904479,Milne13,Milne (2013),harmonicity,#11A3FF,Guitar
9.3993993993994,0.6814830512126341,Milne13,Milne (2013),harmonicity,#11A3FF,Guitar
9.414414414414415,0.6815344597079585,Milne13,Milne (2013),harmonicity,#11A3FF,Guitar
9.42942942942943,0.681706836591693,Milne13,Milne (2013),harmonicity,#11A3FF,Guitar
9.444444444444445,0.6820553330749699,Milne13,Milne (2013),harmonicity,#11A3FF,Guitar
9.45945945945946,0.6826350281432142,Milne13,Milne (2013),harmonicity,#11A3FF,Guitar
9.474474474474475,0.6834945637012209,Milne13,Milne (2013),harmonicity,#11A3FF,Guitar
9.48948948948949,0.6846761062093599,Milne13,Milne (2013),harmonicity,#11A3FF,Guitar
9.504504504504505,0.6862274764580438,Milne13,Milne (2013),harmonicity,#11A3FF,Guitar
9.51951951951952,0.6882128124540052,Milne13,Milne (2013),harmonicity,#11A3FF,Guitar
9.534534534534535,0.6906901054229694,Milne13,Milne (2013),harmonicity,#11A3FF,Guitar
9.54954954954955,0.6936541397818712,Milne13,Milne (2013),harmonicity,#11A3FF,Guitar
9.564564564564565,0.6970004297450019,Milne13,Milne (2013),harmonicity,#11A3FF,Guitar
9.57957957957958,0.7005579601940777,Milne13,Milne (2013),harmonicity,#11A3FF,Guitar
9.594594594594595,0.704164436290026,Milne13,Milne (2013),harmonicity,#11A3FF,Guitar
9.60960960960961,0.7077153900464658,Milne13,Milne (2013),harmonicity,#11A3FF,Guitar
9.624624624624625,0.711146035773282,Milne13,Milne (2013),harmonicity,#11A3FF,Guitar
9.63963963963964,0.7143684666189478,Milne13,Milne (2013),harmonicity,#11A3FF,Guitar
9.654654654654655,0.7172254024501932,Milne13,Milne (2013),harmonicity,#11A3FF,Guitar
9.66966966966967,0.7194826503670693,Milne13,Milne (2013),harmonicity,#11A3FF,Guitar
9.684684684684685,0.7208488888534008,Milne13,Milne (2013),harmonicity,#11A3FF,Guitar
9.6996996996997,0.7210618454875574,Milne13,Milne (2013),harmonicity,#11A3FF,Guitar
9.714714714714715,0.7200483231867695,Milne13,Milne (2013),harmonicity,#11A3FF,Guitar
9.72972972972973,0.7180068671610034,Milne13,Milne (2013),harmonicity,#11A3FF,Guitar
9.744744744744745,0.7152880826895013,Milne13,Milne (2013),harmonicity,#11A3FF,Guitar
9.75975975975976,0.7121984435607296,Milne13,Milne (2013),harmonicity,#11A3FF,Guitar
9.774774774774775,0.7089426381864744,Milne13,Milne (2013),harmonicity,#11A3FF,Guitar
9.78978978978979,0.7057426532655148,Milne13,Milne (2013),harmonicity,#11A3FF,Guitar
9.804804804804805,0.7029799204170345,Milne13,Milne (2013),harmonicity,#11A3FF,Guitar
9.81981981981982,0.7011650008760694,Milne13,Milne (2013),harmonicity,#11A3FF,Guitar
9.834834834834835,0.7006969394470893,Milne13,Milne (2013),harmonicity,#11A3FF,Guitar
9.84984984984985,0.7016196774522354,Milne13,Milne (2013),harmonicity,#11A3FF,Guitar
9.864864864864865,0.7036091069303336,Milne13,Milne (2013),harmonicity,#11A3FF,Guitar
9.87987987987988,0.7061723669742807,Milne13,Milne (2013),harmonicity,#11A3FF,Guitar
9.894894894894895,0.7088524077552529,Milne13,Milne (2013),harmonicity,#11A3FF,Guitar
9.90990990990991,0.7113092673021996,Milne13,Milne (2013),harmonicity,#11A3FF,Guitar
9.924924924924925,0.7133094661949912,Milne13,Milne (2013),harmonicity,#11A3FF,Guitar
9.93993993993994,0.7146963139636785,Milne13,Milne (2013),harmonicity,#11A3FF,Guitar
9.954954954954955,0.715367802483183,Milne13,Milne (2013),harmonicity,#11A3FF,Guitar
9.96996996996997,0.7152633239606662,Milne13,Milne (2013),harmonicity,#11A3FF,Guitar
9.984984984984985,0.7143659413683621,Milne13,Milne (2013),harmonicity,#11A3FF,Guitar
10,0.7127125371116915,Milne13,Milne (2013),harmonicity,#11A3FF,Guitar
10.015015015015015,0.7103883237479046,Milne13,Milne (2013),harmonicity,#11A3FF,Guitar
10.03003003003003,0.7075144359876704,Milne13,Milne (2013),harmonicity,#11A3FF,Guitar
10.045045045045045,0.7042568954325363,Milne13,Milne (2013),harmonicity,#11A3FF,Guitar
10.06006006006006,0.7008332482489811,Milne13,Milne (2013),harmonicity,#11A3FF,Guitar
10.075075075075075,0.6974702465775465,Milne13,Milne (2013),harmonicity,#11A3FF,Guitar
10.09009009009009,0.6943319265012315,Milne13,Milne (2013),harmonicity,#11A3FF,Guitar
10.105105105105105,0.6914839347817808,Milne13,Milne (2013),harmonicity,#11A3FF,Guitar
10.12012012012012,0.6889254304678866,Milne13,Milne (2013),harmonicity,#11A3FF,Guitar
10.135135135135135,0.6866559919790419,Milne13,Milne (2013),harmonicity,#11A3FF,Guitar
10.15015015015015,0.6847095919247963,Milne13,Milne (2013),harmonicity,#11A3FF,Guitar
10.165165165165165,0.6831242528872511,Milne13,Milne (2013),harmonicity,#11A3FF,Guitar
10.18018018018018,0.6818940711351131,Milne13,Milne (2013),harmonicity,#11A3FF,Guitar
10.195195195195195,0.6809646090371524,Milne13,Milne (2013),harmonicity,#11A3FF,Guitar
10.21021021021021,0.6802689412141291,Milne13,Milne (2013),harmonicity,#11A3FF,Guitar
10.225225225225225,0.6797574189340203,Milne13,Milne (2013),harmonicity,#11A3FF,Guitar
10.24024024024024,0.6793973867742146,Milne13,Milne (2013),harmonicity,#11A3FF,Guitar
10.255255255255255,0.6791594765195983,Milne13,Milne (2013),harmonicity,#11A3FF,Guitar
10.27027027027027,0.6790120696504021,Milne13,Milne (2013),harmonicity,#11A3FF,Guitar
10.285285285285285,0.6789252237340825,Milne13,Milne (2013),harmonicity,#11A3FF,Guitar
10.3003003003003,0.6788750156751959,Milne13,Milne (2013),harmonicity,#11A3FF,Guitar
10.315315315315315,0.6788443673016561,Milne13,Milne (2013),harmonicity,#11A3FF,Guitar
10.33033033033033,0.6788218970740378,Milne13,Milne (2013),harmonicity,#11A3FF,Guitar
10.345345345345345,0.6788005418167454,Milne13,Milne (2013),harmonicity,#11A3FF,Guitar
10.36036036036036,0.6787766034979108,Milne13,Milne (2013),harmonicity,#11A3FF,Guitar
10.375375375375375,0.6787495974979861,Milne13,Milne (2013),harmonicity,#11A3FF,Guitar
10.39039039039039,0.6787225670518252,Milne13,Milne (2013),harmonicity,#11A3FF,Guitar
10.405405405405405,0.6787013047305831,Milne13,Milne (2013),harmonicity,#11A3FF,Guitar
10.42042042042042,0.6786913442354812,Milne13,Milne (2013),harmonicity,#11A3FF,Guitar
10.435435435435435,0.6786941805496228,Milne13,Milne (2013),harmonicity,#11A3FF,Guitar
10.45045045045045,0.6787058159401027,Milne13,Milne (2013),harmonicity,#11A3FF,Guitar
10.465465465465465,0.6787188535032062,Milne13,Milne (2013),harmonicity,#11A3FF,Guitar
10.48048048048048,0.6787261223626244,Milne13,Milne (2013),harmonicity,#11A3FF,Guitar
10.495495495495495,0.6787230444092668,Milne13,Milne (2013),harmonicity,#11A3FF,Guitar
10.51051051051051,0.6787078891336581,Milne13,Milne (2013),harmonicity,#11A3FF,Guitar
10.525525525525525,0.6786809209062954,Milne13,Milne (2013),harmonicity,#11A3FF,Guitar
10.54054054054054,0.6786435664787728,Milne13,Milne (2013),harmonicity,#11A3FF,Guitar
10.555555555555555,0.6785979340672245,Milne13,Milne (2013),harmonicity,#11A3FF,Guitar
10.57057057057057,0.6785465278691074,Milne13,Milne (2013),harmonicity,#11A3FF,Guitar
10.585585585585585,0.6784920025640835,Milne13,Milne (2013),harmonicity,#11A3FF,Guitar
10.6006006006006,0.6784369265295175,Milne13,Milne (2013),harmonicity,#11A3FF,Guitar
10.615615615615615,0.6783835776266792,Milne13,Milne (2013),harmonicity,#11A3FF,Guitar
10.63063063063063,0.6783337957832835,Milne13,Milne (2013),harmonicity,#11A3FF,Guitar
10.645645645645645,0.6782889030728846,Milne13,Milne (2013),harmonicity,#11A3FF,Guitar
10.66066066066066,0.6782496897571167,Milne13,Milne (2013),harmonicity,#11A3FF,Guitar
10.675675675675675,0.6782164556655855,Milne13,Milne (2013),harmonicity,#11A3FF,Guitar
10.69069069069069,0.678189090879369,Milne13,Milne (2013),harmonicity,#11A3FF,Guitar
10.705705705705705,0.6781671779375745,Milne13,Milne (2013),harmonicity,#11A3FF,Guitar
10.72072072072072,0.6781500989405885,Milne13,Milne (2013),harmonicity,#11A3FF,Guitar
10.735735735735735,0.6781371342497615,Milne13,Milne (2013),harmonicity,#11A3FF,Guitar
10.75075075075075,0.6781275439175689,Milne13,Milne (2013),harmonicity,#11A3FF,Guitar
10.765765765765765,0.6781206276711761,Milne13,Milne (2013),harmonicity,#11A3FF,Guitar
10.78078078078078,0.6781157632068179,Milne13,Milne (2013),harmonicity,#11A3FF,Guitar
10.795795795795796,0.6781124253720434,Milne13,Milne (2013),harmonicity,#11A3FF,Guitar
10.81081081081081,0.678110190373478,Milne13,Milne (2013),harmonicity,#11A3FF,Guitar
10.825825825825826,0.6781087296322664,Milne13,Milne (2013),harmonicity,#11A3FF,Guitar
10.84084084084084,0.6781077975795622,Milne13,Milne (2013),harmonicity,#11A3FF,Guitar
10.855855855855856,0.6781072168749813,Milne13,Milne (2013),harmonicity,#11A3FF,Guitar
10.87087087087087,0.678106863541619,Milne13,Milne (2013),harmonicity,#11A3FF,Guitar
10.885885885885886,0.6781066535568167,Milne13,Milne (2013),harmonicity,#11A3FF,Guitar
10.9009009009009,0.6781065316529903,Milne13,Milne (2013),harmonicity,#11A3FF,Guitar
10.915915915915916,0.678106462514508,Milne13,Milne (2013),harmonicity,#11A3FF,Guitar
10.93093093093093,0.6781064242023009,Milne13,Milne (2013),harmonicity,#11A3FF,Guitar
10.945945945945946,0.6781064034576133,Milne13,Milne (2013),harmonicity,#11A3FF,Guitar
10.96096096096096,0.6781063924811387,Milne13,Milne (2013),harmonicity,#11A3FF,Guitar
10.975975975975976,0.6781063868052254,Milne13,Milne (2013),harmonicity,#11A3FF,Guitar
10.99099099099099,0.6781063839367354,Milne13,Milne (2013),harmonicity,#11A3FF,Guitar
11.006006006006006,0.67810638251983,Milne13,Milne (2013),harmonicity,#11A3FF,Guitar
11.02102102102102,0.6781063818357269,Milne13,Milne (2013),harmonicity,#11A3FF,Guitar
11.036036036036036,0.6781063815128654,Milne13,Milne (2013),harmonicity,#11A3FF,Guitar
11.05105105105105,0.6781063813639138,Milne13,Milne (2013),harmonicity,#11A3FF,Guitar
11.066066066066066,0.6781063812967361,Milne13,Milne (2013),harmonicity,#11A3FF,Guitar
11.08108108108108,0.6781063812671168,Milne13,Milne (2013),harmonicity,#11A3FF,Guitar
11.096096096096096,0.6781063812543494,Milne13,Milne (2013),harmonicity,#11A3FF,Guitar
11.11111111111111,0.6781063812489687,Milne13,Milne (2013),harmonicity,#11A3FF,Guitar
11.126126126126126,0.6781063812467516,Milne13,Milne (2013),harmonicity,#11A3FF,Guitar
11.14114114114114,0.6781063812458585,Milne13,Milne (2013),harmonicity,#11A3FF,Guitar
11.156156156156156,0.678106381245507,Milne13,Milne (2013),harmonicity,#11A3FF,Guitar
11.17117117117117,0.6781063812453718,Milne13,Milne (2013),harmonicity,#11A3FF,Guitar
11.186186186186186,0.6781063812453231,Milne13,Milne (2013),harmonicity,#11A3FF,Guitar
11.2012012012012,0.6781063812453115,Milne13,Milne (2013),harmonicity,#11A3FF,Guitar
11.216216216216216,0.6781063812453272,Milne13,Milne (2013),harmonicity,#11A3FF,Guitar
11.23123123123123,0.6781063812453947,Milne13,Milne (2013),harmonicity,#11A3FF,Guitar
11.246246246246246,0.6781063812456035,Milne13,Milne (2013),harmonicity,#11A3FF,Guitar
11.26126126126126,0.6781063812462221,Milne13,Milne (2013),harmonicity,#11A3FF,Guitar
11.276276276276276,0.6781063812480066,Milne13,Milne (2013),harmonicity,#11A3FF,Guitar
11.29129129129129,0.6781063812530355,Milne13,Milne (2013),harmonicity,#11A3FF,Guitar
11.306306306306306,0.6781063812668989,Milne13,Milne (2013),harmonicity,#11A3FF,Guitar
11.32132132132132,0.6781063813042678,Milne13,Milne (2013),harmonicity,#11A3FF,Guitar
11.336336336336336,0.6781063814027602,Milne13,Milne (2013),harmonicity,#11A3FF,Guitar
11.35135135135135,0.6781063816565848,Milne13,Milne (2013),harmonicity,#11A3FF,Guitar
11.366366366366366,0.678106382296164,Milne13,Milne (2013),harmonicity,#11A3FF,Guitar
11.381381381381381,0.6781063838718898,Milne13,Milne (2013),harmonicity,#11A3FF,Guitar
11.396396396396396,0.6781063876674994,Milne13,Milne (2013),harmonicity,#11A3FF,Guitar
11.411411411411411,0.6781063966063668,Milne13,Milne (2013),harmonicity,#11A3FF,Guitar
11.426426426426426,0.6781064171874431,Milne13,Milne (2013),harmonicity,#11A3FF,Guitar
11.441441441441441,0.6781064635137345,Milne13,Milne (2013),harmonicity,#11A3FF,Guitar
11.456456456456456,0.6781065654563649,Milne13,Milne (2013),harmonicity,#11A3FF,Guitar
11.471471471471471,0.6781067847596889,Milne13,Milne (2013),harmonicity,#11A3FF,Guitar
11.486486486486486,0.6781072459415679,Milne13,Milne (2013),harmonicity,#11A3FF,Guitar
11.501501501501501,0.6781081939177365,Milne13,Milne (2013),harmonicity,#11A3FF,Guitar
11.516516516516516,0.6781100984241013,Milne13,Milne (2013),harmonicity,#11A3FF,Guitar
11.531531531531531,0.6781138378832688,Milne13,Milne (2013),harmonicity,#11A3FF,Guitar
11.546546546546546,0.6781210137779898,Milne13,Milne (2013),harmonicity,#11A3FF,Guitar
11.561561561561561,0.6781344716850906,Milne13,Milne (2013),harmonicity,#11A3FF,Guitar
11.576576576576576,0.6781591366058669,Milne13,Milne (2013),harmonicity,#11A3FF,Guitar
11.591591591591591,0.6782033090268691,Milne13,Milne (2013),harmonicity,#11A3FF,Guitar
11.606606606606606,0.6782806300076745,Milne13,Milne (2013),harmonicity,#11A3FF,Guitar
11.621621621621621,0.6784130870259071,Milne13,Milne (2013),harmonicity,#11A3FF,Guitar
11.636636636636636,0.6786359252158455,Milne13,Milne (2013),harmonicity,#11A3FF,Guitar
11.651651651651651,0.679006438963443,Milne13,Milne (2013),harmonicity,#11A3FF,Guitar
11.666666666666666,0.6796199649957242,Milne13,Milne (2013),harmonicity,#11A3FF,Guitar
11.681681681681681,0.6806362462366533,Milne13,Milne (2013),harmonicity,#11A3FF,Guitar
11.696696696696696,0.682316982556285,Milne13,Milne (2013),harmonicity,#11A3FF,Guitar
11.711711711711711,0.6850749286121754,Milne13,Milne (2013),harmonicity,#11A3FF,Guitar
11.726726726726726,0.689537163677849,Milne13,Milne (2013),harmonicity,#11A3FF,Guitar
11.741741741741741,0.6966096519025471,Milne13,Milne (2013),harmonicity,#11A3FF,Guitar
11.756756756756756,0.7074709334561643,Milne13,Milne (2013),harmonicity,#11A3FF,Guitar
11.771771771771771,0.7233542826537641,Milne13,Milne (2013),harmonicity,#11A3FF,Guitar
11.786786786786786,0.7450255368562935,Milne13,Milne (2013),harmonicity,#11A3FF,Guitar
11.801801801801801,0.77212843301426,Milne13,Milne (2013),harmonicity,#11A3FF,Guitar
11.816816816816816,0.8028801984429292,Milne13,Milne (2013),harmonicity,#11A3FF,Guitar
11.831831831831831,0.8345073215909949,Milne13,Milne (2013),harmonicity,#11A3FF,Guitar
11.846846846846846,0.864209698205776,Milne13,Milne (2013),harmonicity,#11A3FF,Guitar
11.861861861861861,0.8899916177111151,Milne13,Milne (2013),harmonicity,#11A3FF,Guitar
11.876876876876876,0.9109348666484723,Milne13,Milne (2013),harmonicity,#11A3FF,Guitar
11.891891891891891,0.9270061832733592,Milne13,Milne (2013),harmonicity,#11A3FF,Guitar
11.906906906906906,0.9387021649493559,Milne13,Milne (2013),harmonicity,#11A3FF,Guitar
11.921921921921921,0.9467505120031301,Milne13,Milne (2013),harmonicity,#11A3FF,Guitar
11.936936936936936,0.9519430845564054,Milne13,Milne (2013),harmonicity,#11A3FF,Guitar
11.951951951951951,0.9550545373004241,Milne13,Milne (2013),harmonicity,#11A3FF,Guitar
11.966966966966966,0.9567640954286133,Milne13,Milne (2013),harmonicity,#11A3FF,Guitar
11.981981981981981,0.9575806016389289,Milne13,Milne (2013),harmonicity,#11A3FF,Guitar
11.996996996996996,0.957826132132128,Milne13,Milne (2013),harmonicity,#11A3FF,Guitar
12.012012012012011,0.9576549800719357,Milne13,Milne (2013),harmonicity,#11A3FF,Guitar
12.027027027027026,0.9570307947602337,Milne13,Milne (2013),harmonicity,#11A3FF,Guitar
12.042042042042041,0.95568031887493,Milne13,Milne (2013),harmonicity,#11A3FF,Guitar
12.057057057057056,0.9531116804764522,Milne13,Milne (2013),harmonicity,#11A3FF,Guitar
12.072072072072071,0.948690802191845,Milne13,Milne (2013),harmonicity,#11A3FF,Guitar
12.087087087087086,0.9416911552807284,Milne13,Milne (2013),harmonicity,#11A3FF,Guitar
12.102102102102101,0.931316026669852,Milne13,Milne (2013),harmonicity,#11A3FF,Guitar
12.117117117117116,0.9167804846217164,Milne13,Milne (2013),harmonicity,#11A3FF,Guitar
12.132132132132131,0.8974932739879146,Milne13,Milne (2013),harmonicity,#11A3FF,Guitar
12.147147147147146,0.8733130380900238,Milne13,Milne (2013),harmonicity,#11A3FF,Guitar
12.162162162162161,0.8448495207497374,Milne13,Milne (2013),harmonicity,#11A3FF,Guitar
12.177177177177176,0.813707434233881,Milne13,Milne (2013),harmonicity,#11A3FF,Guitar
12.192192192192191,0.7824132232349729,Milne13,Milne (2013),harmonicity,#11A3FF,Guitar
12.207207207207206,0.7538104018552286,Milne13,Milne (2013),harmonicity,#11A3FF,Guitar
12.222222222222221,0.7301161268539494,Milne13,Milne (2013),harmonicity,#11A3FF,Guitar
12.237237237237236,0.7122287314070751,Milne13,Milne (2013),harmonicity,#11A3FF,Guitar
12.252252252252251,0.699738412696924,Milne13,Milne (2013),harmonicity,#11A3FF,Guitar
12.267267267267266,0.6915033155858643,Milne13,Milne (2013),harmonicity,#11A3FF,Guitar
12.282282282282281,0.6862768044649815,Milne13,Milne (2013),harmonicity,#11A3FF,Guitar
12.297297297297296,0.6830426628746308,Milne13,Milne (2013),harmonicity,#11A3FF,Guitar
12.312312312312311,0.6810753781855531,Milne13,Milne (2013),harmonicity,#11A3FF,Guitar
12.327327327327327,0.6798885695209808,Milne13,Milne (2013),harmonicity,#11A3FF,Guitar
12.342342342342342,0.679171995974793,Milne13,Milne (2013),harmonicity,#11A3FF,Guitar
12.357357357357357,0.678737612052763,Milne13,Milne (2013),harmonicity,#11A3FF,Guitar
12.372372372372372,0.6784746660460723,Milne13,Milne (2013),harmonicity,#11A3FF,Guitar
12.387387387387387,0.6783171762432079,Milne13,Milne (2013),harmonicity,#11A3FF,Guitar
12.402402402402402,0.6782245191073916,Milne13,Milne (2013),harmonicity,#11A3FF,Guitar
12.417417417417417,0.6781711672722274,Milne13,Milne (2013),harmonicity,#11A3FF,Guitar
12.432432432432432,0.6781411394106319,Milne13,Milne (2013),harmonicity,#11A3FF,Guitar
12.447447447447447,0.6781246237325528,Milne13,Milne (2013),harmonicity,#11A3FF,Guitar
12.462462462462462,0.6781157468435702,Milne13,Milne (2013),harmonicity,#11A3FF,Guitar
12.477477477477477,0.6781110843755963,Milne13,Milne (2013),harmonicity,#11A3FF,Guitar
12.492492492492492,0.678108691392394,Milne13,Milne (2013),harmonicity,#11A3FF,Guitar
12.507507507507507,0.6781074913825875,Milne13,Milne (2013),harmonicity,#11A3FF,Guitar
12.522522522522522,0.6781069035337607,Milne13,Milne (2013),harmonicity,#11A3FF,Guitar
12.537537537537537,0.6781066223373021,Milne13,Milne (2013),harmonicity,#11A3FF,Guitar
12.552552552552552,0.6781064910194856,Milne13,Milne (2013),harmonicity,#11A3FF,Guitar
12.567567567567567,0.6781064309971855,Milne13,Milne (2013),harmonicity,#11A3FF,Guitar
12.582582582582582,0.6781064038650053,Milne13,Milne (2013),harmonicity,#11A3FF,Guitar
12.597597597597597,0.6781063915107205,Milne13,Milne (2013),harmonicity,#11A3FF,Guitar
12.612612612612612,0.6781063857892633,Milne13,Milne (2013),harmonicity,#11A3FF,Guitar
12.627627627627627,0.6781063831495914,Milne13,Milne (2013),harmonicity,#11A3FF,Guitar
12.642642642642642,0.6781063819876105,Milne13,Milne (2013),harmonicity,#11A3FF,Guitar
12.657657657657657,0.6781063815157934,Milne13,Milne (2013),harmonicity,#11A3FF,Guitar
12.672672672672672,0.6781063813397671,Milne13,Milne (2013),harmonicity,#11A3FF,Guitar
12.687687687687687,0.6781063812778676,Milne13,Milne (2013),harmonicity,#11A3FF,Guitar
12.702702702702702,0.6781063812565581,Milne13,Milne (2013),harmonicity,#11A3FF,Guitar
12.717717717717717,0.6781063812491905,Milne13,Milne (2013),harmonicity,#11A3FF,Guitar
12.732732732732732,0.6781063812466283,Milne13,Milne (2013),harmonicity,#11A3FF,Guitar
12.747747747747747,0.6781063812457415,Milne13,Milne (2013),harmonicity,#11A3FF,Guitar
12.762762762762762,0.6781063812454401,Milne13,Milne (2013),harmonicity,#11A3FF,Guitar
12.777777777777777,0.6781063812453402,Milne13,Milne (2013),harmonicity,#11A3FF,Guitar
12.792792792792792,0.6781063812453102,Milne13,Milne (2013),harmonicity,#11A3FF,Guitar
12.807807807807807,0.6781063812453076,Milne13,Milne (2013),harmonicity,#11A3FF,Guitar
12.822822822822824,0.6781063812453266,Milne13,Milne (2013),harmonicity,#11A3FF,Guitar
12.837837837837839,0.6781063812453889,Milne13,Milne (2013),harmonicity,#11A3FF,Guitar
12.852852852852854,0.6781063812455659,Milne13,Milne (2013),harmonicity,#11A3FF,Guitar
12.867867867867869,0.678106381246039,Milne13,Milne (2013),harmonicity,#11A3FF,Guitar
12.882882882882884,0.6781063812471719,Milne13,Milne (2013),harmonicity,#11A3FF,Guitar
12.897897897897899,0.6781063812494641,Milne13,Milne (2013),harmonicity,#11A3FF,Guitar
12.912912912912914,0.6781063812532022,Milne13,Milne (2013),harmonicity,#11A3FF,Guitar
12.927927927927929,0.6781063812580759,Milne13,Milne (2013),harmonicity,#11A3FF,Guitar
12.942942942942944,0.6781063812644467,Milne13,Milne (2013),harmonicity,#11A3FF,Guitar
12.957957957957959,0.6781063812802841,Milne13,Milne (2013),harmonicity,#11A3FF,Guitar
12.972972972972974,0.678106381339763,Milne13,Milne (2013),harmonicity,#11A3FF,Guitar
12.987987987987989,0.6781063815377351,Milne13,Milne (2013),harmonicity,#11A3FF,Guitar
13.003003003003004,0.6781063820749058,Milne13,Milne (2013),harmonicity,#11A3FF,Guitar
13.018018018018019,0.6781063832993827,Milne13,Milne (2013),harmonicity,#11A3FF,Guitar
13.033033033033034,0.6781063857278279,Milne13,Milne (2013),harmonicity,#11A3FF,Guitar
13.048048048048049,0.6781063899940526,Milne13,Milne (2013),harmonicity,#11A3FF,Guitar
13.063063063063064,0.6781063966510791,Milne13,Milne (2013),harmonicity,#11A3FF,Guitar
13.078078078078079,0.6781064061659453,Milne13,Milne (2013),harmonicity,#11A3FF,Guitar
13.093093093093094,0.6781064203646736,Milne13,Milne (2013),harmonicity,#11A3FF,Guitar
13.108108108108109,0.6781064457306196,Milne13,Milne (2013),harmonicity,#11A3FF,Guitar
13.123123123123124,0.6781064943571,Milne13,Milne (2013),harmonicity,#11A3FF,Guitar
13.138138138138139,0.6781065785242866,Milne13,Milne (2013),harmonicity,#11A3FF,Guitar
13.153153153153154,0.6781067111447029,Milne13,Milne (2013),harmonicity,#11A3FF,Guitar
13.168168168168169,0.6781069313936203,Milne13,Milne (2013),harmonicity,#11A3FF,Guitar
13.183183183183184,0.6781073302488624,Milne13,Milne (2013),harmonicity,#11A3FF,Guitar
13.198198198198199,0.67810802149177285,Milne13,Milne (2013),harmonicity,#11A3FF,Guitar
13.213213213213214,0.6781091282288333,Milne13,Milne (2013),harmonicity,#11A3FF,Guitar
13.228228228228229,0.6781109898169707,Milne13,Milne (2013),harmonicity,#11A3FF,Guitar
13.243243243243244,0.6781145378220105,Milne13,Milne (2013),harmonicity,#11A3FF,Guitar
13.258258258258259,0.6781213069117183,Milne13,Milne (2013),harmonicity,#11A3FF,Guitar
13.273273273273274,0.6781327320604817,Milne13,Milne (2013),harmonicity,#11A3FF,Guitar
13.288288288288289,0.6781493424601585,Milne13,Milne (2013),harmonicity,#11A3FF,Guitar
13.303303303303304,0.678170821707855,Milne13,Milne (2013),harmonicity,#11A3FF,Guitar
13.318318318318319,0.6781969124733274,Milne13,Milne (2013),harmonicity,#11A3FF,Guitar
13.333333333333334,0.6782281056366734,Milne13,Milne (2013),harmonicity,#11A3FF,Guitar
13.348348348348349,0.6782653270428598,Milne13,Milne (2013),harmonicity,#11A3FF,Guitar
13.363363363363364,0.6783089775476338,Milne13,Milne (2013),harmonicity,#11A3FF,Guitar
13.378378378378379,0.6783583289493352,Milne13,Milne (2013),harmonicity,#11A3FF,Guitar
13.393393393393394,0.6784117382200864,Milne13,Milne (2013),harmonicity,#11A3FF,Guitar
13.408408408408409,0.6784671797762315,Milne13,Milne (2013),harmonicity,#11A3FF,Guitar
13.423423423423424,0.6785224739088989,Milne13,Milne (2013),harmonicity,#11A3FF,Guitar
13.438438438438439,0.6785752160026247,Milne13,Milne (2013),harmonicity,#11A3FF,Guitar
13.453453453453454,0.6786227587761788,Milne13,Milne (2013),harmonicity,#11A3FF,Guitar
13.468468468468469,0.6786624537253128,Milne13,Milne (2013),harmonicity,#11A3FF,Guitar
13.483483483483484,0.6786921405734789,Milne13,Milne (2013),harmonicity,#11A3FF,Guitar
13.498498498498499,0.6787106856630792,Milne13,Milne (2013),harmonicity,#11A3FF,Guitar
13.513513513513514,0.678718297515076,Milne13,Milne (2013),harmonicity,#11A3FF,Guitar
13.528528528528529,0.6787166988881921,Milne13,Milne (2013),harmonicity,#11A3FF,Guitar
13.543543543543544,0.67870952706185,Milne13,Milne (2013),harmonicity,#11A3FF,Guitar
13.558558558558559,0.678702550814779,Milne13,Milne (2013),harmonicity,#11A3FF,Guitar
13.573573573573574,0.6787023249694032,Milne13,Milne (2013),harmonicity,#11A3FF,Guitar
13.588588588588589,0.6787130687003854,Milne13,Milne (2013),harmonicity,#11A3FF,Guitar
13.603603603603604,0.6787341386366214,Milne13,Milne (2013),harmonicity,#11A3FF,Guitar
13.618618618618619,0.6787606378171892,Milne13,Milne (2013),harmonicity,#11A3FF,Guitar
13.633633633633634,0.6787866736381691,Milne13,Milne (2013),harmonicity,#11A3FF,Guitar
13.64864864864865,0.678808527876108,Milne13,Milne (2013),harmonicity,#11A3FF,Guitar
13.663663663663664,0.678826030732362,Milne13,Milne (2013),harmonicity,#11A3FF,Guitar
13.67867867867868,0.6788425723702296,Milne13,Milne (2013),harmonicity,#11A3FF,Guitar
13.693693693693694,0.6788648807211434,Milne13,Milne (2013),harmonicity,#11A3FF,Guitar
13.70870870870871,0.6789031384463701,Milne13,Milne (2013),harmonicity,#11A3FF,Guitar
13.723723723723724,0.6789714439577668,Milne13,Milne (2013),harmonicity,#11A3FF,Guitar
13.73873873873874,0.6790884483103463,Milne13,Milne (2013),harmonicity,#11A3FF,Guitar
13.753753753753754,0.6792780020928723,Milne13,Milne (2013),harmonicity,#11A3FF,Guitar
13.76876876876877,0.6795696376736422,Milne13,Milne (2013),harmonicity,#11A3FF,Guitar
13.783783783783784,0.6799986660451754,Milne13,Milne (2013),harmonicity,#11A3FF,Guitar
13.7987987987988,0.6806056190076556,Milne13,Milne (2013),harmonicity,#11A3FF,Guitar
13.813813813813814,0.6814347502320429,Milne13,Milne (2013),harmonicity,#11A3FF,Guitar
13.82882882882883,0.6825313492287658,Milne13,Milne (2013),harmonicity,#11A3FF,Guitar
13.843843843843844,0.6839377389503133,Milne13,Milne (2013),harmonicity,#11A3FF,Guitar
13.85885885885886,0.6856880221894354,Milne13,Milne (2013),harmonicity,#11A3FF,Guitar
13.873873873873874,0.6878019011792126,Milne13,Milne (2013),harmonicity,#11A3FF,Guitar
13.88888888888889,0.6902781567627656,Milne13,Milne (2013),harmonicity,#11A3FF,Guitar
13.903903903903904,0.6930885228210777,Milne13,Milne (2013),harmonicity,#11A3FF,Guitar
13.91891891891892,0.696172576136059,Milne13,Milne (2013),harmonicity,#11A3FF,Guitar
13.933933933933934,0.6994342287657679,Milne13,Milne (2013),harmonicity,#11A3FF,Guitar
13.94894894894895,0.7027420216268526,Milne13,Milne (2013),harmonicity,#11A3FF,Guitar
13.963963963963964,0.7059393411272757,Milne13,Milne (2013),harmonicity,#11A3FF,Guitar
13.97897897897898,0.708869797646673,Milne13,Milne (2013),harmonicity,#11A3FF,Guitar
13.993993993993994,0.7114064210461114,Milne13,Milne (2013),harmonicity,#11A3FF,Guitar
14.00900900900901,0.7134551994886396,Milne13,Milne (2013),harmonicity,#11A3FF,Guitar
14.024024024024024,0.714923302833021,Milne13,Milne (2013),harmonicity,#11A3FF,Guitar
14.03903903903904,0.7156925782250602,Milne13,Milne (2013),harmonicity,#11A3FF,Guitar
14.054054054054054,0.7156464267601175,Milne13,Milne (2013),harmonicity,#11A3FF,Guitar
14.06906906906907,0.7147391197807361,Milne13,Milne (2013),harmonicity,#11A3FF,Guitar
14.084084084084084,0.7130448996327678,Milne13,Milne (2013),harmonicity,#11A3FF,Guitar
14.0990990990991,0.7107454633904328,Milne13,Milne (2013),harmonicity,#11A3FF,Guitar
14.114114114114114,0.708084596887171,Milne13,Milne (2013),harmonicity,#11A3FF,Guitar
14.12912912912913,0.7053530105314971,Milne13,Milne (2013),harmonicity,#11A3FF,Guitar
14.144144144144144,0.7029152409013173,Milne13,Milne (2013),harmonicity,#11A3FF,Guitar
14.15915915915916,0.7012084178553766,Milne13,Milne (2013),harmonicity,#11A3FF,Guitar
14.174174174174174,0.7006371657332305,Milne13,Milne (2013),harmonicity,#11A3FF,Guitar
14.18918918918919,0.7013941866571223,Milne13,Milne (2013),harmonicity,#11A3FF,Guitar
14.204204204204204,0.7033441047170212,Milne13,Milne (2013),harmonicity,#11A3FF,Guitar
14.21921921921922,0.7060792308083542,Milne13,Milne (2013),harmonicity,#11A3FF,Guitar
14.234234234234235,0.7091128542916917,Milne13,Milne (2013),harmonicity,#11A3FF,Guitar
14.24924924924925,0.7120684744543473,Milne13,Milne (2013),harmonicity,#11A3FF,Guitar
14.264264264264265,0.7147357844758294,Milne13,Milne (2013),harmonicity,#11A3FF,Guitar
14.27927927927928,0.7169807693108108,Milne13,Milne (2013),harmonicity,#11A3FF,Guitar
14.294294294294295,0.7186332580234318,Milne13,Milne (2013),harmonicity,#11A3FF,Guitar
14.30930930930931,0.7194845158943475,Milne13,Milne (2013),harmonicity,#11A3FF,Guitar
14.324324324324325,0.7193825865981888,Milne13,Milne (2013),harmonicity,#11A3FF,Guitar
14.33933933933934,0.7183058738739196,Milne13,Milne (2013),harmonicity,#11A3FF,Guitar
14.354354354354355,0.7163526215049216,Milne13,Milne (2013),harmonicity,#11A3FF,Guitar
14.36936936936937,0.7136862822866727,Milne13,Milne (2013),harmonicity,#11A3FF,Guitar
14.384384384384385,0.7104927087658329,Milne13,Milne (2013),harmonicity,#11A3FF,Guitar
14.3993993993994,0.7069621707881646,Milne13,Milne (2013),harmonicity,#11A3FF,Guitar
14.414414414414415,0.7032817453613891,Milne13,Milne (2013),harmonicity,#11A3FF,Guitar
14.42942942942943,0.6996264524668289,Milne13,Milne (2013),harmonicity,#11A3FF,Guitar
14.444444444444445,0.6961487712401098,Milne13,Milne (2013),harmonicity,#11A3FF,Guitar
14.45945945945946,0.6929709989728372,Milne13,Milne (2013),harmonicity,#11A3FF,Guitar
14.474474474474475,0.6901825507692043,Milne13,Milne (2013),harmonicity,#11A3FF,Guitar
14.48948948948949,0.6878388458265605,Milne13,Milne (2013),harmonicity,#11A3FF,Guitar
14.504504504504505,0.6859562722850161,Milne13,Milne (2013),harmonicity,#11A3FF,Guitar
14.51951951951952,0.6845060186418678,Milne13,Milne (2013),harmonicity,#11A3FF,Guitar
14.534534534534535,0.6834219149266839,Milne13,Milne (2013),harmonicity,#11A3FF,Guitar
14.54954954954955,0.68262959511577,Milne13,Milne (2013),harmonicity,#11A3FF,Guitar
14.564564564564565,0.6820752225057405,Milne13,Milne (2013),harmonicity,#11A3FF,Guitar
14.57957957957958,0.6817255107874205,Milne13,Milne (2013),harmonicity,#11A3FF,Guitar
14.594594594594595,0.6815440441376936,Milne13,Milne (2013),harmonicity,#11A3FF,Guitar
14.60960960960961,0.6814726701573517,Milne13,Milne (2013),harmonicity,#11A3FF,Guitar
14.624624624624625,0.6814329369958754,Milne13,Milne (2013),harmonicity,#11A3FF,Guitar
14.63963963963964,0.6813479871498825,Milne13,Milne (2013),harmonicity,#11A3FF,Guitar
14.654654654654655,0.6811840756666401,Milne13,Milne (2013),harmonicity,#11A3FF,Guitar
14.66966966966967,0.6809851127361003,Milne13,Milne (2013),harmonicity,#11A3FF,Guitar
14.684684684684685,0.680843504018003,Milne13,Milne (2013),harmonicity,#11A3FF,Guitar
14.6996996996997,0.6808068168692232,Milne13,Milne (2013),harmonicity,#11A3FF,Guitar
14.714714714714715,0.6808220699088088,Milne13,Milne (2013),harmonicity,#11A3FF,Guitar
14.72972972972973,0.6807889102757398,Milne13,Milne (2013),harmonicity,#11A3FF,Guitar
14.744744744744745,0.6806500756536852,Milne13,Milne (2013),harmonicity,#11A3FF,Guitar
14.75975975975976,0.6804170213345855,Milne13,Milne (2013),harmonicity,#11A3FF,Guitar
14.774774774774775,0.6801331220561107,Milne13,Milne (2013),harmonicity,#11A3FF,Guitar
14.78978978978979,0.679836358366945,Milne13,Milne (2013),harmonicity,#11A3FF,Guitar
14.804804804804805,0.6795491088761229,Milne13,Milne (2013),harmonicity,#11A3FF,Guitar
14.81981981981982,0.6792834242593596,Milne13,Milne (2013),harmonicity,#11A3FF,Guitar
14.834834834834835,0.6790469342911476,Milne13,Milne (2013),harmonicity,#11A3FF,Guitar
14.84984984984985,0.6788450701579309,Milne13,Milne (2013),harmonicity,#11A3FF,Guitar
14.864864864864865,0.6786812694348642,Milne13,Milne (2013),harmonicity,#11A3FF,Guitar
14.87987987987988,0.6785574039126403,Milne13,Milne (2013),harmonicity,#11A3FF,Guitar
14.894894894894895,0.6784749096331307,Milne13,Milne (2013),harmonicity,#11A3FF,Guitar
14.90990990990991,0.6784353849299315,Milne13,Milne (2013),harmonicity,#11A3FF,Guitar
14.924924924924925,0.6784393137644623,Milne13,Milne (2013),harmonicity,#11A3FF,Guitar
14.93993993993994,0.6784829726079272,Milne13,Milne (2013),harmonicity,#11A3FF,Guitar
14.954954954954955,0.6785557547609223,Milne13,Milne (2013),harmonicity,#11A3FF,Guitar
14.96996996996997,0.6786415457867557,Milne13,Milne (2013),harmonicity,#11A3FF,Guitar
14.984984984984985,0.6787246938732907,Milne13,Milne (2013),harmonicity,#11A3FF,Guitar
15,0.6787955053755681,Milne13,Milne (2013),harmonicity,#11A3FF,Guitar
