interval,output,model_id,model_label,model_theory,model_colour,timbre_label
0,13.09076315557963,PraatF0,Praat (F0),harmonicity,#11A3FF,Stretched
0.015015015015015015,17.462194111904097,PraatF0,Praat (F0),harmonicity,#11A3FF,Stretched
0.03003003003003003,27.738781074839732,PraatF0,Praat (F0),harmonicity,#11A3FF,Stretched
0.04504504504504504,32.40434178047436,PraatF0,Praat (F0),harmonicity,#11A3FF,Stretched
0.06006006006006006,42.510976170657045,PraatF0,Praat (F0),harmonicity,#11A3FF,Stretched
0.07507507507507508,48.62474178976187,PraatF0,Praat (F0),harmonicity,#11A3FF,Stretched
0.09009009009009009,39.48507977798379,PraatF0,Praat (F0),harmonicity,#11A3FF,Stretched
0.10510510510510511,39.48526645844679,PraatF0,Praat (F0),harmonicity,#11A3FF,Stretched
0.12012012012012012,52.73823905494008,PraatF0,Praat (F0),harmonicity,#11A3FF,Stretched
0.13513513513513514,27.247094354281618,PraatF0,Praat (F0),harmonicity,#11A3FF,Stretched
0.15015015015015015,32.68197632163445,PraatF0,Praat (F0),harmonicity,#11A3FF,Stretched
0.16516516516516516,32.70077077529655,PraatF0,Praat (F0),harmonicity,#11A3FF,Stretched
0.18018018018018017,32.71485410559035,PraatF0,Praat (F0),harmonicity,#11A3FF,Stretched
0.19519519519519518,32.7305520247441,PraatF0,Praat (F0),harmonicity,#11A3FF,Stretched
0.21021021021021022,32.745867303020816,PraatF0,Praat (F0),harmonicity,#11A3FF,Stretched
0.22522522522522523,32.76193590747279,PraatF0,Praat (F0),harmonicity,#11A3FF,Stretched
0.24024024024024024,29.20711425087427,PraatF0,Praat (F0),harmonicity,#11A3FF,Stretched
0.2552552552552553,29.217445306748296,PraatF0,Praat (F0),harmonicity,#11A3FF,Stretched
0.2702702702702703,29.22832498020031,PraatF0,Praat (F0),harmonicity,#11A3FF,Stretched
0.2852852852852853,29.23894037318906,PraatF0,Praat (F0),harmonicity,#11A3FF,Stretched
0.3003003003003003,29.250067388565007,PraatF0,Praat (F0),harmonicity,#11A3FF,Stretched
0.3153153153153153,29.26039737552261,PraatF0,Praat (F0),harmonicity,#11A3FF,Stretched
0.3303303303303303,14.6356651430706,PraatF0,Praat (F0),harmonicity,#11A3FF,Stretched
0.34534534534534533,12.023936756053887,PraatF0,Praat (F0),harmonicity,#11A3FF,Stretched
0.36036036036036034,0,PraatF0,Praat (F0),harmonicity,#11A3FF,Stretched
0.37537537537537535,0,PraatF0,Praat (F0),harmonicity,#11A3FF,Stretched
0.39039039039039036,0,PraatF0,Praat (F0),harmonicity,#11A3FF,Stretched
0.40540540540540543,0,PraatF0,Praat (F0),harmonicity,#11A3FF,Stretched
0.42042042042042044,0,PraatF0,Praat (F0),harmonicity,#11A3FF,Stretched
0.43543543543543545,0,PraatF0,Praat (F0),harmonicity,#11A3FF,Stretched
0.45045045045045046,0,PraatF0,Praat (F0),harmonicity,#11A3FF,Stretched
0.46546546546546547,0,PraatF0,Praat (F0),harmonicity,#11A3FF,Stretched
0.4804804804804805,0,PraatF0,Praat (F0),harmonicity,#11A3FF,Stretched
0.4954954954954955,0,PraatF0,Praat (F0),harmonicity,#11A3FF,Stretched
0.5105105105105106,0,PraatF0,Praat (F0),harmonicity,#11A3FF,Stretched
0.5255255255255256,0,PraatF0,Praat (F0),harmonicity,#11A3FF,Stretched
0.5405405405405406,0,PraatF0,Praat (F0),harmonicity,#11A3FF,Stretched
0.5555555555555556,0,PraatF0,Praat (F0),harmonicity,#11A3FF,Stretched
0.5705705705705706,0,PraatF0,Praat (F0),harmonicity,#11A3FF,Stretched
0.5855855855855856,0,PraatF0,Praat (F0),harmonicity,#11A3FF,Stretched
0.6006006006006006,0,PraatF0,Praat (F0),harmonicity,#11A3FF,Stretched
0.6156156156156156,0,PraatF0,Praat (F0),harmonicity,#11A3FF,Stretched
0.6306306306306306,0,PraatF0,Praat (F0),harmonicity,#11A3FF,Stretched
0.6456456456456456,11.41725765750272,PraatF0,Praat (F0),harmonicity,#11A3FF,Stretched
0.6606606606606606,11.424952231538308,PraatF0,Praat (F0),harmonicity,#11A3FF,Stretched
0.6756756756756757,11.431810472663363,PraatF0,Praat (F0),harmonicity,#11A3FF,Stretched
0.6906906906906907,12.42571605207987,PraatF0,Praat (F0),harmonicity,#11A3FF,Stretched
0.7057057057057057,12.431641952027558,PraatF0,Praat (F0),harmonicity,#11A3FF,Stretched
0.7207207207207207,12.437670418872498,PraatF0,Praat (F0),harmonicity,#11A3FF,Stretched
0.7357357357357357,11.9296255282539,PraatF0,Praat (F0),harmonicity,#11A3FF,Stretched
0.7507507507507507,11.934254725180953,PraatF0,Praat (F0),harmonicity,#11A3FF,Stretched
0.7657657657657657,13.686446536814675,PraatF0,Praat (F0),harmonicity,#11A3FF,Stretched
0.7807807807807807,13.695140653651897,PraatF0,Praat (F0),harmonicity,#11A3FF,Stretched
0.7957957957957957,13.706691342581578,PraatF0,Praat (F0),harmonicity,#11A3FF,Stretched
0.8108108108108109,13.718998819385334,PraatF0,Praat (F0),harmonicity,#11A3FF,Stretched
0.8258258258258259,13.728646336491803,PraatF0,Praat (F0),harmonicity,#11A3FF,Stretched
0.8408408408408409,13.736798498474897,PraatF0,Praat (F0),harmonicity,#11A3FF,Stretched
0.8558558558558559,13.08409145664912,PraatF0,Praat (F0),harmonicity,#11A3FF,Stretched
0.8708708708708709,13.086522818911696,PraatF0,Praat (F0),harmonicity,#11A3FF,Stretched
0.8858858858858859,13.090299260438638,PraatF0,Praat (F0),harmonicity,#11A3FF,Stretched
0.9009009009009009,13.094243470905587,PraatF0,Praat (F0),harmonicity,#11A3FF,Stretched
0.9159159159159159,13.098082840035103,PraatF0,Praat (F0),harmonicity,#11A3FF,Stretched
0.9309309309309309,13.811308684324683,PraatF0,Praat (F0),harmonicity,#11A3FF,Stretched
0.9459459459459459,13.820643240964074,PraatF0,Praat (F0),harmonicity,#11A3FF,Stretched
0.960960960960961,14.479508788086486,PraatF0,Praat (F0),harmonicity,#11A3FF,Stretched
0.975975975975976,16.266284450764935,PraatF0,Praat (F0),harmonicity,#11A3FF,Stretched
0.990990990990991,16.26889144286915,PraatF0,Praat (F0),harmonicity,#11A3FF,Stretched
1.006006006006006,16.27248082300057,PraatF0,Praat (F0),harmonicity,#11A3FF,Stretched
1.021021021021021,16.27627477204145,PraatF0,Praat (F0),harmonicity,#11A3FF,Stretched
1.0360360360360361,17.27683009109513,PraatF0,Praat (F0),harmonicity,#11A3FF,Stretched
1.0510510510510511,17.28607341430179,PraatF0,Praat (F0),harmonicity,#11A3FF,Stretched
1.0660660660660661,14.594532615000407,PraatF0,Praat (F0),harmonicity,#11A3FF,Stretched
1.0810810810810811,14.595943869938253,PraatF0,Praat (F0),harmonicity,#11A3FF,Stretched
1.0960960960960962,14.594488772936849,PraatF0,Praat (F0),harmonicity,#11A3FF,Stretched
1.1111111111111112,20.2036046806367,PraatF0,Praat (F0),harmonicity,#11A3FF,Stretched
1.1261261261261262,20.211130785382267,PraatF0,Praat (F0),harmonicity,#11A3FF,Stretched
1.1411411411411412,20.21779389054158,PraatF0,Praat (F0),harmonicity,#11A3FF,Stretched
1.1561561561561562,20.2234881481722,PraatF0,Praat (F0),harmonicity,#11A3FF,Stretched
1.1711711711711712,20.22795999139732,PraatF0,Praat (F0),harmonicity,#11A3FF,Stretched
1.1861861861861862,20.230678862445053,PraatF0,Praat (F0),harmonicity,#11A3FF,Stretched
1.2012012012012012,21.81926828712846,PraatF0,Praat (F0),harmonicity,#11A3FF,Stretched
1.2162162162162162,21.827709882260244,PraatF0,Praat (F0),harmonicity,#11A3FF,Stretched
1.2312312312312312,10.008531018298047,PraatF0,Praat (F0),harmonicity,#11A3FF,Stretched
1.2462462462462462,20.209790180811616,PraatF0,Praat (F0),harmonicity,#11A3FF,Stretched
1.2612612612612613,21.783400405816966,PraatF0,Praat (F0),harmonicity,#11A3FF,Stretched
1.2762762762762763,21.793725005831938,PraatF0,Praat (F0),harmonicity,#11A3FF,Stretched
1.2912912912912913,21.803696128585905,PraatF0,Praat (F0),harmonicity,#11A3FF,Stretched
1.3063063063063063,21.81363226541913,PraatF0,Praat (F0),harmonicity,#11A3FF,Stretched
1.3213213213213213,21.823625115235608,PraatF0,Praat (F0),harmonicity,#11A3FF,Stretched
1.3363363363363363,21.833771450224873,PraatF0,Praat (F0),harmonicity,#11A3FF,Stretched
1.3513513513513513,21.844258503086248,PraatF0,Praat (F0),harmonicity,#11A3FF,Stretched
1.3663663663663663,21.855583991353818,PraatF0,Praat (F0),harmonicity,#11A3FF,Stretched
1.3813813813813813,23.64668797110503,PraatF0,Praat (F0),harmonicity,#11A3FF,Stretched
1.3963963963963963,23.661665312196455,PraatF0,Praat (F0),harmonicity,#11A3FF,Stretched
1.4114114114114114,11.929493328524096,PraatF0,Praat (F0),harmonicity,#11A3FF,Stretched
1.4264264264264264,11.936017103695395,PraatF0,Praat (F0),harmonicity,#11A3FF,Stretched
1.4414414414414414,12.429817928977025,PraatF0,Praat (F0),harmonicity,#11A3FF,Stretched
1.4564564564564564,12.435506398915606,PraatF0,Praat (F0),harmonicity,#11A3FF,Stretched
1.4714714714714714,26.193026724470286,PraatF0,Praat (F0),harmonicity,#11A3FF,Stretched
1.4864864864864864,26.20965832290677,PraatF0,Praat (F0),harmonicity,#11A3FF,Stretched
1.5015015015015014,26.225243634416742,PraatF0,Praat (F0),harmonicity,#11A3FF,Stretched
1.5165165165165164,26.239725538372475,PraatF0,Praat (F0),harmonicity,#11A3FF,Stretched
1.5315315315315314,26.253104493947525,PraatF0,Praat (F0),harmonicity,#11A3FF,Stretched
1.5465465465465464,12.499603436018639,PraatF0,Praat (F0),harmonicity,#11A3FF,Stretched
1.5615615615615615,12.504061165215782,PraatF0,Praat (F0),harmonicity,#11A3FF,Stretched
1.5765765765765765,13.081656378961764,PraatF0,Praat (F0),harmonicity,#11A3FF,Stretched
1.5915915915915915,13.08643598620494,PraatF0,Praat (F0),harmonicity,#11A3FF,Stretched
1.6066066066066067,13.091128133048624,PraatF0,Praat (F0),harmonicity,#11A3FF,Stretched
1.6216216216216217,13.095332237246158,PraatF0,Praat (F0),harmonicity,#11A3FF,Stretched
1.6366366366366367,13.097445346178262,PraatF0,Praat (F0),harmonicity,#11A3FF,Stretched
1.6516516516516517,24.019068335550436,PraatF0,Praat (F0),harmonicity,#11A3FF,Stretched
1.6666666666666667,24.03394395890655,PraatF0,Praat (F0),harmonicity,#11A3FF,Stretched
1.6816816816816818,24.04817963961262,PraatF0,Praat (F0),harmonicity,#11A3FF,Stretched
1.6966966966966968,24.06219587747158,PraatF0,Praat (F0),harmonicity,#11A3FF,Stretched
1.7117117117117118,13.72691978599378,PraatF0,Praat (F0),harmonicity,#11A3FF,Stretched
1.7267267267267268,32.3222014832464,PraatF0,Praat (F0),harmonicity,#11A3FF,Stretched
1.7417417417417418,32.33647069787966,PraatF0,Praat (F0),harmonicity,#11A3FF,Stretched
1.7567567567567568,32.35040733860362,PraatF0,Praat (F0),harmonicity,#11A3FF,Stretched
1.7717717717717718,32.36399676048964,PraatF0,Praat (F0),harmonicity,#11A3FF,Stretched
1.7867867867867868,32.377177737339494,PraatF0,Praat (F0),harmonicity,#11A3FF,Stretched
1.8018018018018018,32.389815724955525,PraatF0,Praat (F0),harmonicity,#11A3FF,Stretched
1.8168168168168168,32.40161191595661,PraatF0,Praat (F0),harmonicity,#11A3FF,Stretched
1.8318318318318318,29.190702094972288,PraatF0,Praat (F0),harmonicity,#11A3FF,Stretched
1.8468468468468469,29.20239527911919,PraatF0,Praat (F0),harmonicity,#11A3FF,Stretched
1.8618618618618619,29.212693052927733,PraatF0,Praat (F0),harmonicity,#11A3FF,Stretched
1.8768768768768769,29.221596978428934,PraatF0,Praat (F0),harmonicity,#11A3FF,Stretched
1.8918918918918919,29.22905556128082,PraatF0,Praat (F0),harmonicity,#11A3FF,Stretched
1.906906906906907,29.235431069414844,PraatF0,Praat (F0),harmonicity,#11A3FF,Stretched
1.921921921921922,29.240387932740873,PraatF0,Praat (F0),harmonicity,#11A3FF,Stretched
1.936936936936937,32.69710776473639,PraatF0,Praat (F0),harmonicity,#11A3FF,Stretched
1.951951951951952,32.71802767358571,PraatF0,Praat (F0),harmonicity,#11A3FF,Stretched
1.966966966966967,32.72963176268719,PraatF0,Praat (F0),harmonicity,#11A3FF,Stretched
1.981981981981982,32.74357297875959,PraatF0,Praat (F0),harmonicity,#11A3FF,Stretched
1.996996996996997,32.34735944843469,PraatF0,Praat (F0),harmonicity,#11A3FF,Stretched
2.012012012012012,32.35636807421196,PraatF0,Praat (F0),harmonicity,#11A3FF,Stretched
2.027027027027027,32.36729063430473,PraatF0,Praat (F0),harmonicity,#11A3FF,Stretched
2.042042042042042,32.37914801696864,PraatF0,Praat (F0),harmonicity,#11A3FF,Stretched
2.057057057057057,32.391914381564824,PraatF0,Praat (F0),harmonicity,#11A3FF,Stretched
2.0720720720720722,32.40570276726889,PraatF0,Praat (F0),harmonicity,#11A3FF,Stretched
2.0870870870870872,32.42089044099698,PraatF0,Praat (F0),harmonicity,#11A3FF,Stretched
2.1021021021021022,36.97613604811201,PraatF0,Praat (F0),harmonicity,#11A3FF,Stretched
2.1171171171171173,37.00764051254329,PraatF0,Praat (F0),harmonicity,#11A3FF,Stretched
2.1321321321321323,36.64394302611988,PraatF0,Praat (F0),harmonicity,#11A3FF,Stretched
2.1471471471471473,36.66287729406669,PraatF0,Praat (F0),harmonicity,#11A3FF,Stretched
2.1621621621621623,36.68117890621533,PraatF0,Praat (F0),harmonicity,#11A3FF,Stretched
2.1771771771771773,36.71461556490033,PraatF0,Praat (F0),harmonicity,#11A3FF,Stretched
2.1921921921921923,36.73117737759344,PraatF0,Praat (F0),harmonicity,#11A3FF,Stretched
2.2072072072072073,36.75603856560581,PraatF0,Praat (F0),harmonicity,#11A3FF,Stretched
2.2222222222222223,36.78168939514184,PraatF0,Praat (F0),harmonicity,#11A3FF,Stretched
2.2372372372372373,32.74589424012929,PraatF0,Praat (F0),harmonicity,#11A3FF,Stretched
2.2522522522522523,36.852700257802965,PraatF0,Praat (F0),harmonicity,#11A3FF,Stretched
2.2672672672672673,36.89659029499338,PraatF0,Praat (F0),harmonicity,#11A3FF,Stretched
2.2822822822822824,36.93951017230938,PraatF0,Praat (F0),harmonicity,#11A3FF,Stretched
2.2972972972972974,36.976680344135566,PraatF0,Praat (F0),harmonicity,#11A3FF,Stretched
2.3123123123123124,13.081063692394597,PraatF0,Praat (F0),harmonicity,#11A3FF,Stretched
2.3273273273273274,13.08508385014924,PraatF0,Praat (F0),harmonicity,#11A3FF,Stretched
2.3423423423423424,13.089535252205813,PraatF0,Praat (F0),harmonicity,#11A3FF,Stretched
2.3573573573573574,13.093465787992198,PraatF0,Praat (F0),harmonicity,#11A3FF,Stretched
2.3723723723723724,13.096317018322054,PraatF0,Praat (F0),harmonicity,#11A3FF,Stretched
2.3873873873873874,13.696067871757048,PraatF0,Praat (F0),harmonicity,#11A3FF,Stretched
2.4024024024024024,13.707869089253318,PraatF0,Praat (F0),harmonicity,#11A3FF,Stretched
2.4174174174174174,13.72025940024113,PraatF0,Praat (F0),harmonicity,#11A3FF,Stretched
2.4324324324324325,13.729230194912043,PraatF0,Praat (F0),harmonicity,#11A3FF,Stretched
2.4474474474474475,13.735985520026743,PraatF0,Praat (F0),harmonicity,#11A3FF,Stretched
2.4624624624624625,21.821719296949183,PraatF0,Praat (F0),harmonicity,#11A3FF,Stretched
2.4774774774774775,21.828437980275325,PraatF0,Praat (F0),harmonicity,#11A3FF,Stretched
2.4924924924924925,21.833754318898638,PraatF0,Praat (F0),harmonicity,#11A3FF,Stretched
2.5075075075075075,21.837679466115034,PraatF0,Praat (F0),harmonicity,#11A3FF,Stretched
2.5225225225225225,21.838638354646058,PraatF0,Praat (F0),harmonicity,#11A3FF,Stretched
2.5375375375375375,21.830882141662826,PraatF0,Praat (F0),harmonicity,#11A3FF,Stretched
2.5525525525525525,21.81641867026325,PraatF0,Praat (F0),harmonicity,#11A3FF,Stretched
2.5675675675675675,21.8119411740387,PraatF0,Praat (F0),harmonicity,#11A3FF,Stretched
2.5825825825825826,21.81569722505371,PraatF0,Praat (F0),harmonicity,#11A3FF,Stretched
2.5975975975975976,21.82247496526778,PraatF0,Praat (F0),harmonicity,#11A3FF,Stretched
2.6126126126126126,15.225381303224411,PraatF0,Praat (F0),harmonicity,#11A3FF,Stretched
2.6276276276276276,15.234482495826763,PraatF0,Praat (F0),harmonicity,#11A3FF,Stretched
2.6426426426426426,10.862427089429005,PraatF0,Praat (F0),harmonicity,#11A3FF,Stretched
2.6576576576576576,10.867982760323336,PraatF0,Praat (F0),harmonicity,#11A3FF,Stretched
2.6726726726726726,10.873598780073053,PraatF0,Praat (F0),harmonicity,#11A3FF,Stretched
2.6876876876876876,23.626968650955376,PraatF0,Praat (F0),harmonicity,#11A3FF,Stretched
2.7027027027027026,23.64505233924556,PraatF0,Praat (F0),harmonicity,#11A3FF,Stretched
2.7177177177177176,23.66067226888122,PraatF0,Praat (F0),harmonicity,#11A3FF,Stretched
2.7327327327327327,23.675253603508217,PraatF0,Praat (F0),harmonicity,#11A3FF,Stretched
2.7477477477477477,15.345059121650266,PraatF0,Praat (F0),harmonicity,#11A3FF,Stretched
2.7627627627627627,15.355847466814659,PraatF0,Praat (F0),harmonicity,#11A3FF,Stretched
2.7777777777777777,15.366777697082707,PraatF0,Praat (F0),harmonicity,#11A3FF,Stretched
2.7927927927927927,15.378806552138762,PraatF0,Praat (F0),harmonicity,#11A3FF,Stretched
2.8078078078078077,15.394363073345517,PraatF0,Praat (F0),harmonicity,#11A3FF,Stretched
2.8228228228228227,15.410638633263883,PraatF0,Praat (F0),harmonicity,#11A3FF,Stretched
2.8378378378378377,10.986482341717647,PraatF0,Praat (F0),harmonicity,#11A3FF,Stretched
2.8528528528528527,10.992575893429422,PraatF0,Praat (F0),harmonicity,#11A3FF,Stretched
2.8678678678678677,10.998592555544004,PraatF0,Praat (F0),harmonicity,#11A3FF,Stretched
2.8828828828828827,11.005232056864024,PraatF0,Praat (F0),harmonicity,#11A3FF,Stretched
2.8978978978978978,23.90844070400319,PraatF0,Praat (F0),harmonicity,#11A3FF,Stretched
2.9129129129129128,16.25838506697718,PraatF0,Praat (F0),harmonicity,#11A3FF,Stretched
2.9279279279279278,16.264493086056177,PraatF0,Praat (F0),harmonicity,#11A3FF,Stretched
2.942942942942943,16.26986394892738,PraatF0,Praat (F0),harmonicity,#11A3FF,Stretched
2.957957957957958,16.2728309994107,PraatF0,Praat (F0),harmonicity,#11A3FF,Stretched
2.972972972972973,16.271506393998038,PraatF0,Praat (F0),harmonicity,#11A3FF,Stretched
2.987987987987988,16.273138775182193,PraatF0,Praat (F0),harmonicity,#11A3FF,Stretched
3.003003003003003,13.083354865736043,PraatF0,Praat (F0),harmonicity,#11A3FF,Stretched
3.018018018018018,13.089460494182546,PraatF0,Praat (F0),harmonicity,#11A3FF,Stretched
3.033033033033033,13.095529933969491,PraatF0,Praat (F0),harmonicity,#11A3FF,Stretched
3.048048048048048,13.101638651707493,PraatF0,Praat (F0),harmonicity,#11A3FF,Stretched
3.063063063063063,24.109004613899025,PraatF0,Praat (F0),harmonicity,#11A3FF,Stretched
3.078078078078078,26.09450500505684,PraatF0,Praat (F0),harmonicity,#11A3FF,Stretched
3.093093093093093,26.113702443001188,PraatF0,Praat (F0),harmonicity,#11A3FF,Stretched
3.108108108108108,26.13295736786607,PraatF0,Praat (F0),harmonicity,#11A3FF,Stretched
3.123123123123123,26.15254961923419,PraatF0,Praat (F0),harmonicity,#11A3FF,Stretched
3.138138138138138,26.17239705799824,PraatF0,Praat (F0),harmonicity,#11A3FF,Stretched
3.153153153153153,26.192127776694676,PraatF0,Praat (F0),harmonicity,#11A3FF,Stretched
3.168168168168168,26.21132901537201,PraatF0,Praat (F0),harmonicity,#11A3FF,Stretched
3.183183183183183,26.229771646445982,PraatF0,Praat (F0),harmonicity,#11A3FF,Stretched
3.198198198198198,26.24746586839371,PraatF0,Praat (F0),harmonicity,#11A3FF,Stretched
3.2132132132132134,26.264582317563125,PraatF0,Praat (F0),harmonicity,#11A3FF,Stretched
3.2282282282282284,26.281372950391113,PraatF0,Praat (F0),harmonicity,#11A3FF,Stretched
3.2432432432432434,26.29816357309239,PraatF0,Praat (F0),harmonicity,#11A3FF,Stretched
3.2582582582582584,26.315512646084485,PraatF0,Praat (F0),harmonicity,#11A3FF,Stretched
3.2732732732732734,26.334477687821085,PraatF0,Praat (F0),harmonicity,#11A3FF,Stretched
3.2882882882882885,26.2164839462821,PraatF0,Praat (F0),harmonicity,#11A3FF,Stretched
3.3033033033033035,29.139978455750935,PraatF0,Praat (F0),harmonicity,#11A3FF,Stretched
3.3183183183183185,29.16023922414263,PraatF0,Praat (F0),harmonicity,#11A3FF,Stretched
3.3333333333333335,29.17696170315428,PraatF0,Praat (F0),harmonicity,#11A3FF,Stretched
3.3483483483483485,29.19302610926571,PraatF0,Praat (F0),harmonicity,#11A3FF,Stretched
3.3633633633633635,29.20721159656307,PraatF0,Praat (F0),harmonicity,#11A3FF,Stretched
3.3783783783783785,29.21432690295765,PraatF0,Praat (F0),harmonicity,#11A3FF,Stretched
3.3933933933933935,29.232439618296567,PraatF0,Praat (F0),harmonicity,#11A3FF,Stretched
3.4084084084084085,29.243475044226248,PraatF0,Praat (F0),harmonicity,#11A3FF,Stretched
3.4234234234234235,10.989957004640239,PraatF0,Praat (F0),harmonicity,#11A3FF,Stretched
3.4384384384384385,10.992947370258621,PraatF0,Praat (F0),harmonicity,#11A3FF,Stretched
3.4534534534534536,10.996620515953188,PraatF0,Praat (F0),harmonicity,#11A3FF,Stretched
3.4684684684684686,11.000080222289455,PraatF0,Praat (F0),harmonicity,#11A3FF,Stretched
3.4834834834834836,14.592333206828801,PraatF0,Praat (F0),harmonicity,#11A3FF,Stretched
3.4984984984984986,11.412428598138053,PraatF0,Praat (F0),harmonicity,#11A3FF,Stretched
3.5135135135135136,11.421215258464354,PraatF0,Praat (F0),harmonicity,#11A3FF,Stretched
3.5285285285285286,11.429373387326448,PraatF0,Praat (F0),harmonicity,#11A3FF,Stretched
3.5435435435435436,11.436953615799997,PraatF0,Praat (F0),harmonicity,#11A3FF,Stretched
3.5585585585585586,11.444901041880183,PraatF0,Praat (F0),harmonicity,#11A3FF,Stretched
3.5735735735735736,32.31806858000112,PraatF0,Praat (F0),harmonicity,#11A3FF,Stretched
3.5885885885885886,32.32963207308332,PraatF0,Praat (F0),harmonicity,#11A3FF,Stretched
3.6036036036036037,32.341029347809574,PraatF0,Praat (F0),harmonicity,#11A3FF,Stretched
3.6186186186186187,32.352015314614704,PraatF0,Praat (F0),harmonicity,#11A3FF,Stretched
3.6336336336336337,32.36237048104779,PraatF0,Praat (F0),harmonicity,#11A3FF,Stretched
3.6486486486486487,32.371890046996626,PraatF0,Praat (F0),harmonicity,#11A3FF,Stretched
3.6636636636636637,32.38042735365825,PraatF0,Praat (F0),harmonicity,#11A3FF,Stretched
3.6786786786786787,32.38802154841592,PraatF0,Praat (F0),harmonicity,#11A3FF,Stretched
3.6936936936936937,32.395063286020246,PraatF0,Praat (F0),harmonicity,#11A3FF,Stretched
3.7087087087087087,32.40223111865801,PraatF0,Praat (F0),harmonicity,#11A3FF,Stretched
3.7237237237237237,20.191379989890443,PraatF0,Praat (F0),harmonicity,#11A3FF,Stretched
3.7387387387387387,16.25553720612919,PraatF0,Praat (F0),harmonicity,#11A3FF,Stretched
3.7537537537537538,16.26471953315209,PraatF0,Praat (F0),harmonicity,#11A3FF,Stretched
3.7687687687687688,16.27334366554676,PraatF0,Praat (F0),harmonicity,#11A3FF,Stretched
3.7837837837837838,16.28181791768299,PraatF0,Praat (F0),harmonicity,#11A3FF,Stretched
3.798798798798799,16.290459908702104,PraatF0,Praat (F0),harmonicity,#11A3FF,Stretched
3.813813813813814,32.7154509320616,PraatF0,Praat (F0),harmonicity,#11A3FF,Stretched
3.828828828828829,32.727306770518155,PraatF0,Praat (F0),harmonicity,#11A3FF,Stretched
3.843843843843844,32.73790240760865,PraatF0,Praat (F0),harmonicity,#11A3FF,Stretched
3.858858858858859,32.74720010200503,PraatF0,Praat (F0),harmonicity,#11A3FF,Stretched
3.873873873873874,32.755305475295664,PraatF0,Praat (F0),harmonicity,#11A3FF,Stretched
3.888888888888889,32.76261778578777,PraatF0,Praat (F0),harmonicity,#11A3FF,Stretched
3.903903903903904,32.7698457667868,PraatF0,Praat (F0),harmonicity,#11A3FF,Stretched
3.918918918918919,36.66176948343382,PraatF0,Praat (F0),harmonicity,#11A3FF,Stretched
3.933933933933934,36.6826952070881,PraatF0,Praat (F0),harmonicity,#11A3FF,Stretched
3.948948948948949,36.70391243030633,PraatF0,Praat (F0),harmonicity,#11A3FF,Stretched
3.963963963963964,36.72592641958376,PraatF0,Praat (F0),harmonicity,#11A3FF,Stretched
3.978978978978979,36.74948137121684,PraatF0,Praat (F0),harmonicity,#11A3FF,Stretched
3.993993993993994,10.991115898696272,PraatF0,Praat (F0),harmonicity,#11A3FF,Stretched
4.009009009009009,10.99491679971173,PraatF0,Praat (F0),harmonicity,#11A3FF,Stretched
4.024024024024024,21.81130819915481,PraatF0,Praat (F0),harmonicity,#11A3FF,Stretched
4.039039039039039,21.822058584542486,PraatF0,Praat (F0),harmonicity,#11A3FF,Stretched
4.054054054054054,21.83207489446189,PraatF0,Praat (F0),harmonicity,#11A3FF,Stretched
4.069069069069069,36.97336370472645,PraatF0,Praat (F0),harmonicity,#11A3FF,Stretched
4.084084084084084,37.006156264555045,PraatF0,Praat (F0),harmonicity,#11A3FF,Stretched
4.099099099099099,11.425421225033467,PraatF0,Praat (F0),harmonicity,#11A3FF,Stretched
4.114114114114114,37.058219395334355,PraatF0,Praat (F0),harmonicity,#11A3FF,Stretched
4.129129129129129,11.436482584235705,PraatF0,Praat (F0),harmonicity,#11A3FF,Stretched
4.1441441441441444,37.102375421005846,PraatF0,Praat (F0),harmonicity,#11A3FF,Stretched
4.1591591591591595,37.12634024956917,PraatF0,Praat (F0),harmonicity,#11A3FF,Stretched
4.1741741741741745,37.14928026771911,PraatF0,Praat (F0),harmonicity,#11A3FF,Stretched
4.1891891891891895,36.931424770630194,PraatF0,Praat (F0),harmonicity,#11A3FF,Stretched
4.2042042042042045,11.884846479020622,PraatF0,Praat (F0),harmonicity,#11A3FF,Stretched
4.2192192192192195,11.893770458638585,PraatF0,Praat (F0),harmonicity,#11A3FF,Stretched
4.2342342342342345,11.905872923903775,PraatF0,Praat (F0),harmonicity,#11A3FF,Stretched
4.2492492492492495,11.917828520725031,PraatF0,Praat (F0),harmonicity,#11A3FF,Stretched
4.2642642642642645,11.926589123448313,PraatF0,Praat (F0),harmonicity,#11A3FF,Stretched
4.2792792792792795,11.934308567534005,PraatF0,Praat (F0),harmonicity,#11A3FF,Stretched
4.2942942942942945,11.942099983852316,PraatF0,Praat (F0),harmonicity,#11A3FF,Stretched
4.3093093093093096,11.951043391289115,PraatF0,Praat (F0),harmonicity,#11A3FF,Stretched
4.324324324324325,36.99541645025761,PraatF0,Praat (F0),harmonicity,#11A3FF,Stretched
4.33933933933934,37.02272621824356,PraatF0,Praat (F0),harmonicity,#11A3FF,Stretched
4.354354354354355,15.346780996995335,PraatF0,Praat (F0),harmonicity,#11A3FF,Stretched
4.36936936936937,15.35666452832822,PraatF0,Praat (F0),harmonicity,#11A3FF,Stretched
4.384384384384385,37.089908546291916,PraatF0,Praat (F0),harmonicity,#11A3FF,Stretched
4.3993993993994,12.431390215953545,PraatF0,Praat (F0),harmonicity,#11A3FF,Stretched
4.414414414414415,26.11063941821381,PraatF0,Praat (F0),harmonicity,#11A3FF,Stretched
4.42942942942943,26.130286740624772,PraatF0,Praat (F0),harmonicity,#11A3FF,Stretched
4.444444444444445,26.15020420293505,PraatF0,Praat (F0),harmonicity,#11A3FF,Stretched
4.45945945945946,26.170360987107998,PraatF0,Praat (F0),harmonicity,#11A3FF,Stretched
4.474474474474475,26.190444381675896,PraatF0,Praat (F0),harmonicity,#11A3FF,Stretched
4.48948948948949,26.21005740516693,PraatF0,Praat (F0),harmonicity,#11A3FF,Stretched
4.504504504504505,26.228962078119025,PraatF0,Praat (F0),harmonicity,#11A3FF,Stretched
4.51951951951952,26.247156226843238,PraatF0,Praat (F0),harmonicity,#11A3FF,Stretched
4.534534534534535,26.26481266295935,PraatF0,Praat (F0),harmonicity,#11A3FF,Stretched
4.54954954954955,26.28222609672329,PraatF0,Praat (F0),harmonicity,#11A3FF,Stretched
4.564564564564565,16.27110075470031,PraatF0,Praat (F0),harmonicity,#11A3FF,Stretched
4.57957957957958,16.278443376485484,PraatF0,Praat (F0),harmonicity,#11A3FF,Stretched
4.594594594594595,16.285000647659565,PraatF0,Praat (F0),harmonicity,#11A3FF,Stretched
4.60960960960961,42.716630185393264,PraatF0,Praat (F0),harmonicity,#11A3FF,Stretched
4.624624624624625,16.26081022502234,PraatF0,Praat (F0),harmonicity,#11A3FF,Stretched
4.63963963963964,16.265058735391545,PraatF0,Praat (F0),harmonicity,#11A3FF,Stretched
4.654654654654655,16.27133133164642,PraatF0,Praat (F0),harmonicity,#11A3FF,Stretched
4.66966966966967,11.427056480429332,PraatF0,Praat (F0),harmonicity,#11A3FF,Stretched
4.684684684684685,11.432190702458186,PraatF0,Praat (F0),harmonicity,#11A3FF,Stretched
4.6996996996997,11.439398230838606,PraatF0,Praat (F0),harmonicity,#11A3FF,Stretched
4.714714714714715,42.50862020648259,PraatF0,Praat (F0),harmonicity,#11A3FF,Stretched
4.72972972972973,17.203932586422056,PraatF0,Praat (F0),harmonicity,#11A3FF,Stretched
4.744744744744745,20.21183216498889,PraatF0,Praat (F0),harmonicity,#11A3FF,Stretched
4.75975975975976,28.747593985779325,PraatF0,Praat (F0),harmonicity,#11A3FF,Stretched
4.774774774774775,28.765407181368296,PraatF0,Praat (F0),harmonicity,#11A3FF,Stretched
4.78978978978979,28.783558573963795,PraatF0,Praat (F0),harmonicity,#11A3FF,Stretched
4.804804804804805,17.278639369879343,PraatF0,Praat (F0),harmonicity,#11A3FF,Stretched
4.81981981981982,28.821939355677465,PraatF0,Praat (F0),harmonicity,#11A3FF,Stretched
4.834834834834835,11.921763956892212,PraatF0,Praat (F0),harmonicity,#11A3FF,Stretched
4.84984984984985,11.927657248064932,PraatF0,Praat (F0),harmonicity,#11A3FF,Stretched
4.864864864864865,11.933046748548339,PraatF0,Praat (F0),harmonicity,#11A3FF,Stretched
4.87987987987988,11.938193508488556,PraatF0,Praat (F0),harmonicity,#11A3FF,Stretched
4.894894894894895,11.943307472639836,PraatF0,Praat (F0),harmonicity,#11A3FF,Stretched
4.90990990990991,20.222410712391326,PraatF0,Praat (F0),harmonicity,#11A3FF,Stretched
4.924924924924925,20.23206277387071,PraatF0,Praat (F0),harmonicity,#11A3FF,Stretched
4.93993993993994,29.037369369278395,PraatF0,Praat (F0),harmonicity,#11A3FF,Stretched
4.954954954954955,12.41571377256549,PraatF0,Praat (F0),harmonicity,#11A3FF,Stretched
4.96996996996997,12.424486918528835,PraatF0,Praat (F0),harmonicity,#11A3FF,Stretched
4.984984984984985,12.432916057685079,PraatF0,Praat (F0),harmonicity,#11A3FF,Stretched
5,12.44138309591489,PraatF0,Praat (F0),harmonicity,#11A3FF,Stretched
5.015015015015015,29.172365500250393,PraatF0,Praat (F0),harmonicity,#11A3FF,Stretched
5.03003003003003,29.19161551873607,PraatF0,Praat (F0),harmonicity,#11A3FF,Stretched
5.045045045045045,29.209669321928637,PraatF0,Praat (F0),harmonicity,#11A3FF,Stretched
5.06006006006006,29.226968026831543,PraatF0,Praat (F0),harmonicity,#11A3FF,Stretched
5.075075075075075,12.497574787680083,PraatF0,Praat (F0),harmonicity,#11A3FF,Stretched
5.09009009009009,12.505487777684602,PraatF0,Praat (F0),harmonicity,#11A3FF,Stretched
5.105105105105105,21.84317279079101,PraatF0,Praat (F0),harmonicity,#11A3FF,Stretched
5.12012012012012,21.85722607901084,PraatF0,Praat (F0),harmonicity,#11A3FF,Stretched
5.135135135135135,32.355740675756294,PraatF0,Praat (F0),harmonicity,#11A3FF,Stretched
5.15015015015015,32.369403064922025,PraatF0,Praat (F0),harmonicity,#11A3FF,Stretched
5.165165165165165,17.645272993963175,PraatF0,Praat (F0),harmonicity,#11A3FF,Stretched
5.18018018018018,17.658237025249292,PraatF0,Praat (F0),harmonicity,#11A3FF,Stretched
5.195195195195195,17.670433228205752,PraatF0,Praat (F0),harmonicity,#11A3FF,Stretched
5.21021021021021,17.682292336256175,PraatF0,Praat (F0),harmonicity,#11A3FF,Stretched
5.225225225225225,13.089976141887362,PraatF0,Praat (F0),harmonicity,#11A3FF,Stretched
5.24024024024024,13.095762852842228,PraatF0,Praat (F0),harmonicity,#11A3FF,Stretched
5.255255255255255,13.06598697307135,PraatF0,Praat (F0),harmonicity,#11A3FF,Stretched
5.27027027027027,13.078146801975215,PraatF0,Praat (F0),harmonicity,#11A3FF,Stretched
5.285285285285285,13.085737288489575,PraatF0,Praat (F0),harmonicity,#11A3FF,Stretched
5.3003003003003,13.091696650119683,PraatF0,Praat (F0),harmonicity,#11A3FF,Stretched
5.315315315315315,13.09663356376023,PraatF0,Praat (F0),harmonicity,#11A3FF,Stretched
5.33033033033033,13.097146220892023,PraatF0,Praat (F0),harmonicity,#11A3FF,Stretched
5.345345345345345,38.63441604102303,PraatF0,Praat (F0),harmonicity,#11A3FF,Stretched
5.36036036036036,16.266524113867106,PraatF0,Praat (F0),harmonicity,#11A3FF,Stretched
5.375375375375375,16.273496678785044,PraatF0,Praat (F0),harmonicity,#11A3FF,Stretched
5.39039039039039,16.28045162991905,PraatF0,Praat (F0),harmonicity,#11A3FF,Stretched
5.405405405405405,11.924149624312136,PraatF0,Praat (F0),harmonicity,#11A3FF,Stretched
5.42042042042042,11.930009058710704,PraatF0,Praat (F0),harmonicity,#11A3FF,Stretched
5.435435435435435,11.936932610687851,PraatF0,Praat (F0),harmonicity,#11A3FF,Stretched
5.45045045045045,11.944722675044677,PraatF0,Praat (F0),harmonicity,#11A3FF,Stretched
5.465465465465465,32.40356542659539,PraatF0,Praat (F0),harmonicity,#11A3FF,Stretched
5.48048048048048,44.444306964346346,PraatF0,Praat (F0),harmonicity,#11A3FF,Stretched
5.495495495495495,44.47519030083209,PraatF0,Praat (F0),harmonicity,#11A3FF,Stretched
5.51051051051051,44.50549813136786,PraatF0,Praat (F0),harmonicity,#11A3FF,Stretched
5.525525525525525,44.535523785289854,PraatF0,Praat (F0),harmonicity,#11A3FF,Stretched
5.54054054054054,44.56546135491726,PraatF0,Praat (F0),harmonicity,#11A3FF,Stretched
5.555555555555555,12.427401387158,PraatF0,Praat (F0),harmonicity,#11A3FF,Stretched
5.57057057057057,12.433430400196016,PraatF0,Praat (F0),harmonicity,#11A3FF,Stretched
5.585585585585585,12.439627398453926,PraatF0,Praat (F0),harmonicity,#11A3FF,Stretched
5.6006006006006,12.446122548651628,PraatF0,Praat (F0),harmonicity,#11A3FF,Stretched
5.615615615615615,26.189374318858867,PraatF0,Praat (F0),harmonicity,#11A3FF,Stretched
5.63063063063063,26.207554934502568,PraatF0,Praat (F0),harmonicity,#11A3FF,Stretched
5.645645645645645,12.492223359558565,PraatF0,Praat (F0),harmonicity,#11A3FF,Stretched
5.66066066066066,12.497855871433584,PraatF0,Praat (F0),harmonicity,#11A3FF,Stretched
5.675675675675675,12.503226434251982,PraatF0,Praat (F0),harmonicity,#11A3FF,Stretched
5.6906906906906904,12.508726714271418,PraatF0,Praat (F0),harmonicity,#11A3FF,Stretched
5.7057057057057055,26.275981113061942,PraatF0,Praat (F0),harmonicity,#11A3FF,Stretched
5.7207207207207205,26.281838921619705,PraatF0,Praat (F0),harmonicity,#11A3FF,Stretched
5.7357357357357355,36.611611248174846,PraatF0,Praat (F0),harmonicity,#11A3FF,Stretched
5.7507507507507505,36.63053471044975,PraatF0,Praat (F0),harmonicity,#11A3FF,Stretched
5.7657657657657655,36.64882843217666,PraatF0,Praat (F0),harmonicity,#11A3FF,Stretched
5.7807807807807805,36.66674086428331,PraatF0,Praat (F0),harmonicity,#11A3FF,Stretched
5.7957957957957955,13.030328103084042,PraatF0,Praat (F0),harmonicity,#11A3FF,Stretched
5.8108108108108105,13.039109816302512,PraatF0,Praat (F0),harmonicity,#11A3FF,Stretched
5.8258258258258255,13.049894966657597,PraatF0,Praat (F0),harmonicity,#11A3FF,Stretched
5.8408408408408405,13.065977531798875,PraatF0,Praat (F0),harmonicity,#11A3FF,Stretched
5.8558558558558556,13.078433197407303,PraatF0,Praat (F0),harmonicity,#11A3FF,Stretched
5.870870870870871,13.086682535321675,PraatF0,Praat (F0),harmonicity,#11A3FF,Stretched
5.885885885885886,13.094159685715656,PraatF0,Praat (F0),harmonicity,#11A3FF,Stretched
5.900900900900901,13.101672095903709,PraatF0,Praat (F0),harmonicity,#11A3FF,Stretched
5.915915915915916,11.927104833017022,PraatF0,Praat (F0),harmonicity,#11A3FF,Stretched
5.930930930930931,11.934831511774272,PraatF0,Praat (F0),harmonicity,#11A3FF,Stretched
5.945945945945946,11.942408952622213,PraatF0,Praat (F0),harmonicity,#11A3FF,Stretched
5.960960960960961,37.036434889875636,PraatF0,Praat (F0),harmonicity,#11A3FF,Stretched
5.975975975975976,37.05936228992472,PraatF0,Praat (F0),harmonicity,#11A3FF,Stretched
5.990990990990991,37.080224662669536,PraatF0,Praat (F0),harmonicity,#11A3FF,Stretched
6.006006006006006,37.09950596630641,PraatF0,Praat (F0),harmonicity,#11A3FF,Stretched
6.021021021021021,37.11751094315846,PraatF0,Praat (F0),harmonicity,#11A3FF,Stretched
6.036036036036036,37.13445198017102,PraatF0,Praat (F0),harmonicity,#11A3FF,Stretched
6.051051051051051,37.150603422523055,PraatF0,Praat (F0),harmonicity,#11A3FF,Stretched
6.066066066066066,13.687693310074494,PraatF0,Praat (F0),harmonicity,#11A3FF,Stretched
6.081081081081081,28.74524615739276,PraatF0,Praat (F0),harmonicity,#11A3FF,Stretched
6.096096096096096,28.763713321339218,PraatF0,Praat (F0),harmonicity,#11A3FF,Stretched
6.111111111111111,28.78245226812714,PraatF0,Praat (F0),harmonicity,#11A3FF,Stretched
6.126126126126126,28.801737338150996,PraatF0,Praat (F0),harmonicity,#11A3FF,Stretched
6.141141141141141,28.821855954054904,PraatF0,Praat (F0),harmonicity,#11A3FF,Stretched
6.156156156156156,28.843346997774773,PraatF0,Praat (F0),harmonicity,#11A3FF,Stretched
6.171171171171171,28.86631914264371,PraatF0,Praat (F0),harmonicity,#11A3FF,Stretched
6.186186186186186,28.8905442379301,PraatF0,Praat (F0),harmonicity,#11A3FF,Stretched
6.201201201201201,12.498309436881936,PraatF0,Praat (F0),harmonicity,#11A3FF,Stretched
6.216216216216216,12.49446124673291,PraatF0,Praat (F0),harmonicity,#11A3FF,Stretched
6.231231231231231,12.500695400898751,PraatF0,Praat (F0),harmonicity,#11A3FF,Stretched
6.246246246246246,18.778294858550282,PraatF0,Praat (F0),harmonicity,#11A3FF,Stretched
6.261261261261261,18.791775502072483,PraatF0,Praat (F0),harmonicity,#11A3FF,Stretched
6.276276276276276,18.807343223537316,PraatF0,Praat (F0),harmonicity,#11A3FF,Stretched
6.291291291291291,18.824732991165153,PraatF0,Praat (F0),harmonicity,#11A3FF,Stretched
6.306306306306306,29.12329487104274,PraatF0,Praat (F0),harmonicity,#11A3FF,Stretched
6.321321321321321,29.147981838753065,PraatF0,Praat (F0),harmonicity,#11A3FF,Stretched
6.336336336336336,29.169987211942775,PraatF0,Praat (F0),harmonicity,#11A3FF,Stretched
6.351351351351351,29.18996414908269,PraatF0,Praat (F0),harmonicity,#11A3FF,Stretched
6.366366366366366,29.208727248336636,PraatF0,Praat (F0),harmonicity,#11A3FF,Stretched
6.381381381381381,29.22671681259431,PraatF0,Praat (F0),harmonicity,#11A3FF,Stretched
6.396396396396396,29.244249026934867,PraatF0,Praat (F0),harmonicity,#11A3FF,Stretched
6.411411411411412,13.090672273615823,PraatF0,Praat (F0),harmonicity,#11A3FF,Stretched
6.426426426426427,13.091617394052356,PraatF0,Praat (F0),harmonicity,#11A3FF,Stretched
6.441441441441442,13.083196498158033,PraatF0,Praat (F0),harmonicity,#11A3FF,Stretched
6.456456456456457,13.08782200527979,PraatF0,Praat (F0),harmonicity,#11A3FF,Stretched
6.471471471471472,13.092580593772015,PraatF0,Praat (F0),harmonicity,#11A3FF,Stretched
6.486486486486487,13.096956386886283,PraatF0,Praat (F0),harmonicity,#11A3FF,Stretched
6.501501501501502,13.10056552768516,PraatF0,Praat (F0),harmonicity,#11A3FF,Stretched
6.516516516516517,11.922102734738893,PraatF0,Praat (F0),harmonicity,#11A3FF,Stretched
6.531531531531532,11.930216686567174,PraatF0,Praat (F0),harmonicity,#11A3FF,Stretched
6.546546546546547,11.937818012379896,PraatF0,Praat (F0),harmonicity,#11A3FF,Stretched
6.561561561561562,42.68516413252815,PraatF0,Praat (F0),harmonicity,#11A3FF,Stretched
6.576576576576577,42.71602481839712,PraatF0,Praat (F0),harmonicity,#11A3FF,Stretched
6.591591591591592,42.745564479509966,PraatF0,Praat (F0),harmonicity,#11A3FF,Stretched
6.606606606606607,42.78060263871514,PraatF0,Praat (F0),harmonicity,#11A3FF,Stretched
6.621621621621622,12.426431020158923,PraatF0,Praat (F0),harmonicity,#11A3FF,Stretched
6.636636636636637,13.680370526169003,PraatF0,Praat (F0),harmonicity,#11A3FF,Stretched
6.651651651651652,13.689426721845765,PraatF0,Praat (F0),harmonicity,#11A3FF,Stretched
6.666666666666667,13.700061852867591,PraatF0,Praat (F0),harmonicity,#11A3FF,Stretched
6.681681681681682,13.712301069437746,PraatF0,Praat (F0),harmonicity,#11A3FF,Stretched
6.696696696696697,13.723783450669377,PraatF0,Praat (F0),harmonicity,#11A3FF,Stretched
6.711711711711712,13.733805985254627,PraatF0,Praat (F0),harmonicity,#11A3FF,Stretched
6.726726726726727,20.22170224068313,PraatF0,Praat (F0),harmonicity,#11A3FF,Stretched
6.741741741741742,20.21983167016746,PraatF0,Praat (F0),harmonicity,#11A3FF,Stretched
6.756756756756757,20.22671554476207,PraatF0,Praat (F0),harmonicity,#11A3FF,Stretched
6.771771771771772,20.237028067026742,PraatF0,Praat (F0),harmonicity,#11A3FF,Stretched
6.786786786786787,32.32171031036813,PraatF0,Praat (F0),harmonicity,#11A3FF,Stretched
6.801801801801802,32.339940909804355,PraatF0,Praat (F0),harmonicity,#11A3FF,Stretched
6.816816816816817,32.35836815659286,PraatF0,Praat (F0),harmonicity,#11A3FF,Stretched
6.831831831831832,32.37716070570849,PraatF0,Praat (F0),harmonicity,#11A3FF,Stretched
6.846846846846847,32.396592759187456,PraatF0,Praat (F0),harmonicity,#11A3FF,Stretched
6.861861861861862,32.41718443885044,PraatF0,Praat (F0),harmonicity,#11A3FF,Stretched
6.876876876876877,32.4400418636275,PraatF0,Praat (F0),harmonicity,#11A3FF,Stretched
6.891891891891892,32.46766038677474,PraatF0,Praat (F0),harmonicity,#11A3FF,Stretched
6.906906906906907,32.50440395535351,PraatF0,Praat (F0),harmonicity,#11A3FF,Stretched
6.921921921921922,32.550736342446754,PraatF0,Praat (F0),harmonicity,#11A3FF,Stretched
6.936936936936937,32.59606293526096,PraatF0,Praat (F0),harmonicity,#11A3FF,Stretched
6.951951951951952,32.6316213053384,PraatF0,Praat (F0),harmonicity,#11A3FF,Stretched
6.966966966966967,13.081003418449956,PraatF0,Praat (F0),harmonicity,#11A3FF,Stretched
6.981981981981982,13.086670154516202,PraatF0,Praat (F0),harmonicity,#11A3FF,Stretched
6.996996996996997,13.090142906523969,PraatF0,Praat (F0),harmonicity,#11A3FF,Stretched
7.012012012012012,13.085627925605829,PraatF0,Praat (F0),harmonicity,#11A3FF,Stretched
7.027027027027027,13.090000986643293,PraatF0,Praat (F0),harmonicity,#11A3FF,Stretched
7.042042042042042,13.096600658098058,PraatF0,Praat (F0),harmonicity,#11A3FF,Stretched
7.057057057057057,13.104349691152828,PraatF0,Praat (F0),harmonicity,#11A3FF,Stretched
7.072072072072072,32.8059822694682,PraatF0,Praat (F0),harmonicity,#11A3FF,Stretched
7.087087087087087,21.819972050542894,PraatF0,Praat (F0),harmonicity,#11A3FF,Stretched
7.102102102102102,21.823602941061445,PraatF0,Praat (F0),harmonicity,#11A3FF,Stretched
7.117117117117117,21.8263755548108,PraatF0,Praat (F0),harmonicity,#11A3FF,Stretched
7.132132132132132,21.830887932287403,PraatF0,Praat (F0),harmonicity,#11A3FF,Stretched
7.147147147147147,17.27617861026527,PraatF0,Praat (F0),harmonicity,#11A3FF,Stretched
7.162162162162162,17.284926872257984,PraatF0,Praat (F0),harmonicity,#11A3FF,Stretched
7.177177177177177,18.921804137586122,PraatF0,Praat (F0),harmonicity,#11A3FF,Stretched
7.192192192192192,26.18667690088562,PraatF0,Praat (F0),harmonicity,#11A3FF,Stretched
7.207207207207207,21.81979423666742,PraatF0,Praat (F0),harmonicity,#11A3FF,Stretched
7.222222222222222,13.683422378155726,PraatF0,Praat (F0),harmonicity,#11A3FF,Stretched
7.237237237237237,13.690147267999517,PraatF0,Praat (F0),harmonicity,#11A3FF,Stretched
7.252252252252252,13.699227523014624,PraatF0,Praat (F0),harmonicity,#11A3FF,Stretched
7.267267267267267,13.711981410363732,PraatF0,Praat (F0),harmonicity,#11A3FF,Stretched
7.282282282282282,13.723025806795484,PraatF0,Praat (F0),harmonicity,#11A3FF,Stretched
7.297297297297297,13.731159677387428,PraatF0,Praat (F0),harmonicity,#11A3FF,Stretched
7.312312312312312,13.738146999695608,PraatF0,Praat (F0),harmonicity,#11A3FF,Stretched
7.327327327327327,12.493202106378819,PraatF0,Praat (F0),harmonicity,#11A3FF,Stretched
7.342342342342342,12.501227176640066,PraatF0,Praat (F0),harmonicity,#11A3FF,Stretched
7.357357357357357,12.50927459377004,PraatF0,Praat (F0),harmonicity,#11A3FF,Stretched
7.372372372372372,36.78869769282858,PraatF0,Praat (F0),harmonicity,#11A3FF,Stretched
7.387387387387387,36.820575007703,PraatF0,Praat (F0),harmonicity,#11A3FF,Stretched
7.402402402402402,11.42250401144041,PraatF0,Praat (F0),harmonicity,#11A3FF,Stretched
7.4174174174174174,11.431020996113816,PraatF0,Praat (F0),harmonicity,#11A3FF,Stretched
7.4324324324324325,11.438942595625086,PraatF0,Praat (F0),harmonicity,#11A3FF,Stretched
7.4474474474474475,28.846355610785267,PraatF0,Praat (F0),harmonicity,#11A3FF,Stretched
7.4624624624624625,13.039601118342345,PraatF0,Praat (F0),harmonicity,#11A3FF,Stretched
7.4774774774774775,20.17487816953518,PraatF0,Praat (F0),harmonicity,#11A3FF,Stretched
7.4924924924924925,20.18945892353947,PraatF0,Praat (F0),harmonicity,#11A3FF,Stretched
7.5075075075075075,20.20052631143678,PraatF0,Praat (F0),harmonicity,#11A3FF,Stretched
7.5225225225225225,20.21494428634825,PraatF0,Praat (F0),harmonicity,#11A3FF,Stretched
7.5375375375375375,16.661923161226156,PraatF0,Praat (F0),harmonicity,#11A3FF,Stretched
7.5525525525525525,20.242145646936493,PraatF0,Praat (F0),harmonicity,#11A3FF,Stretched
7.5675675675675675,20.256790094985547,PraatF0,Praat (F0),harmonicity,#11A3FF,Stretched
7.5825825825825826,20.277351235322875,PraatF0,Praat (F0),harmonicity,#11A3FF,Stretched
7.597597597597598,13.770442315786307,PraatF0,Praat (F0),harmonicity,#11A3FF,Stretched
7.612612612612613,13.08942420326078,PraatF0,Praat (F0),harmonicity,#11A3FF,Stretched
7.627627627627628,13.789316544895069,PraatF0,Praat (F0),harmonicity,#11A3FF,Stretched
7.642642642642643,20.354952174156026,PraatF0,Praat (F0),harmonicity,#11A3FF,Stretched
7.657657657657658,20.36791931874917,PraatF0,Praat (F0),harmonicity,#11A3FF,Stretched
7.672672672672673,50.40856740335366,PraatF0,Praat (F0),harmonicity,#11A3FF,Stretched
7.687687687687688,50.447209814897974,PraatF0,Praat (F0),harmonicity,#11A3FF,Stretched
7.702702702702703,50.48559209316009,PraatF0,Praat (F0),harmonicity,#11A3FF,Stretched
7.717717717717718,11.928819128174888,PraatF0,Praat (F0),harmonicity,#11A3FF,Stretched
7.732732732732733,11.937059116792726,PraatF0,Praat (F0),harmonicity,#11A3FF,Stretched
7.747747747747748,14.58524203151843,PraatF0,Praat (F0),harmonicity,#11A3FF,Stretched
7.762762762762763,14.595360876651121,PraatF0,Praat (F0),harmonicity,#11A3FF,Stretched
7.777777777777778,14.605723446674833,PraatF0,Praat (F0),harmonicity,#11A3FF,Stretched
7.792792792792793,13.685841288264584,PraatF0,Praat (F0),harmonicity,#11A3FF,Stretched
7.807807807807808,13.693848741754971,PraatF0,Praat (F0),harmonicity,#11A3FF,Stretched
7.822822822822823,13.705082424555556,PraatF0,Praat (F0),harmonicity,#11A3FF,Stretched
7.837837837837838,13.717526898707538,PraatF0,Praat (F0),harmonicity,#11A3FF,Stretched
7.852852852852853,13.727765398117173,PraatF0,Praat (F0),harmonicity,#11A3FF,Stretched
7.867867867867868,13.737030269641675,PraatF0,Praat (F0),harmonicity,#11A3FF,Stretched
7.882882882882883,11.434204857644945,PraatF0,Praat (F0),harmonicity,#11A3FF,Stretched
7.897897897897898,11.440684903332814,PraatF0,Praat (F0),harmonicity,#11A3FF,Stretched
7.912912912912913,11.435218302756077,PraatF0,Praat (F0),harmonicity,#11A3FF,Stretched
7.927927927927928,18.865741429759886,PraatF0,Praat (F0),harmonicity,#11A3FF,Stretched
7.942942942942943,18.883184248030975,PraatF0,Praat (F0),harmonicity,#11A3FF,Stretched
7.957957957957958,18.898830121311597,PraatF0,Praat (F0),harmonicity,#11A3FF,Stretched
7.972972972972973,18.913148369772614,PraatF0,Praat (F0),harmonicity,#11A3FF,Stretched
7.987987987987988,21.792116662104103,PraatF0,Praat (F0),harmonicity,#11A3FF,Stretched
8.003003003003004,21.804733042894778,PraatF0,Praat (F0),harmonicity,#11A3FF,Stretched
8.018018018018019,21.8156868046595,PraatF0,Praat (F0),harmonicity,#11A3FF,Stretched
8.033033033033034,21.82448538369089,PraatF0,Praat (F0),harmonicity,#11A3FF,Stretched
8.048048048048049,21.826882656788776,PraatF0,Praat (F0),harmonicity,#11A3FF,Stretched
8.063063063063064,21.824112551534235,PraatF0,Praat (F0),harmonicity,#11A3FF,Stretched
8.078078078078079,21.831753454271094,PraatF0,Praat (F0),harmonicity,#11A3FF,Stretched
8.093093093093094,21.843207465541582,PraatF0,Praat (F0),harmonicity,#11A3FF,Stretched
8.108108108108109,32.31896317575111,PraatF0,Praat (F0),harmonicity,#11A3FF,Stretched
8.123123123123124,32.33807987293504,PraatF0,Praat (F0),harmonicity,#11A3FF,Stretched
8.138138138138139,32.357285841043364,PraatF0,Praat (F0),harmonicity,#11A3FF,Stretched
8.153153153153154,32.376826094215915,PraatF0,Praat (F0),harmonicity,#11A3FF,Stretched
8.168168168168169,32.39704065124948,PraatF0,Praat (F0),harmonicity,#11A3FF,Stretched
8.183183183183184,32.41850469578836,PraatF0,Praat (F0),harmonicity,#11A3FF,Stretched
8.198198198198199,32.44230968899399,PraatF0,Praat (F0),harmonicity,#11A3FF,Stretched
8.213213213213214,26.156185119093955,PraatF0,Praat (F0),harmonicity,#11A3FF,Stretched
8.228228228228229,26.1774362031911,PraatF0,Praat (F0),harmonicity,#11A3FF,Stretched
8.243243243243244,26.198531034397263,PraatF0,Praat (F0),harmonicity,#11A3FF,Stretched
8.258258258258259,26.219209695104873,PraatF0,Praat (F0),harmonicity,#11A3FF,Stretched
8.273273273273274,26.239350533714934,PraatF0,Praat (F0),harmonicity,#11A3FF,Stretched
8.288288288288289,26.25902287355182,PraatF0,Praat (F0),harmonicity,#11A3FF,Stretched
8.303303303303304,26.278445969439076,PraatF0,Praat (F0),harmonicity,#11A3FF,Stretched
8.318318318318319,20.213405076557358,PraatF0,Praat (F0),harmonicity,#11A3FF,Stretched
8.333333333333334,32.72296665750076,PraatF0,Praat (F0),harmonicity,#11A3FF,Stretched
8.348348348348349,32.743683027693315,PraatF0,Praat (F0),harmonicity,#11A3FF,Stretched
8.363363363363364,32.764473418275685,PraatF0,Praat (F0),harmonicity,#11A3FF,Stretched
8.378378378378379,32.78580230707956,PraatF0,Praat (F0),harmonicity,#11A3FF,Stretched
8.393393393393394,20.205598547103627,PraatF0,Praat (F0),harmonicity,#11A3FF,Stretched
8.408408408408409,20.21569629289027,PraatF0,Praat (F0),harmonicity,#11A3FF,Stretched
8.423423423423424,20.22608698573086,PraatF0,Praat (F0),harmonicity,#11A3FF,Stretched
8.438438438438439,20.236994744900436,PraatF0,Praat (F0),harmonicity,#11A3FF,Stretched
8.453453453453454,42.739902773643436,PraatF0,Praat (F0),harmonicity,#11A3FF,Stretched
8.468468468468469,42.76650756783313,PraatF0,Praat (F0),harmonicity,#11A3FF,Stretched
8.483483483483484,42.79233168028958,PraatF0,Praat (F0),harmonicity,#11A3FF,Stretched
8.498498498498499,15.229439217740076,PraatF0,Praat (F0),harmonicity,#11A3FF,Stretched
8.513513513513514,15.240153886165658,PraatF0,Praat (F0),harmonicity,#11A3FF,Stretched
8.528528528528529,42.86841016639886,PraatF0,Praat (F0),harmonicity,#11A3FF,Stretched
8.543543543543544,42.894975238266355,PraatF0,Praat (F0),harmonicity,#11A3FF,Stretched
8.558558558558559,10.00659309479002,PraatF0,Praat (F0),harmonicity,#11A3FF,Stretched
8.573573573573574,10.015322536269895,PraatF0,Praat (F0),harmonicity,#11A3FF,Stretched
8.588588588588589,18.775501911556677,PraatF0,Praat (F0),harmonicity,#11A3FF,Stretched
8.603603603603604,11.923744058645571,PraatF0,Praat (F0),harmonicity,#11A3FF,Stretched
8.618618618618619,13.083326591836265,PraatF0,Praat (F0),harmonicity,#11A3FF,Stretched
8.633633633633634,13.090086127627806,PraatF0,Praat (F0),harmonicity,#11A3FF,Stretched
8.64864864864865,15.361247889309265,PraatF0,Praat (F0),harmonicity,#11A3FF,Stretched
8.663663663663664,15.373479862863306,PraatF0,Praat (F0),harmonicity,#11A3FF,Stretched
8.67867867867868,15.385737063708518,PraatF0,Praat (F0),harmonicity,#11A3FF,Stretched
8.693693693693694,13.088574605265705,PraatF0,Praat (F0),harmonicity,#11A3FF,Stretched
8.70870870870871,13.095462372397797,PraatF0,Praat (F0),harmonicity,#11A3FF,Stretched
8.723723723723724,15.428633738631397,PraatF0,Praat (F0),harmonicity,#11A3FF,Stretched
8.73873873873874,15.440478684524113,PraatF0,Praat (F0),harmonicity,#11A3FF,Stretched
8.753753753753754,21.702569875111802,PraatF0,Praat (F0),harmonicity,#11A3FF,Stretched
8.76876876876877,21.72448519816296,PraatF0,Praat (F0),harmonicity,#11A3FF,Stretched
8.783783783783784,21.749301938536128,PraatF0,Praat (F0),harmonicity,#11A3FF,Stretched
8.7987987987988,21.77156294525578,PraatF0,Praat (F0),harmonicity,#11A3FF,Stretched
8.813813813813814,21.789587340648882,PraatF0,Praat (F0),harmonicity,#11A3FF,Stretched
8.82882882882883,21.80514833594341,PraatF0,Praat (F0),harmonicity,#11A3FF,Stretched
8.843843843843844,21.819679447890874,PraatF0,Praat (F0),harmonicity,#11A3FF,Stretched
8.85885885885886,21.833977455446686,PraatF0,Praat (F0),harmonicity,#11A3FF,Stretched
8.873873873873874,21.848702611770875,PraatF0,Praat (F0),harmonicity,#11A3FF,Stretched
8.88888888888889,21.864897021660553,PraatF0,Praat (F0),harmonicity,#11A3FF,Stretched
8.903903903903904,21.884450986539658,PraatF0,Praat (F0),harmonicity,#11A3FF,Stretched
8.91891891891892,13.69412073619557,PraatF0,Praat (F0),harmonicity,#11A3FF,Stretched
8.933933933933934,13.705674149411006,PraatF0,Praat (F0),harmonicity,#11A3FF,Stretched
8.94894894894895,13.717864482547062,PraatF0,Praat (F0),harmonicity,#11A3FF,Stretched
8.963963963963964,36.64452024476475,PraatF0,Praat (F0),harmonicity,#11A3FF,Stretched
8.97897897897898,36.669495880187185,PraatF0,Praat (F0),harmonicity,#11A3FF,Stretched
8.993993993993994,36.694857032757554,PraatF0,Praat (F0),harmonicity,#11A3FF,Stretched
9.00900900900901,36.721053735205786,PraatF0,Praat (F0),harmonicity,#11A3FF,Stretched
9.024024024024024,36.74859153521656,PraatF0,Praat (F0),harmonicity,#11A3FF,Stretched
9.03903903903904,36.77807042242172,PraatF0,Praat (F0),harmonicity,#11A3FF,Stretched
9.054054054054054,16.266120649213093,PraatF0,Praat (F0),harmonicity,#11A3FF,Stretched
9.06906906906907,16.275037377223875,PraatF0,Praat (F0),harmonicity,#11A3FF,Stretched
9.084084084084084,36.88146665833446,PraatF0,Praat (F0),harmonicity,#11A3FF,Stretched
9.0990990990991,20.194180497145553,PraatF0,Praat (F0),harmonicity,#11A3FF,Stretched
9.114114114114114,20.206069596663085,PraatF0,Praat (F0),harmonicity,#11A3FF,Stretched
9.12912912912913,20.2175365596988,PraatF0,Praat (F0),harmonicity,#11A3FF,Stretched
9.144144144144144,20.22886119439149,PraatF0,Praat (F0),harmonicity,#11A3FF,Stretched
9.15915915915916,20.240239687727815,PraatF0,Praat (F0),harmonicity,#11A3FF,Stretched
9.174174174174174,37.07610030266085,PraatF0,Praat (F0),harmonicity,#11A3FF,Stretched
9.18918918918919,37.10356647590282,PraatF0,Praat (F0),harmonicity,#11A3FF,Stretched
9.204204204204204,37.130868827585175,PraatF0,Praat (F0),harmonicity,#11A3FF,Stretched
9.21921921921922,37.158445670585294,PraatF0,Praat (F0),harmonicity,#11A3FF,Stretched
9.234234234234235,37.18674984446164,PraatF0,Praat (F0),harmonicity,#11A3FF,Stretched
9.24924924924925,37.21625790126987,PraatF0,Praat (F0),harmonicity,#11A3FF,Stretched
9.264264264264265,32.33806413692933,PraatF0,Praat (F0),harmonicity,#11A3FF,Stretched
9.27927927927928,32.35427002620127,PraatF0,Praat (F0),harmonicity,#11A3FF,Stretched
9.294294294294295,32.36950909176477,PraatF0,Praat (F0),harmonicity,#11A3FF,Stretched
9.30930930930931,13.080530010682853,PraatF0,Praat (F0),harmonicity,#11A3FF,Stretched
9.324324324324325,13.088829549888636,PraatF0,Praat (F0),harmonicity,#11A3FF,Stretched
9.33933933933934,13.097100040737194,PraatF0,Praat (F0),harmonicity,#11A3FF,Stretched
9.354354354354355,10.477794404605543,PraatF0,Praat (F0),harmonicity,#11A3FF,Stretched
9.36936936936937,10.486619892417586,PraatF0,Praat (F0),harmonicity,#11A3FF,Stretched
9.384384384384385,10.494147651805205,PraatF0,Praat (F0),harmonicity,#11A3FF,Stretched
9.3993993993994,32.34295557105376,PraatF0,Praat (F0),harmonicity,#11A3FF,Stretched
9.414414414414415,10.990646699217768,PraatF0,Praat (F0),harmonicity,#11A3FF,Stretched
9.42942942942943,12.35329773496058,PraatF0,Praat (F0),harmonicity,#11A3FF,Stretched
9.444444444444445,12.360933295933712,PraatF0,Praat (F0),harmonicity,#11A3FF,Stretched
9.45945945945946,18.69369589294096,PraatF0,Praat (F0),harmonicity,#11A3FF,Stretched
9.474474474474475,13.739895276579414,PraatF0,Praat (F0),harmonicity,#11A3FF,Stretched
9.48948948948949,32.7409158534874,PraatF0,Praat (F0),harmonicity,#11A3FF,Stretched
9.504504504504505,32.74600626033988,PraatF0,Praat (F0),harmonicity,#11A3FF,Stretched
9.51951951951952,11.92801528928498,PraatF0,Praat (F0),harmonicity,#11A3FF,Stretched
9.534534534534535,11.935638474236342,PraatF0,Praat (F0),harmonicity,#11A3FF,Stretched
9.54954954954955,11.928138850294193,PraatF0,Praat (F0),harmonicity,#11A3FF,Stretched
9.564564564564565,11.935041266137581,PraatF0,Praat (F0),harmonicity,#11A3FF,Stretched
9.57957957957958,11.942906154922857,PraatF0,Praat (F0),harmonicity,#11A3FF,Stretched
9.594594594594595,21.771963582149926,PraatF0,Praat (F0),harmonicity,#11A3FF,Stretched
9.60960960960961,16.245045041337374,PraatF0,Praat (F0),harmonicity,#11A3FF,Stretched
9.624624624624625,16.257264626747,PraatF0,Praat (F0),harmonicity,#11A3FF,Stretched
9.63963963963964,16.268057879042253,PraatF0,Praat (F0),harmonicity,#11A3FF,Stretched
9.654654654654655,16.278605764507006,PraatF0,Praat (F0),harmonicity,#11A3FF,Stretched
9.66966966966967,16.289707306893163,PraatF0,Praat (F0),harmonicity,#11A3FF,Stretched
9.684684684684685,21.856741782981448,PraatF0,Praat (F0),harmonicity,#11A3FF,Stretched
9.6996996996997,24.035663523970747,PraatF0,Praat (F0),harmonicity,#11A3FF,Stretched
9.714714714714715,21.807520508431576,PraatF0,Praat (F0),harmonicity,#11A3FF,Stretched
9.72972972972973,21.819098731493128,PraatF0,Praat (F0),harmonicity,#11A3FF,Stretched
9.744744744744745,21.83086633705928,PraatF0,Praat (F0),harmonicity,#11A3FF,Stretched
9.75975975975976,13.088071350711065,PraatF0,Praat (F0),harmonicity,#11A3FF,Stretched
9.774774774774775,13.096132586821415,PraatF0,Praat (F0),harmonicity,#11A3FF,Stretched
9.78978978978979,13.087241174333187,PraatF0,Praat (F0),harmonicity,#11A3FF,Stretched
9.804804804804805,13.093337756843919,PraatF0,Praat (F0),harmonicity,#11A3FF,Stretched
9.81981981981982,10.99026656132213,PraatF0,Praat (F0),harmonicity,#11A3FF,Stretched
9.834834834834835,10.997242086789399,PraatF0,Praat (F0),harmonicity,#11A3FF,Stretched
9.84984984984985,20.202536552188775,PraatF0,Praat (F0),harmonicity,#11A3FF,Stretched
9.864864864864865,20.213652891969964,PraatF0,Praat (F0),harmonicity,#11A3FF,Stretched
9.87987987987988,20.224305375361684,PraatF0,Praat (F0),harmonicity,#11A3FF,Stretched
9.894894894894895,20.234480134956478,PraatF0,Praat (F0),harmonicity,#11A3FF,Stretched
9.90990990990991,20.244326105674467,PraatF0,Praat (F0),harmonicity,#11A3FF,Stretched
9.924924924924925,28.860186425972287,PraatF0,Praat (F0),harmonicity,#11A3FF,Stretched
9.93993993993994,11.926849463313419,PraatF0,Praat (F0),harmonicity,#11A3FF,Stretched
9.954954954954955,11.934541221272212,PraatF0,Praat (F0),harmonicity,#11A3FF,Stretched
9.96996996996997,13.721204164088968,PraatF0,Praat (F0),harmonicity,#11A3FF,Stretched
9.984984984984985,10.866453520324516,PraatF0,Praat (F0),harmonicity,#11A3FF,Stretched
10,10.873684042699345,PraatF0,Praat (F0),harmonicity,#11A3FF,Stretched
10.015015015015015,11.930969776784146,PraatF0,Praat (F0),harmonicity,#11A3FF,Stretched
10.03003003003003,11.939543165000506,PraatF0,Praat (F0),harmonicity,#11A3FF,Stretched
10.045045045045045,16.65122757237258,PraatF0,Praat (F0),harmonicity,#11A3FF,Stretched
10.06006006006006,29.10247023623139,PraatF0,Praat (F0),harmonicity,#11A3FF,Stretched
10.075075075075075,11.418122723118497,PraatF0,Praat (F0),harmonicity,#11A3FF,Stretched
10.09009009009009,11.426572783145712,PraatF0,Praat (F0),harmonicity,#11A3FF,Stretched
10.105105105105105,11.434158481239884,PraatF0,Praat (F0),harmonicity,#11A3FF,Stretched
10.12012012012012,29.198009608338904,PraatF0,Praat (F0),harmonicity,#11A3FF,Stretched
10.135135135135135,29.218857574704487,PraatF0,Praat (F0),harmonicity,#11A3FF,Stretched
10.15015015015015,29.239183161332225,PraatF0,Praat (F0),harmonicity,#11A3FF,Stretched
10.165165165165165,29.259340392436656,PraatF0,Praat (F0),harmonicity,#11A3FF,Stretched
10.18018018018018,10.99030089579462,PraatF0,Praat (F0),harmonicity,#11A3FF,Stretched
10.195195195195195,10.997920363681509,PraatF0,Praat (F0),harmonicity,#11A3FF,Stretched
10.21021021021021,13.083901987483433,PraatF0,Praat (F0),harmonicity,#11A3FF,Stretched
10.225225225225225,13.091534055031687,PraatF0,Praat (F0),harmonicity,#11A3FF,Stretched
10.24024024024024,16.275953835289464,PraatF0,Praat (F0),harmonicity,#11A3FF,Stretched
10.255255255255255,23.671503123407398,PraatF0,Praat (F0),harmonicity,#11A3FF,Stretched
10.27027027027027,23.6891818869638,PraatF0,Praat (F0),harmonicity,#11A3FF,Stretched
10.285285285285285,23.70718267255387,PraatF0,Praat (F0),harmonicity,#11A3FF,Stretched
10.3003003003003,36.66722635539886,PraatF0,Praat (F0),harmonicity,#11A3FF,Stretched
10.315315315315315,36.694355266336366,PraatF0,Praat (F0),harmonicity,#11A3FF,Stretched
10.33033033033033,36.72043223644848,PraatF0,Praat (F0),harmonicity,#11A3FF,Stretched
10.345345345345345,36.7455160958541,PraatF0,Praat (F0),harmonicity,#11A3FF,Stretched
10.36036036036036,36.77697569161275,PraatF0,Praat (F0),harmonicity,#11A3FF,Stretched
10.375375375375375,36.805836062828895,PraatF0,Praat (F0),harmonicity,#11A3FF,Stretched
10.39039039039039,11.928464614026513,PraatF0,Praat (F0),harmonicity,#11A3FF,Stretched
10.405405405405405,11.937400329180132,PraatF0,Praat (F0),harmonicity,#11A3FF,Stretched
10.42042042042042,21.794499009598912,PraatF0,Praat (F0),harmonicity,#11A3FF,Stretched
10.435435435435435,21.808209566871973,PraatF0,Praat (F0),harmonicity,#11A3FF,Stretched
10.45045045045045,21.821154043803126,PraatF0,Praat (F0),harmonicity,#11A3FF,Stretched
10.465465465465465,21.8339272707949,PraatF0,Praat (F0),harmonicity,#11A3FF,Stretched
10.48048048048048,21.846851840501774,PraatF0,Praat (F0),harmonicity,#11A3FF,Stretched
10.495495495495495,11.426687324181835,PraatF0,Praat (F0),harmonicity,#11A3FF,Stretched
10.51051051051051,11.435172353694886,PraatF0,Praat (F0),harmonicity,#11A3FF,Stretched
10.525525525525525,24.043942293311083,PraatF0,Praat (F0),harmonicity,#11A3FF,Stretched
10.54054054054054,24.06192582426162,PraatF0,Praat (F0),harmonicity,#11A3FF,Stretched
10.555555555555555,24.080035091457532,PraatF0,Praat (F0),harmonicity,#11A3FF,Stretched
10.57057057057057,24.09866398512871,PraatF0,Praat (F0),harmonicity,#11A3FF,Stretched
10.585585585585585,24.118171114716006,PraatF0,Praat (F0),harmonicity,#11A3FF,Stretched
10.6006006006006,17.196879307032116,PraatF0,Praat (F0),harmonicity,#11A3FF,Stretched
10.615615615615615,17.209825743658055,PraatF0,Praat (F0),harmonicity,#11A3FF,Stretched
10.63063063063063,17.224752782349604,PraatF0,Praat (F0),harmonicity,#11A3FF,Stretched
10.645645645645645,13.079016674563018,PraatF0,Praat (F0),harmonicity,#11A3FF,Stretched
10.66066066066066,13.087158153703637,PraatF0,Praat (F0),harmonicity,#11A3FF,Stretched
10.675675675675675,13.094620582607611,PraatF0,Praat (F0),harmonicity,#11A3FF,Stretched
10.69069069069069,17.284114581282207,PraatF0,Praat (F0),harmonicity,#11A3FF,Stretched
10.705705705705705,17.296400628331394,PraatF0,Praat (F0),harmonicity,#11A3FF,Stretched
10.72072072072072,13.086158635680551,PraatF0,Praat (F0),harmonicity,#11A3FF,Stretched
10.735735735735735,13.094237534355411,PraatF0,Praat (F0),harmonicity,#11A3FF,Stretched
10.75075075075075,16.26669111592476,PraatF0,Praat (F0),harmonicity,#11A3FF,Stretched
10.765765765765765,16.270085855018237,PraatF0,Praat (F0),harmonicity,#11A3FF,Stretched
10.78078078078078,16.26403862141334,PraatF0,Praat (F0),harmonicity,#11A3FF,Stretched
10.795795795795796,16.27233029856518,PraatF0,Praat (F0),harmonicity,#11A3FF,Stretched
10.81081081081081,16.28219551521891,PraatF0,Praat (F0),harmonicity,#11A3FF,Stretched
10.825825825825826,11.923714094108586,PraatF0,Praat (F0),harmonicity,#11A3FF,Stretched
10.84084084084084,11.931537978152669,PraatF0,Praat (F0),harmonicity,#11A3FF,Stretched
10.855855855855856,11.42724093925336,PraatF0,Praat (F0),harmonicity,#11A3FF,Stretched
10.87087087087087,11.435721509674437,PraatF0,Praat (F0),harmonicity,#11A3FF,Stretched
10.885885885885886,11.4444390887254,PraatF0,Praat (F0),harmonicity,#11A3FF,Stretched
10.9009009009009,20.13082155567941,PraatF0,Praat (F0),harmonicity,#11A3FF,Stretched
10.915915915915916,11.465752116175132,PraatF0,Praat (F0),harmonicity,#11A3FF,Stretched
10.93093093093093,11.475611580417269,PraatF0,Praat (F0),harmonicity,#11A3FF,Stretched
10.945945945945946,32.373991950897064,PraatF0,Praat (F0),harmonicity,#11A3FF,Stretched
10.96096096096096,32.393593779665395,PraatF0,Praat (F0),harmonicity,#11A3FF,Stretched
10.975975975975976,13.677131670885249,PraatF0,Praat (F0),harmonicity,#11A3FF,Stretched
10.99099099099099,13.686144263162777,PraatF0,Praat (F0),harmonicity,#11A3FF,Stretched
11.006006006006006,13.696116068307354,PraatF0,Praat (F0),harmonicity,#11A3FF,Stretched
11.02102102102102,13.707979481789414,PraatF0,Praat (F0),harmonicity,#11A3FF,Stretched
11.036036036036036,17.635832808306784,PraatF0,Praat (F0),harmonicity,#11A3FF,Stretched
11.05105105105105,17.650158477518154,PraatF0,Praat (F0),harmonicity,#11A3FF,Stretched
11.066066066066066,17.663899762319122,PraatF0,Praat (F0),harmonicity,#11A3FF,Stretched
11.08108108108108,17.677290573859104,PraatF0,Praat (F0),harmonicity,#11A3FF,Stretched
11.096096096096096,17.690810621415608,PraatF0,Praat (F0),harmonicity,#11A3FF,Stretched
11.11111111111111,13.079495191215795,PraatF0,Praat (F0),harmonicity,#11A3FF,Stretched
11.126126126126126,13.088090579299383,PraatF0,Praat (F0),harmonicity,#11A3FF,Stretched
11.14114114114114,13.09525335579331,PraatF0,Praat (F0),harmonicity,#11A3FF,Stretched
11.156156156156156,13.088168542481519,PraatF0,Praat (F0),harmonicity,#11A3FF,Stretched
11.17117117117117,21.804118460510878,PraatF0,Praat (F0),harmonicity,#11A3FF,Stretched
11.186186186186186,21.81677827637999,PraatF0,Praat (F0),harmonicity,#11A3FF,Stretched
11.2012012012012,21.828857990064833,PraatF0,Praat (F0),harmonicity,#11A3FF,Stretched
11.216216216216216,26.230926556351292,PraatF0,Praat (F0),harmonicity,#11A3FF,Stretched
11.23123123123123,11.923530610219018,PraatF0,Praat (F0),harmonicity,#11A3FF,Stretched
11.246246246246246,11.932162768395337,PraatF0,Praat (F0),harmonicity,#11A3FF,Stretched
11.26126126126126,11.940990578523452,PraatF0,Praat (F0),harmonicity,#11A3FF,Stretched
11.276276276276276,26.261364714173702,PraatF0,Praat (F0),harmonicity,#11A3FF,Stretched
11.29129129129129,16.26878572835954,PraatF0,Praat (F0),harmonicity,#11A3FF,Stretched
11.306306306306306,16.279310346214963,PraatF0,Praat (F0),harmonicity,#11A3FF,Stretched
11.32132132132132,16.290045768012348,PraatF0,Praat (F0),harmonicity,#11A3FF,Stretched
11.336336336336336,24.0563938214933,PraatF0,Praat (F0),harmonicity,#11A3FF,Stretched
11.35135135135135,10.48705096164398,PraatF0,Praat (F0),harmonicity,#11A3FF,Stretched
11.366366366366366,10.49495160041003,PraatF0,Praat (F0),harmonicity,#11A3FF,Stretched
11.381381381381381,16.271695907783922,PraatF0,Praat (F0),harmonicity,#11A3FF,Stretched
11.396396396396396,24.025584415205778,PraatF0,Praat (F0),harmonicity,#11A3FF,Stretched
11.411411411411411,24.041998128725233,PraatF0,Praat (F0),harmonicity,#11A3FF,Stretched
11.426426426426426,24.058124625893043,PraatF0,Praat (F0),harmonicity,#11A3FF,Stretched
11.441441441441441,13.690042019975019,PraatF0,Praat (F0),harmonicity,#11A3FF,Stretched
11.456456456456456,13.700810385041283,PraatF0,Praat (F0),harmonicity,#11A3FF,Stretched
11.471471471471471,13.71309327035888,PraatF0,Praat (F0),harmonicity,#11A3FF,Stretched
11.486486486486486,13.724457517879292,PraatF0,Praat (F0),harmonicity,#11A3FF,Stretched
11.501501501501501,42.41258337988016,PraatF0,Praat (F0),harmonicity,#11A3FF,Stretched
11.516516516516516,42.45016698551311,PraatF0,Praat (F0),harmonicity,#11A3FF,Stretched
11.531531531531531,11.882225897151564,PraatF0,Praat (F0),harmonicity,#11A3FF,Stretched
11.546546546546546,13.086907114586925,PraatF0,Praat (F0),harmonicity,#11A3FF,Stretched
11.561561561561561,13.094311527447218,PraatF0,Praat (F0),harmonicity,#11A3FF,Stretched
11.576576576576576,11.913609429464252,PraatF0,Praat (F0),harmonicity,#11A3FF,Stretched
11.591591591591591,11.923690380775177,PraatF0,Praat (F0),harmonicity,#11A3FF,Stretched
11.606606606606606,11.93283468417322,PraatF0,Praat (F0),harmonicity,#11A3FF,Stretched
11.621621621621621,11.94183784609265,PraatF0,Praat (F0),harmonicity,#11A3FF,Stretched
11.636636636636636,12.494736858394,PraatF0,Praat (F0),harmonicity,#11A3FF,Stretched
11.651651651651651,12.502500101653705,PraatF0,Praat (F0),harmonicity,#11A3FF,Stretched
11.666666666666666,42.807885577935515,PraatF0,Praat (F0),harmonicity,#11A3FF,Stretched
11.681681681681681,42.84196648067008,PraatF0,Praat (F0),harmonicity,#11A3FF,Stretched
11.696696696696696,42.8765398147915,PraatF0,Praat (F0),harmonicity,#11A3FF,Stretched
11.711711711711711,42.91180334160791,PraatF0,Praat (F0),harmonicity,#11A3FF,Stretched
11.726726726726726,42.9478974560307,PraatF0,Praat (F0),harmonicity,#11A3FF,Stretched
11.741741741741741,63.79619821156177,PraatF0,Praat (F0),harmonicity,#11A3FF,Stretched
11.756756756756756,63.839472418006544,PraatF0,Praat (F0),harmonicity,#11A3FF,Stretched
11.771771771771771,63.88274914542103,PraatF0,Praat (F0),harmonicity,#11A3FF,Stretched
11.786786786786786,63.92616888429779,PraatF0,Praat (F0),harmonicity,#11A3FF,Stretched
11.801801801801801,63.969894799285925,PraatF0,Praat (F0),harmonicity,#11A3FF,Stretched
11.816816816816816,17.265710706295106,PraatF0,Praat (F0),harmonicity,#11A3FF,Stretched
11.831831831831831,17.277178065477187,PraatF0,Praat (F0),harmonicity,#11A3FF,Stretched
11.846846846846846,21.801493074474166,PraatF0,Praat (F0),harmonicity,#11A3FF,Stretched
11.861861861861861,21.81638841636193,PraatF0,Praat (F0),harmonicity,#11A3FF,Stretched
11.876876876876876,32.3231627359926,PraatF0,Praat (F0),harmonicity,#11A3FF,Stretched
11.891891891891891,32.34556002591383,PraatF0,Praat (F0),harmonicity,#11A3FF,Stretched
11.906906906906906,32.36793628266875,PraatF0,Praat (F0),harmonicity,#11A3FF,Stretched
11.921921921921921,32.39070521392431,PraatF0,Praat (F0),harmonicity,#11A3FF,Stretched
11.936936936936936,32.41436970290549,PraatF0,Praat (F0),harmonicity,#11A3FF,Stretched
11.951951951951951,12.429921383651,PraatF0,Praat (F0),harmonicity,#11A3FF,Stretched
11.966966966966966,26.136713117415958,PraatF0,Praat (F0),harmonicity,#11A3FF,Stretched
11.981981981981981,26.15842692693046,PraatF0,Praat (F0),harmonicity,#11A3FF,Stretched
11.996996996996996,26.180182996749487,PraatF0,Praat (F0),harmonicity,#11A3FF,Stretched
12.012012012012011,26.201802014763572,PraatF0,Praat (F0),harmonicity,#11A3FF,Stretched
12.027027027027026,26.223101040547974,PraatF0,Praat (F0),harmonicity,#11A3FF,Stretched
12.042042042042041,26.243999077892738,PraatF0,Praat (F0),harmonicity,#11A3FF,Stretched
12.057057057057056,26.26456220256592,PraatF0,Praat (F0),harmonicity,#11A3FF,Stretched
12.072072072072071,26.28499178287229,PraatF0,Praat (F0),harmonicity,#11A3FF,Stretched
12.087087087087086,26.30561229487838,PraatF0,Praat (F0),harmonicity,#11A3FF,Stretched
12.102102102102101,32.734556813542596,PraatF0,Praat (F0),harmonicity,#11A3FF,Stretched
12.117117117117116,32.75800717775395,PraatF0,Praat (F0),harmonicity,#11A3FF,Stretched
12.132132132132131,18.785218000377395,PraatF0,Praat (F0),harmonicity,#11A3FF,Stretched
12.147147147147146,24.062115528320902,PraatF0,Praat (F0),harmonicity,#11A3FF,Stretched
12.162162162162161,10.990505970096258,PraatF0,Praat (F0),harmonicity,#11A3FF,Stretched
12.177177177177176,10.99851637044137,PraatF0,Praat (F0),harmonicity,#11A3FF,Stretched
12.192192192192191,18.851925284121116,PraatF0,Praat (F0),harmonicity,#11A3FF,Stretched
12.207207207207206,18.86919508470249,PraatF0,Praat (F0),harmonicity,#11A3FF,Stretched
12.222222222222221,18.885817941153398,PraatF0,Praat (F0),harmonicity,#11A3FF,Stretched
12.237237237237236,18.901827501977486,PraatF0,Praat (F0),harmonicity,#11A3FF,Stretched
12.252252252252251,18.917283146007257,PraatF0,Praat (F0),harmonicity,#11A3FF,Stretched
12.267267267267266,18.93222560916523,PraatF0,Praat (F0),harmonicity,#11A3FF,Stretched
12.282282282282281,18.946748022738305,PraatF0,Praat (F0),harmonicity,#11A3FF,Stretched
12.297297297297296,12.420453249633479,PraatF0,Praat (F0),harmonicity,#11A3FF,Stretched
12.312312312312311,12.430267191544461,PraatF0,Praat (F0),harmonicity,#11A3FF,Stretched
12.327327327327327,12.43991261477445,PraatF0,Praat (F0),harmonicity,#11A3FF,Stretched
12.342342342342342,12.449828503159567,PraatF0,Praat (F0),harmonicity,#11A3FF,Stretched
12.357357357357357,44.5562669100836,PraatF0,Praat (F0),harmonicity,#11A3FF,Stretched
12.372372372372372,44.58999295567186,PraatF0,Praat (F0),harmonicity,#11A3FF,Stretched
12.387387387387387,12.48500376654005,PraatF0,Praat (F0),harmonicity,#11A3FF,Stretched
12.402402402402402,12.495088089523612,PraatF0,Praat (F0),harmonicity,#11A3FF,Stretched
12.417417417417417,12.504447173223612,PraatF0,Praat (F0),harmonicity,#11A3FF,Stretched
12.432432432432432,13.083906199887203,PraatF0,Praat (F0),harmonicity,#11A3FF,Stretched
12.447447447447447,13.09145986055956,PraatF0,Praat (F0),harmonicity,#11A3FF,Stretched
12.462462462462462,13.098241417954458,PraatF0,Praat (F0),harmonicity,#11A3FF,Stretched
12.477477477477477,13.103663576892174,PraatF0,Praat (F0),harmonicity,#11A3FF,Stretched
12.492492492492492,53.956794510267976,PraatF0,Praat (F0),harmonicity,#11A3FF,Stretched
12.507507507507507,11.421379281549216,PraatF0,Praat (F0),harmonicity,#11A3FF,Stretched
12.522522522522522,11.429968733592688,PraatF0,Praat (F0),harmonicity,#11A3FF,Stretched
12.537537537537537,11.43859255862974,PraatF0,Praat (F0),harmonicity,#11A3FF,Stretched
12.552552552552552,23.610303962002924,PraatF0,Praat (F0),harmonicity,#11A3FF,Stretched
12.567567567567567,23.63140321749911,PraatF0,Praat (F0),harmonicity,#11A3FF,Stretched
12.582582582582582,23.64988603887125,PraatF0,Praat (F0),harmonicity,#11A3FF,Stretched
12.597597597597597,23.66676215471849,PraatF0,Praat (F0),harmonicity,#11A3FF,Stretched
12.612612612612612,23.682729307963633,PraatF0,Praat (F0),harmonicity,#11A3FF,Stretched
12.627627627627627,23.698649519427693,PraatF0,Praat (F0),harmonicity,#11A3FF,Stretched
12.642642642642642,10.86567520979973,PraatF0,Praat (F0),harmonicity,#11A3FF,Stretched
12.657657657657657,10.87278304145716,PraatF0,Praat (F0),harmonicity,#11A3FF,Stretched
12.672672672672672,17.118419301014722,PraatF0,Praat (F0),harmonicity,#11A3FF,Stretched
12.687687687687687,18.197395683286757,PraatF0,Praat (F0),harmonicity,#11A3FF,Stretched
12.702702702702702,17.651116931371767,PraatF0,Praat (F0),harmonicity,#11A3FF,Stretched
12.717717717717717,18.77978920263193,PraatF0,Praat (F0),harmonicity,#11A3FF,Stretched
12.732732732732732,18.23575672881096,PraatF0,Praat (F0),harmonicity,#11A3FF,Stretched
12.747747747747747,42.23222444380786,PraatF0,Praat (F0),harmonicity,#11A3FF,Stretched
12.762762762762762,13.02651421244269,PraatF0,Praat (F0),harmonicity,#11A3FF,Stretched
12.777777777777777,13.36439779491608,PraatF0,Praat (F0),harmonicity,#11A3FF,Stretched
12.792792792792792,13.375061290525107,PraatF0,Praat (F0),harmonicity,#11A3FF,Stretched
12.807807807807807,20.203062104473283,PraatF0,Praat (F0),harmonicity,#11A3FF,Stretched
12.822822822822824,20.216777067094085,PraatF0,Praat (F0),harmonicity,#11A3FF,Stretched
12.837837837837839,13.082015797617576,PraatF0,Praat (F0),harmonicity,#11A3FF,Stretched
12.852852852852854,13.091723405966935,PraatF0,Praat (F0),harmonicity,#11A3FF,Stretched
12.867867867867869,13.101248715984031,PraatF0,Praat (F0),harmonicity,#11A3FF,Stretched
12.882882882882884,32.35527542032371,PraatF0,Praat (F0),harmonicity,#11A3FF,Stretched
12.897897897897899,37.48094706571341,PraatF0,Praat (F0),harmonicity,#11A3FF,Stretched
12.912912912912914,26.22244681281526,PraatF0,Praat (F0),harmonicity,#11A3FF,Stretched
12.927927927927929,26.240337150885537,PraatF0,Praat (F0),harmonicity,#11A3FF,Stretched
12.942942942942944,42.703871705966705,PraatF0,Praat (F0),harmonicity,#11A3FF,Stretched
12.957957957957959,42.738770363489735,PraatF0,Praat (F0),harmonicity,#11A3FF,Stretched
12.972972972972974,42.77349109028596,PraatF0,Praat (F0),harmonicity,#11A3FF,Stretched
12.987987987987989,42.8065615755532,PraatF0,Praat (F0),harmonicity,#11A3FF,Stretched
13.003003003003004,42.84168816102988,PraatF0,Praat (F0),harmonicity,#11A3FF,Stretched
13.018018018018019,42.87600638690559,PraatF0,Praat (F0),harmonicity,#11A3FF,Stretched
13.033033033033034,29.15172667862565,PraatF0,Praat (F0),harmonicity,#11A3FF,Stretched
13.048048048048049,29.173947257691783,PraatF0,Praat (F0),harmonicity,#11A3FF,Stretched
13.063063063063064,29.19387147257698,PraatF0,Praat (F0),harmonicity,#11A3FF,Stretched
13.078078078078079,29.21126017949564,PraatF0,Praat (F0),harmonicity,#11A3FF,Stretched
13.093093093093094,29.223342639552822,PraatF0,Praat (F0),harmonicity,#11A3FF,Stretched
13.108108108108109,29.213177721615878,PraatF0,Praat (F0),harmonicity,#11A3FF,Stretched
13.123123123123124,29.22406921161498,PraatF0,Praat (F0),harmonicity,#11A3FF,Stretched
13.138138138138139,13.036953681549,PraatF0,Praat (F0),harmonicity,#11A3FF,Stretched
13.153153153153154,13.047716106387343,PraatF0,Praat (F0),harmonicity,#11A3FF,Stretched
13.168168168168169,13.060296778236673,PraatF0,Praat (F0),harmonicity,#11A3FF,Stretched
13.183183183183184,13.072868824627786,PraatF0,Praat (F0),harmonicity,#11A3FF,Stretched
13.198198198198199,13.083517480126632,PraatF0,Praat (F0),harmonicity,#11A3FF,Stretched
13.213213213213214,13.092958860027672,PraatF0,Praat (F0),harmonicity,#11A3FF,Stretched
13.228228228228229,13.102187810274518,PraatF0,Praat (F0),harmonicity,#11A3FF,Stretched
13.243243243243244,13.707838095047762,PraatF0,Praat (F0),harmonicity,#11A3FF,Stretched
13.258258258258259,13.71986171596191,PraatF0,Praat (F0),harmonicity,#11A3FF,Stretched
13.273273273273274,13.730171600726312,PraatF0,Praat (F0),harmonicity,#11A3FF,Stretched
13.288288288288289,13.739390571168776,PraatF0,Praat (F0),harmonicity,#11A3FF,Stretched
13.303303303303304,18.80632176353471,PraatF0,Praat (F0),harmonicity,#11A3FF,Stretched
13.318318318318319,21.812606568004316,PraatF0,Praat (F0),harmonicity,#11A3FF,Stretched
13.333333333333334,21.82504407100067,PraatF0,Praat (F0),harmonicity,#11A3FF,Stretched
13.348348348348349,20.158836781704622,PraatF0,Praat (F0),harmonicity,#11A3FF,Stretched
13.363363363363364,20.176598854643753,PraatF0,Praat (F0),harmonicity,#11A3FF,Stretched
13.378378378378379,20.19270413184428,PraatF0,Praat (F0),harmonicity,#11A3FF,Stretched
13.393393393393394,20.207778903161824,PraatF0,Praat (F0),harmonicity,#11A3FF,Stretched
13.408408408408409,20.22248134945871,PraatF0,Praat (F0),harmonicity,#11A3FF,Stretched
13.423423423423424,20.23739790377415,PraatF0,Praat (F0),harmonicity,#11A3FF,Stretched
13.438438438438439,20.253248813332174,PraatF0,Praat (F0),harmonicity,#11A3FF,Stretched
13.453453453453454,20.270996373168195,PraatF0,Praat (F0),harmonicity,#11A3FF,Stretched
13.468468468468469,20.290963343057825,PraatF0,Praat (F0),harmonicity,#11A3FF,Stretched
13.483483483483484,20.311410016587878,PraatF0,Praat (F0),harmonicity,#11A3FF,Stretched
13.498498498498499,11.417070445825809,PraatF0,Praat (F0),harmonicity,#11A3FF,Stretched
13.513513513513514,11.426217146590371,PraatF0,Praat (F0),harmonicity,#11A3FF,Stretched
13.528528528528529,11.434945377853616,PraatF0,Praat (F0),harmonicity,#11A3FF,Stretched
13.543543543543544,11.44381591518961,PraatF0,Praat (F0),harmonicity,#11A3FF,Stretched
13.558558558558559,11.913856735013333,PraatF0,Praat (F0),harmonicity,#11A3FF,Stretched
13.573573573573574,11.923965033486695,PraatF0,Praat (F0),harmonicity,#11A3FF,Stretched
13.588588588588589,11.933345777386211,PraatF0,Praat (F0),harmonicity,#11A3FF,Stretched
13.603603603603604,11.942700544813519,PraatF0,Praat (F0),harmonicity,#11A3FF,Stretched
13.618618618618619,28.752314582605408,PraatF0,Praat (F0),harmonicity,#11A3FF,Stretched
13.633633633633634,28.774591048383968,PraatF0,Praat (F0),harmonicity,#11A3FF,Stretched
13.64864864864865,28.797022244255857,PraatF0,Praat (F0),harmonicity,#11A3FF,Stretched
13.663663663663664,13.720546024520562,PraatF0,Praat (F0),harmonicity,#11A3FF,Stretched
13.67867867867868,13.731518117153222,PraatF0,Praat (F0),harmonicity,#11A3FF,Stretched
13.693693693693694,28.867617615626674,PraatF0,Praat (F0),harmonicity,#11A3FF,Stretched
13.70870870870871,28.89268672421695,PraatF0,Praat (F0),harmonicity,#11A3FF,Stretched
13.723723723723724,28.918418692973972,PraatF0,Praat (F0),harmonicity,#11A3FF,Stretched
13.73873873873874,28.944593316060015,PraatF0,Praat (F0),harmonicity,#11A3FF,Stretched
13.753753753753754,28.971026347249552,PraatF0,Praat (F0),harmonicity,#11A3FF,Stretched
13.76876876876877,28.997623571416852,PraatF0,Praat (F0),harmonicity,#11A3FF,Stretched
13.783783783783784,29.024365477517506,PraatF0,Praat (F0),harmonicity,#11A3FF,Stretched
13.7987987987988,29.051213873771168,PraatF0,Praat (F0),harmonicity,#11A3FF,Stretched
13.813813813813814,29.07802476844094,PraatF0,Praat (F0),harmonicity,#11A3FF,Stretched
13.82882882882883,29.104499159365332,PraatF0,Praat (F0),harmonicity,#11A3FF,Stretched
13.843843843843844,29.13026539215881,PraatF0,Praat (F0),harmonicity,#11A3FF,Stretched
13.85885885885886,29.155043911280558,PraatF0,Praat (F0),harmonicity,#11A3FF,Stretched
13.873873873873874,29.17876739939637,PraatF0,Praat (F0),harmonicity,#11A3FF,Stretched
13.88888888888889,29.20156997142182,PraatF0,Praat (F0),harmonicity,#11A3FF,Stretched
13.903903903903904,29.22369204556518,PraatF0,Praat (F0),harmonicity,#11A3FF,Stretched
13.91891891891892,29.24542369002291,PraatF0,Praat (F0),harmonicity,#11A3FF,Stretched
13.933933933933934,29.267103095733454,PraatF0,Praat (F0),harmonicity,#11A3FF,Stretched
13.94894894894895,29.28917908488343,PraatF0,Praat (F0),harmonicity,#11A3FF,Stretched
13.963963963963964,20.197664655729092,PraatF0,Praat (F0),harmonicity,#11A3FF,Stretched
13.97897897897898,20.20946471946876,PraatF0,Praat (F0),harmonicity,#11A3FF,Stretched
13.993993993993994,20.221067187609584,PraatF0,Praat (F0),harmonicity,#11A3FF,Stretched
14.00900900900901,13.709470248789977,PraatF0,Praat (F0),harmonicity,#11A3FF,Stretched
14.024024024024024,13.72133887962077,PraatF0,Praat (F0),harmonicity,#11A3FF,Stretched
14.03903903903904,13.732445775684907,PraatF0,Praat (F0),harmonicity,#11A3FF,Stretched
14.054054054054054,13.743238687688692,PraatF0,Praat (F0),harmonicity,#11A3FF,Stretched
14.06906906906907,36.678532324388854,PraatF0,Praat (F0),harmonicity,#11A3FF,Stretched
14.084084084084084,36.70695985656715,PraatF0,Praat (F0),harmonicity,#11A3FF,Stretched
14.0990990990991,36.736072220221445,PraatF0,Praat (F0),harmonicity,#11A3FF,Stretched
14.114114114114114,36.76620966818088,PraatF0,Praat (F0),harmonicity,#11A3FF,Stretched
14.12912912912913,21.80743662273487,PraatF0,Praat (F0),harmonicity,#11A3FF,Stretched
14.144144144144144,21.82243936117352,PraatF0,Praat (F0),harmonicity,#11A3FF,Stretched
14.15915915915916,21.836789093254005,PraatF0,Praat (F0),harmonicity,#11A3FF,Stretched
14.174174174174174,21.850530655142286,PraatF0,Praat (F0),harmonicity,#11A3FF,Stretched
14.18918918918919,11.429595336182523,PraatF0,Praat (F0),harmonicity,#11A3FF,Stretched
14.204204204204204,36.96621795075389,PraatF0,Praat (F0),harmonicity,#11A3FF,Stretched
14.21921921921922,36.998520982230474,PraatF0,Praat (F0),harmonicity,#11A3FF,Stretched
14.234234234234235,37.02974950341428,PraatF0,Praat (F0),harmonicity,#11A3FF,Stretched
14.24924924924925,11.922860115689048,PraatF0,Praat (F0),harmonicity,#11A3FF,Stretched
14.264264264264265,11.931857229346484,PraatF0,Praat (F0),harmonicity,#11A3FF,Stretched
14.27927927927928,11.940842839391085,PraatF0,Praat (F0),harmonicity,#11A3FF,Stretched
14.294294294294295,12.430607612030439,PraatF0,Praat (F0),harmonicity,#11A3FF,Stretched
14.30930930930931,12.440502032395406,PraatF0,Praat (F0),harmonicity,#11A3FF,Stretched
14.324324324324325,12.450677506120176,PraatF0,Praat (F0),harmonicity,#11A3FF,Stretched
14.33933933933934,26.176148253759564,PraatF0,Praat (F0),harmonicity,#11A3FF,Stretched
14.354354354354355,26.19714954563676,PraatF0,Praat (F0),harmonicity,#11A3FF,Stretched
14.36936936936937,26.217678733098943,PraatF0,Praat (F0),harmonicity,#11A3FF,Stretched
14.384384384384385,12.4954302804687,PraatF0,Praat (F0),harmonicity,#11A3FF,Stretched
14.3993993993994,12.505108521958128,PraatF0,Praat (F0),harmonicity,#11A3FF,Stretched
14.414414414414415,26.275407113428017,PraatF0,Praat (F0),harmonicity,#11A3FF,Stretched
14.42942942942943,16.268724282650673,PraatF0,Praat (F0),harmonicity,#11A3FF,Stretched
14.444444444444445,28.79100715877837,PraatF0,Praat (F0),harmonicity,#11A3FF,Stretched
14.45945945945946,28.812960884519022,PraatF0,Praat (F0),harmonicity,#11A3FF,Stretched
14.474474474474475,14.379845269358068,PraatF0,Praat (F0),harmonicity,#11A3FF,Stretched
14.48948948948949,14.390402935238644,PraatF0,Praat (F0),harmonicity,#11A3FF,Stretched
14.504504504504505,20.206633406138828,PraatF0,Praat (F0),harmonicity,#11A3FF,Stretched
14.51951951951952,20.216198376793812,PraatF0,Praat (F0),harmonicity,#11A3FF,Stretched
14.534534534534535,20.20235461727203,PraatF0,Praat (F0),harmonicity,#11A3FF,Stretched
14.54954954954955,20.214494758941406,PraatF0,Praat (F0),harmonicity,#11A3FF,Stretched
14.564564564564565,20.227991354446907,PraatF0,Praat (F0),harmonicity,#11A3FF,Stretched
14.57957957957958,20.242593981448707,PraatF0,Praat (F0),harmonicity,#11A3FF,Stretched
14.594594594594595,11.93118964414435,PraatF0,Praat (F0),harmonicity,#11A3FF,Stretched
14.60960960960961,11.94006335791007,PraatF0,Praat (F0),harmonicity,#11A3FF,Stretched
14.624624624624625,21.693558480376737,PraatF0,Praat (F0),harmonicity,#11A3FF,Stretched
14.63963963963964,21.71286018450035,PraatF0,Praat (F0),harmonicity,#11A3FF,Stretched
14.654654654654655,29.150814190685097,PraatF0,Praat (F0),harmonicity,#11A3FF,Stretched
14.66966966966967,29.17415983146176,PraatF0,Praat (F0),harmonicity,#11A3FF,Stretched
14.684684684684685,21.775637215335745,PraatF0,Praat (F0),harmonicity,#11A3FF,Stretched
14.6996996996997,21.79363784882036,PraatF0,Praat (F0),harmonicity,#11A3FF,Stretched
14.714714714714715,21.81032048097478,PraatF0,Praat (F0),harmonicity,#11A3FF,Stretched
14.72972972972973,21.826513117265065,PraatF0,Praat (F0),harmonicity,#11A3FF,Stretched
14.744744744744745,21.842874467794168,PraatF0,Praat (F0),harmonicity,#11A3FF,Stretched
14.75975975975976,21.860066665358058,PraatF0,Praat (F0),harmonicity,#11A3FF,Stretched
14.774774774774775,21.87879067371893,PraatF0,Praat (F0),harmonicity,#11A3FF,Stretched
14.78978978978979,29.220438107314806,PraatF0,Praat (F0),harmonicity,#11A3FF,Stretched
14.804804804804805,29.239966755593933,PraatF0,Praat (F0),harmonicity,#11A3FF,Stretched
14.81981981981982,32.32207726124764,PraatF0,Praat (F0),harmonicity,#11A3FF,Stretched
14.834834834834835,32.34203526195583,PraatF0,Praat (F0),harmonicity,#11A3FF,Stretched
14.84984984984985,32.36023078979987,PraatF0,Praat (F0),harmonicity,#11A3FF,Stretched
14.864864864864865,13.086918378273491,PraatF0,Praat (F0),harmonicity,#11A3FF,Stretched
14.87987987987988,13.095757106925099,PraatF0,Praat (F0),harmonicity,#11A3FF,Stretched
14.894894894894895,32.374098162303056,PraatF0,Praat (F0),harmonicity,#11A3FF,Stretched
14.90990990990991,32.39298181716405,PraatF0,Praat (F0),harmonicity,#11A3FF,Stretched
14.924924924924925,32.41503513576282,PraatF0,Praat (F0),harmonicity,#11A3FF,Stretched
14.93993993993994,11.935419383183985,PraatF0,Praat (F0),harmonicity,#11A3FF,Stretched
14.954954954954955,14.479292537484664,PraatF0,Praat (F0),harmonicity,#11A3FF,Stretched
14.96996996996997,12.429361763549315,PraatF0,Praat (F0),harmonicity,#11A3FF,Stretched
14.984984984984985,12.438692498414106,PraatF0,Praat (F0),harmonicity,#11A3FF,Stretched
15,12.448690150793626,PraatF0,Praat (F0),harmonicity,#11A3FF,Stretched
