interval,rating,rating_boot_mean,rating_boot_se
11.75,-0.17908607505998408,-0.1776075322122653,0.030154773547226878
11.7505005005005,-0.17875895291547836,-0.17728224295822098,0.03006356107860228
11.751001001001,-0.1784297709382491,-0.1769549195481327,0.029972299813542224
11.751501501501501,-0.17809847734245554,-0.17662551135207338,0.02988098776951057
11.752002002002001,-0.1777650193075211,-0.17629396672194148,0.02978962292493749
11.752502502502503,-0.17742934297455432,-0.17596023298769084,0.02969820322149299
11.753003003003004,-0.17709139344341482,-0.175624256454197,0.02960672656652806
11.753503503503504,-0.17675111477044791,-0.17528598239877885,0.029515190835685885
11.754004004004004,-0.17640844996692961,-0.17494535506940234,0.029423593875689075
11.754504504504505,-0.1760633409982396,-0.17460231768359843,0.02933193350730671
11.755005005005005,-0.17571572878378564,-0.17425681242811986,0.02924020752850203
11.755505505505505,-0.1753655531977114,-0.17390878045935382,0.02914841371776606
11.756006006006006,-0.17501275307041986,-0.17355816190453216,0.029056549837640857
11.756506506506506,-0.17465726619093253,-0.1732048958637625,0.028964613638433265
11.757007007007006,-0.17429902931010274,-0.17284892041289776,0.02887260286212314
11.757507507507508,-0.17393797814474807,-0.17249017260728164,0.028780515246469043
11.758008008008009,-0.17357404738268095,-0.17212858848640045,0.028688348529312242
11.758508508508509,-0.17320717068868843,-0.17176410307945222,0.028596100453081474
11.75900900900901,-0.1728372807115071,-0.17139665041187568,0.028503768769499917
11.75950950950951,-0.17246430909177599,-0.17102616351286343,0.02841135124449742
11.76001001001001,-0.17208818647104815,-0.1706525744238829,0.02831884566332686
11.76051051051051,-0.1717088425018264,-0.170275814208228,0.02822624983588439
11.76101101101101,-0.17132620585871705,-0.16989581296164455,0.028133561602238934
11.761511511511511,-0.17094020425067538,-0.1695124998240302,0.02804077883836491
11.762012012012011,-0.17055076443438277,-0.1691258029922617,0.027947899462081
11.762512512512513,-0.170157812228809,-0.16873564973415126,0.02785492143919365
11.763013013013014,-0.16976127253093945,-0.16834196640358418,0.02776184278984527
11.763513513513514,-0.16936106933272493,-0.16794467845682245,0.02766866159506028
11.764014014014014,-0.16895712573927052,-0.16754371047004576,0.027575376003493943
11.764514514514515,-0.16854936398827594,-0.16713898615811618,0.027481984238376413
11.765015015015015,-0.16813770547077084,-0.1667304283946078,0.02738848460465069
11.765515515515515,-0.16772207075313414,-0.16631795923311626,0.027294875496299068
11.766016016016016,-0.16730237960046382,-0.16590149992987113,0.02720115540385672
11.766516516516516,-0.16687855100126925,-0.1654809709676739,0.02710732292210391
11.767017017017016,-0.16645050319354338,-0.1650562920811781,0.027013376757935557
11.767517517517518,-0.16601815369221407,-0.1646273822835272,0.02691931573839724
11.768018018018019,-0.16558141931799386,-0.1641941598943794,0.02682513881888717
11.768518518518519,-0.16514021622764194,-0.1637565425693143,0.026730845091510087
11.76901901901902,-0.16469445994566098,-0.1633144473306589,0.026636433793579564
11.76951951951952,-0.16424406539743858,-0.16286779059973158,0.026541904316260398
11.77002002002002,-0.1637889469438409,-0.16241648823052698,0.026447256213339706
11.77052052052052,-0.16332901841727213,-0.16196045554483968,0.02635248921011716
11.77102102102102,-0.16286419315920692,-0.1614996073688471,0.026257603212404168
11.771521521521521,-0.1623943840592158,-0.16103385807115822,0.026162598315622856
11.772022022022021,-0.161919503595458,-0.1605631216023263,0.02606747481398788
11.772522522522523,-0.16143946387668082,-0.16008731153583833,0.025972233209763163
11.773023023023024,-0.16095417668571305,-0.1596063411105855,0.025876874222577204
11.773523523523524,-0.16046355352443709,-0.15912012327480035,0.02578139879878425
11.774024024024024,-0.15996750566026954,-0.15862857073148054,0.025685808120853172
11.774524524524525,-0.15946594417411272,-0.1581315959852801,0.025590103616774697
11.775025025025025,-0.15895878000980673,-0.1576291113908728,0.02549428696946234
11.775525525525525,-0.158445924025036,-0.1571210292027735,0.025398360126137477
11.776026026026026,-0.15792728704370707,-0.15660726162661043,0.02530232530767312
11.776526526526526,-0.15740277990978369,-0.156087720871841,0.025206185017884786
11.777027027027026,-0.156872313542542,-0.1555623192058906,0.025109942052742633
11.777527527527528,-0.15633579899324634,-0.15503096900969862,0.025013599509489434
11.778028028028029,-0.15579314750324819,-0.15449358283466855,0.02491716079563983
11.778528528528529,-0.15524427056341503,-0.1539500734609622,0.024820629637840225
11.77902902902903,-0.15468907997494524,-0.15340035395716753,0.02472401009056785
11.77952952952953,-0.15412748791149353,-0.1528443377412678,0.024627306544645063
11.78003003003003,-0.15355940698258955,-0.1522819386429076,0.02453052373554357
11.78053053053053,-0.15298475029831743,-0.1517130709669219,0.024433666751456147
11.78103103103103,-0.15240343153520988,-0.15113764955807857,0.024336741041109528
11.781531531531531,-0.15181536500334591,-0.150555589867022,0.024239752421293236
11.782032032032031,-0.15122046571457687,-0.14996680801735598,0.02414270708407636
11.782532532532533,-0.15061864945185144,-0.14937122087383142,0.024045611603687775
11.783033033033034,-0.15000983283961888,-0.14876874611161106,0.023948472943031648
11.783533533533534,-0.14939393341519414,-0.14815930228651517,0.023851298459806228
11.784034034034034,-0.14877086970111192,-0.14754280890626129,0.023754095912206404
11.784534534534535,-0.1481405612783567,-0.14691918650258814,0.023656873464170832
11.785035035035035,-0.1475029288604386,-0.14628835670424814,0.023559639690153265
11.785535535535535,-0.14685789436823893,-0.14565024231077664,0.023462403579384172
11.786036036036036,-0.14620538100557423,-0.14500476736700377,0.023365174539593046
11.786536536536536,-0.1455453133354032,-0.14435185723821867,0.023267962400164703
11.787037037037036,-0.14487761735661647,-0.1436914386859463,0.02317077741469678
11.787537537537538,-0.14420222058131604,-0.14302343994423347,0.023073630262930595
11.788038038038039,-0.14351905211255592,-0.1423477907964121,0.022976532052025985
11.788538538538539,-0.14282804272239338,-0.1416644226522103,0.02287949431714749
11.78903903903904,-0.14212912493024685,-0.1409732686251915,0.022782529021338118
11.78953953953954,-0.1414222330814345,-0.14027426361040155,0.022685648554647546
11.79004004004004,-0.1407073034258144,-0.13956734436215107,0.022588865732488875
11.79054054054054,-0.1399842741964493,-0.13885244957185328,0.022492193793194507
11.79104104104104,-0.139253085688199,-0.13812951994582212,0.022395646394746168
11.791541541541541,-0.13851368033615163,-0.13739849828294723,0.022299237610651872
11.792042042042041,-0.1377660027937942,-0.13665932955214713,0.02220298192494454
11.792542542542543,-0.1370100000108456,-0.13591196096951003,0.0221068942262783
11.793043043043044,-0.13624562131063045,-0.13515634207503935,0.02201098980110252
11.793543543543544,-0.13547281846690346,-0.13439242480886435,0.02191528432588423
11.794044044044044,-0.13469154578004122,-0.13362016358688128,0.021819793858371392
11.794544544544545,-0.13390176015246405,-0.13283951537566002,0.021724534827865648
11.795045045045045,-0.1331034211632288,-0.13205043976656378,0.0216295240244992
11.795545545545545,-0.1322964911416403,-0.13125289904894394,0.021534778587493395
11.796046046046046,-0.13148093523982013,-0.13044685828232902,0.02144031599239244
11.796546546546546,-0.13065672150408947,-0.1296322853674891,0.021346154037258813
11.797047047047046,-0.12982382094509567,-0.12880915111627503,0.021252310827825277
11.797547547547548,-0.12898220760653212,-0.1279774293201217,0.021158804761597382
11.798048048048049,-0.12813185863240326,-0.1271370968171333,0.021065654510907476
11.798548548548549,-0.12727275433264187,-0.12628813355757995,0.020972879004915287
11.79904904904905,-0.1264048782470637,-0.12543052266778215,0.020880497410566804
11.79954954954955,-0.12552821720749252,-0.12456425051222035,0.020788529112516857
11.80005005005005,-0.1246427613979639,-0.12368930675377174,0.020696993692023484
11.80055055055055,-0.12374850441290576,-0.12280568441198578,0.020605910904832922
11.80105105105105,-0.12284544331318749,-0.12191337991927588,0.020515300658074158
11.801551551551551,-0.1219335786799348,-0.12101239317493405,0.020425182986183742
11.802052052052051,-0.12101291466600664,-0.12010272759685853,0.02033557802588889
11.802552552552553,-0.12008345904502848,-0.11918439017089862,0.02024650599028197
11.803053053053054,-0.11914522325790186,-0.11825739149772202,0.020157987142020127
11.803553553553554,-0.11819822245664985,-0.1173217458370771,0.020070041765689415
11.804054054054054,-0.11724247554556282,-0.11637747114940153,0.01998269013938162
11.804554554554555,-0.11627800521949969,-0.11542458913464987,0.01989595250553107
11.805055055055055,-0.11530483799927947,-0.11446312526825185,0.01980984904106417
11.805555555555555,-0.11432300426407514,-0.11349310883413133,0.019724399826923655
11.806056056056056,-0.11333253828071664,-0.11251457295467901,0.019639624817028453
11.806556556556556,-0.11233347822983161,-0.11152755461761378,0.019555543806738757
11.807057057057056,-0.11132586622872957,-0.11053209469963896,0.01947217640089642
11.807557557557558,-0.11030974835097987,-0.10952823798683288,0.01938954198152306
11.808058058058059,-0.10928517464260372,-0.10851603319169989,0.019307659675250985
11.808558558558559,-0.1082521991347853,-0.10749553296678563,0.01922654832057719
11.80905905905906,-0.10721087985309741,-0.10646679391484494,0.01914622643502857
11.80955955955956,-0.1061612788231302,-0.10542987659546077,0.019066712182331563
11.81006006006006,-0.10510346207250976,-0.10438484552807752,0.0189880233396856
11.81056056056056,-0.10403749962922597,-0.10333176919139236,0.0189101772652362
11.81106106106106,-0.10296346551624781,-0.10227072001906397,0.018833190865856324
11.811561561561561,-0.10188143774239038,-0.10120177439169856,0.01875708056533742
11.812062062062061,-0.10079149828937528,-0.10012501262507141,0.01868186227310086
11.812562562562563,-0.09969373309508801,-0.09904051895455913,0.018607551353537408
11.813063063063064,-0.09858823203300493,-0.09794838151577434,0.01853416259608797
11.813563563563564,-0.09747508888772717,-0.09684869232133293,0.018461710186173107
11.814064064064064,-0.0963544013266935,-0.095741547233807,0.01839020767708815
11.814564564564565,-0.09522627086799404,-0.09462704593480813,0.01831966796297039
11.815065065065065,-0.09409080284432456,-0.09350529189022412,0.018250103252953336
11.815565565565565,-0.09294810636307461,-0.09237639231159334,0.018181525046611975
11.816066066066066,-0.09179829426256216,-0.091240458113643,0.018113944110808813
11.816566566566566,-0.09064148306444174,-0.09009760386800528,0.018047370458044724
11.817067067067066,-0.08947779292229896,-0.08894794775311964,0.017981813326411866
11.817567567567568,-0.08830734756647007,-0.08779161150036521,0.017917281161248487
11.818068068068069,-0.08713027424513847,-0.08662872033646328,0.017853781598584906
11.818568568568569,-0.08594670366169158,-0.0854594029221433,0.017791321450466434
11.81906906906907,-0.08475676990847471,-0.08428379128718617,0.017729906692234326
11.81956956956957,-0.08356061039693026,-0.08310202076185208,0.017669542451840624
11.82007007007007,-0.08235836578420465,-0.08191422990475523,0.017610233001256553
11.82057057057057,-0.08115017989628923,-0.080720560427266,0.017551981750041475
11.82107107107107,-0.07993619964777356,-0.07952115711449173,0.017494791241116928
11.821571571571571,-0.0787165749582733,-0.07831616774292448,0.01743866314879101
11.822072072072071,-0.07749145866563309,-0.07710574299482773,0.017383598279064105
11.822572572572573,-0.07626100643597314,-0.0758900363694528,0.017329596572241583
11.823073073073074,-0.0750253766707169,-0.07466920409119047,0.017276657107866928
11.823573573573574,-0.07378473041061655,-0.0734434050147024,0.017224778111976546
11.824074074074074,-0.07253923123698319,-0.07221280052721356,0.01717395696667571
11.824574574574575,-0.07128904517014989,-0.0709775544480086,0.01712419022201443
11.825075075075075,-0.07003434056532237,-0.06973783292526935,0.01707547361014054
11.825575575575575,-0.06877528800592538,-0.06849380433036889,0.0170278020616904
11.826076076076076,-0.06751206019455935,-0.0672456391497381,0.016981169724374027
11.826576576576576,-0.06624483184170642,-0.06599350987443037,0.01693556998369397
11.827077077077076,-0.0649737795523117,-0.0647375908875171,0.016890995485737147
11.827577577577578,-0.0636990817103621,-0.0634780583494332,0.016847438161957207
11.828078078078079,-0.06242091836163674,-0.0622150900814463,0.01680488925587042
11.828578578578579,-0.06113947109470245,-0.06094886544731069,0.01676333935156485
11.82907907907908,-0.059854922920369424,-0.05967956523334502,0.01672277840392611
11.82957957957958,-0.05856745814971549,-0.058407371527008055,0.016683195770469963
11.83008008008008,-0.05727726227082223,-0.05713246759414642,0.01664458024466307
11.83058058058058,-0.055984521824396165,-0.05585503775506041,0.01660692009061388
11.83108108108108,-0.054689424278403544,-0.054575267259538526,0.01657020307900166
11.831581581581581,-0.05339215790189305,-0.053293342161012544,0.016534416524112968
11.832082082082081,-0.05209291163814005,-0.052009449189990564,0.016499547321847177
11.832582582582583,-0.05079187497728478,-0.05072377562691416,0.016465581988550224
11.833083083083084,-0.04948923782863083,-0.04943650917463018,0.0164325067005327
11.833583583583584,-0.04818519039270031,-0.04814783783055462,0.016400307334125053
11.834084084084084,-0.046879923033296196,-0.046857949758791866,0.016368969506124997
11.834584584584585,-0.045573626149648445,-0.045567033162282534,0.01633847861448642
11.835085085085085,-0.044266490048842005,-0.044275276155176166,0.016308819879104087
11.835585585585585,-0.04295870481866778,-0.04298286663557189,0.01627997838254466
11.836086086086086,-0.04165046020105387,-0.041689992158788776,0.016251939110581665
11.836586586586586,-0.040341945466231224,-0.04039683981131635,0.016224686992387972
11.837087087087086,-0.0390333492877818,-0.03910359608559813,0.01619820694024655
11.837587587587588,-0.03772485961872044,-0.037810446755798824,0.016172483888644174
11.838088088088089,-0.03641666356878233,-0.03651757675472604,0.016147502832611727
11.838588588588589,-0.03510894728298949,-0.03522517005199215,0.016123248865185773
11.83908908908909,-0.03380189582174051,-0.03393340953364521,0.016099707213866717
11.83958958958959,-0.03249569304248512,-0.0326424768833499,0.01607686327595592
11.84009009009009,-0.03119052148315667,-0.03135255246528112,0.01605470265266067
11.84059059059059,-0.029886562247484275,-0.030063815208861925,0.016033211181860404
11.84109109109109,-0.02858399489232564,-0.028776442495483286,0.01601237496943708
11.841591591591591,-0.027282997317139956,-0.027490610047330968,0.015992180419077066
11.842092092092091,-0.025983745655725435,-0.02620649181844825,0.015972614260458783
11.842592592592593,-0.02468641417034384,-0.024924259888151855,0.015953663575751984
11.843093093093094,-0.023391175148367083,-0.023644084356948373,0.015935315824356644
11.843593593593594,-0.02209819880149105,-0.022366133244993546,0.01591755886581961
11.844094094094094,-0.020807653167720836,-0.021090572393300703,0.015900380980876504
11.844594594594595,-0.01951970401615486,-0.019817565367732718,0.015883770890572087
11.845095095095095,-0.018234514754696653,-0.018547273365905937,0.015867717773419655
11.845595595595595,-0.016952246340784995,-0.017279855127101083,0.015852211280570405
11.846096096096096,-0.015673057195228476,-0.016015466845269794,0.015837241548969407
11.846596596596596,-0.014397103119228935,-0.014754262085226144,0.015822799212482894
11.847097097097096,-0.013124537214676445,-0.013496391702105233,0.01580887541099064
11.847597597597598,-0.011855509807781349,-0.012242003764161166,0.015795461797442373
11.848098098098099,-0.010590168376140923,-0.010991243479004192,0.01578255054288681
11.848598598598599,-0.009328657479239015,-0.00974425312327711,0.015770134339486947
11.8490990990991,-0.008071118692525452,-0.008501171975922789,0.015758206401544746
11.8495995995996,-0.006817690545062864,-0.007262136255033179,0.01574676046456272
11.8501001001001,-0.005568508460817421,-0.00602727905835799,0.015735790782378144
11.8506006006006,-0.004323704703630276,-0.004796730307516722,0.01572529212241114
11.8511011011011,-0.003083408325911892,-0.0035706166959550353,0.01571525975907457
11.851601601601601,-0.0018477451210903051,-0.002349061640682963,0.0157056894653991
11.852102102102101,-6.168375798426976e-4,-0.001132185237825936,0.015696577502932768
11.852602602602603,6.091951498696999e-4,7.989577798749552e-5,0.015687920609978933
11.853103103103104,0.0018302372989200029,0.0012870680703555265,0.01567971598824256
11.853603603603604,0.0030461765093370867,0.0024892217339964363,0.01567196128795887
11.854104104104104,0.004256903862736039,0.003686250323708418,0.01566465459158249
11.854604604604605,0.005462313904916357,0.004878050879452696,0.015657794396120174
11.855105105105105,0.006662304666604416,0.0060645239475322224,0.01565137959419311
11.855605605605605,0.007856777680347595,0.007245573597871931,0.01564540945391877
11.856106106106106,0.00904563799357141,0.008421107437406799,0.015639883597704754
11.856606606606606,0.010228794177812257,0.009591036619590727,0.0156348019800506
11.857107107107106,0.011406158334144975,0.010755275850039962,0.01563016486445539
11.857607607607608,0.012577646094829241,0.011913743388335365,0.015625972799530017
11.858108108108109,0.013743176621181926,0.013066361045984914,0.015622226594417976
11.858608608608609,0.01490267259776207,0.014213054180632997,0.01561892729362449
11.85910910910911,0.016056060222823673,0.015353751686469816,0.01561607615136027
11.85960960960961,0.01720326919513514,0.0164883859809354,0.015613674605501903
11.86011011011011,0.018344232697184135,0.017616892987736683,0.015611724251275338
11.86061061061061,0.019478887374814766,0.018739212116221964,0.015610226814764648
11.86111111111111,0.02060717331334859,0.019855286237162494,0.015609184126350475
11.861611611611611,0.021729034010240157,0.020965061654989493,0.01560859809418035
11.862112112112111,0.022844416344322365,0.02206848807654106,0.015608470677771802
11.862612612612613,0.02395327054170401,0.023165518576381335,0.015608803861847941
11.863113113113114,0.02505555013835986,0.024256109558725363,0.015609599630502275
11.863613613613614,0.026151211939531887,0.02534022071609309,0.015610859941786532
11.864114114114114,0.027240215975933905,0.02641781498468185,0.015612586702816058
11.864614614614615,0.028322525456885937,0.02748885849657968,0.01561478174547731
11.865115115115115,0.029398106720429047,0.028553320528872776,0.015617446802826304
11.865615615615615,0.030466929180496892,0.029611173449720796,0.015620583486257018
11.866116116116116,0.03152896527122151,0.030662392661478365,0.01562419326351767
11.866616616616616,0.03258419038845333,0.03170695654093922,0.015628277437646824
11.867117117117116,0.033632582828575175,0.03274484637678629,0.01563283712689825
11.867617617617618,0.03467412372469894,0.03377604630433283,0.01563787324571742
11.868118118118119,0.035708796980303374,0.034800543237616374,0.01564338648682603
11.868618618618619,0.036736589200464374,0.03581832679899037,0.01564937730446972
11.86911911911912,0.03775748962067687,0.03682938924622547,0.015655845898872978
11.86961961961962,0.0387714900334358,0.037833725397269063,0.01566279220194532
11.87012012012012,0.03977858471261871,0.03883133255272945,0.015670215864271208
11.87062062062062,0.04077877033579699,0.03982221041618861,0.015678116243417438
11.87112112112112,0.04177204590453954,0.04080636101242887,0.015686492393575956
11.871621621621621,0.04275841266283148,0.041783788603680976,0.015695343056565357
11.872122122122121,0.04373787401368412,0.0427544996039838,0.015704666654199614
11.872622622622623,0.04471043543405227,0.04371850249176215,0.015714461282028868
11.873123123123124,0.04567610438813187,0.04467580772070262,0.015724724704454608
11.873623623623624,0.0466348902391827,0.04562642762907882,0.01573545435121172
11.874124124124124,0.04758680415992753,0.04657037634756356,0.015746647315204747
11.874624624624625,0.04853185904165474,0.04750766970567844,0.015758300351682065
11.875125125125125,0.049470069402135185,0.04843832513697232,0.01577040987872472
11.875625625625625,0.0504014512924356,0.04936236158303031,0.015782971979021388
11.876126126126126,0.05132602220274792,0.050279799396424636,0.015795982402896612
11.876626626626626,0.05224380096733685,0.051190660242717026,0.015809436572555104
11.877127127127126,0.05315480766870309,0.0520949670016112,0.015823329587496864
11.877627627627628,0.05405906354108537,0.052992743667382027,0.015837656231060888
11.878128128128129,0.054956590873372235,0.053884015248656963,0.015852410978042
11.87862862862863,0.055847412911592585,0.054768807667719036,0.015867588003330876
11.87912912912913,0.056731553761021784,0.055647147659374445,0.01588318119151604
11.87962962962963,0.05760903828805655,0.05651906266953837,0.01589918414738951
11.88013013013013,0.058479892021951335,0.05738458075364371,0.015915590207293395
11.88063063063063,0.05934414105652708,0.058243730474973034,0.015932392451238512
11.88113113113113,0.06020181195195469,0.05909654080303849,0.01594958371573347
11.881631631631631,0.06105293163673295,0.05994304101211485,0.015967156607249233
11.882132132132131,0.0618975273099542,0.06078326058003965,0.015985103516253478
11.882632632632633,0.06273562634397534,0.06161722908739731,0.01600341663174325
11.883133133133134,0.06356725618759605,0.06244497611718188,0.016022087956202066
11.883633633633634,0.06439244426986718,0.06326653115509041,0.016041109320913113
11.884134134134134,0.06521121790460851,0.06408192349051049,0.016060472401556
11.884634634634635,0.06602360419577046,0.06489118211834742,0.016080168734015847
11.885135135135135,0.0668296299437242,0.0656943356417896,0.016100189730337448
11.885635635635635,0.06762932155260827,0.06649141217613246,0.01612052669475199
11.886136136136136,0.06842270493881526,0.06728243925375739,0.016141170839713486
11.886636636636636,0.06920980544073635,0.06806744373039278,0.016162113301876394
11.887137137137136,0.06999064772986689,0.0688464516927534,0.016183345157953118
11.887637637637638,0.0707652557233721,0.06961948836767974,0.01620485744039077
11.888138138138139,0.07153365249820436,0.07038657803285904,0.016226641152805046
11.88863863863864,0.07229586020691348,0.0711477439292884,0.016248687285122593
11.88913913913914,0.07305189999519092,0.07190300817551736,0.0162709868283702
11.88963963963964,0.0738017919212977,0.07265239168383103,0.016293530789070566
11.89014014014014,0.07454555487744023,0.07339591407844515,0.016316310203189306
11.89064064064064,0.07528320651321459,0.07413359361583127,0.01633931614959743
11.89114114114114,0.0760147631611886,0.07486544710726489,0.01636253976300572
11.891641641641641,0.07674023976473893,0.07559148984369922,0.01638597224633682
11.892142142142141,0.0774596498082173,0.0763117355230592,0.0164096048825028
11.892642642642643,0.07817300524954283,0.07702619618005627,0.016433429045558508
11.893143143143144,0.0788803164552924,0.07773488211859744,0.01645743621120833
11.893643643643644,0.07958159213841587,0.07843780184692771,0.016481617966645518
11.894144144144144,0.08027683929859632,0.07913496201552772,0.01650596601970468
11.894644644644645,0.08096606316538946,0.07982636735790823,0.016530472207317022
11.895145145145145,0.08164926714419185,0.08051202063435806,0.016555128503259225
11.895645645645645,0.08232645276512418,0.08119192257873613,0.01657992702518897
11.896146146146146,0.08299761963489494,0.08186607184837891,0.016604860040966864
11.896646646646646,0.0836627653917192,0.08253446497720743,0.016629919974265918
11.897147147147146,0.08432188566335978,0.08319709633209542,0.016655099409474655
11.897647647647648,0.08497497402835401,0.08385395807258195,0.0166803910959029
11.898148148148149,0.08562202198046871,0.08450504011396902,0.01670578795130169
11.89864864864865,0.08626301889648587,0.08515033009390495,0.016731283064714962
11.89914914914915,0.08689795200732077,0.08578981334247299,0.016756869698678553
11.89964964964965,0.08752680637254713,0.08642347285585736,0.016782541290791264
11.90015015015015,0.08814956485838252,0.08705128927364318,0.016808291454679512
11.90065065065065,0.08876620811916644,0.08767324085978395,0.01683411398038524
11.90115115115115,0.08937671458235792,0.08828930348728645,0.016860002834202404
11.901651651651651,0.08998106043712713,0.08889945062665419,0.016885952157999904
11.902152152152151,0.09057921962651655,0.08950365333810836,0.016911956268055826
11.902652652652653,0.09117116384324499,0.09010188026764203,0.016938009653446297
11.903153153153154,0.09175686252915106,0.09069409764689651,0.016964106974022064
11.903653653653654,0.09233628287831179,0.09128026929692416,0.016990243058009297
11.904154154154154,0.09290938984382881,0.09186035663581138,0.01701641289927987
11.904654654654655,0.0934761461483055,0.09243431869019639,0.017042611654324358
11.905155155155155,0.09403651229801954,0.09300211211068399,0.017068834638974816
11.905655655655655,0.0945904466007894,0.09356369119115482,0.01709507732491432
11.906156156156156,0.09513790518752144,0.0941190078919631,0.017121335336018655
11.906656656656656,0.09567884203744115,0.094668011867022,0.017147604444569
11.907157157157156,0.0962132090069925,0.09521065049475683,0.017173880567380163
11.907657657657658,0.09674095586237133,0.09574686891290278,0.017200159761880798
11.908158158158159,0.09726203031569065,0.09627661005712786,0.017226438222192483
11.90865865865866,0.09777637806474179,0.09679981470346116,0.01725271227524107
11.90915915915916,0.09828394283630879,0.09731642151446629,0.017278978376942485
11.90965965965966,0.09878466643301244,0.09782636708914762,0.017305233108499695
11.91016016016016,0.0992784887836278,0.09832958601652231,0.017331473172843753
11.91066066066066,0.0997653479968453,0.0988260109328242,0.017357695391257297
11.91116116116116,0.10024518041840501,0.09931557258227819,0.017383896700208186
11.911661661661661,0.10071792069156386,0.09979819988137993,0.017410074148427074
11.912162162162161,0.10118350182081862,0.10027381998662559,0.01743622489425262
11.912662662662663,0.10164185523883526,0.10074235836561479,0.01746234620327371
11.913163163163164,0.10209291087649527,0.10120373887144793,0.017488435446288312
11.913663663663664,0.10253659723601605,0.10165788382036113,0.01751449009760157
11.914164164164164,0.10297284146702873,0.10210471407248128,0.017540507733678358
11.914664664664665,0.10340156944555137,0.10254414911563467,0.0175664860321665
11.915165165165165,0.10382270585577598,0.10297610715211324,0.017592422771301335
11.915665665665665,0.10423617427456303,0.10340050518829777,0.01761831582970058
11.916166166166166,0.10464189725855648,0.10381725912703797,0.017644163186554457
11.916666666666666,0.10503979643382445,0.10422628386268132,0.017669962922214153
11.917167167167166,0.10542979258791142,0.1046274933786455,0.017695713219176932
11.917667667667668,0.10581180576421188,0.10502080084742253,0.017721412363464757
11.918168168168169,0.10618575535854263,0.10540611873288601,0.01774705874638831
11.91866866866867,0.10655156021781038,0.10578335889480525,0.017772650866687133
11.91916916916917,0.10690913874066041,0.10615243269541667,0.017798187333033136
11.91966966966967,0.10725840897997727,0.10651325110794314,0.01782366686687767
11.92017017017017,0.10759928874712645,0.10686572482692647,0.017849088305628022
11.92067067067067,0.10793169571782384,0.10720976438024837,0.017874450606127017
11.92117117117117,0.10825554753947397,0.10754528024268883,0.017899752848412675
11.921671671671671,0.10857076193990113,0.10787218295091544,0.017924994239731328
11.922172172172171,0.10887725683728525,0.1081903832197259,0.017950174118769858
11.922672672672673,0.10917495045122005,0.10849979205944402,0.017975291960080447
11.923173173173174,0.10946376141474111,0.10880032089430015,0.018000347378660405
11.923673673673674,0.10974360888717975,0.10909188168166453,0.01802534013464848
11.924174174174174,0.11001441266773297,0.10937438703198864,0.01805027013810349
11.924674674674675,0.11027609330959402,0.10964775032930474,0.018075137453820857
11.925175175175175,0.11052857223450357,0.10991188585214784,0.018099942306149572
11.925675675675675,0.11077177184761108,0.11016670889474181,0.018124685083762842
11.926176176176176,0.11100561565248011,0.11041213588831669,0.018149366344341604
11.926676676676676,0.11123002836611369,0.11064808452239604,0.01817398681912472
11.927177177177176,0.1114449360338533,0.1108744738659229,0.018198547417280084
11.927677677677679,0.11165026614404251,0.1110912244880694,0.018223049230053863
11.928178178178179,0.11184594774226468,0.1112982585785854,0.018247493534647618
11.92867867867868,0.11203191154508181,0.11149550006754994,0.018271881797782902
11.92917917917918,0.11220809005308792,0.11168287474437039,0.018296215678903324
11.92967967967968,0.1123744176631765,0.11186031037589818,0.018320497032973757
11.93018018018018,0.11253083077986954,0.11202773682351681,0.01834472791282941
11.93068068068068,0.11267726792558314,0.11218508615905287,0.018368910571033306
11.93118118118118,0.11281366984970789,0.1123322927794009,0.0183930474612028
11.931681681681681,0.11293997963636389,0.11246929351969477,0.018417141238761668
11.932182182182181,0.11305614281071104,0.11259602776491602,0.018441194761082927
11.932682682682684,0.11316210744369166,0.11271243755979533,0.018465211086983332
11.933183183183184,0.11325782425507672,0.11281846771689161,0.018489193475538707
11.933683683683684,0.11334324671471023,0.11291406592271441,0.01851314538418642
11.934184184184184,0.11341833114182288,0.1129991828417699,0.018537070466086113
11.934684684684685,0.11348303680230744,0.11307377221841697,0.018560972566713546
11.935185185185185,0.11353732600384396,0.11313779097640793,0.01858485571966414
11.935685685685685,0.11358116418877078,0.11319119931601498,0.018608724141644252
11.936186186186186,0.11361452002458469,0.1132339608086212,0.01863258222663588
11.936686686686686,0.11363736549199772,0.11326604248867847,0.018656434539219204
11.937187187187186,0.1136496759704047,0.11328741494292531,0.01868028580704361
11.937687687687689,0.11365143032072965,0.11329805239677784,0.01870414091244093
11.938188188188189,0.11364261096550475,0.11329793279778767,0.018728004883177267
11.93868868868869,0.11362320396612353,0.11328703789608181,0.018751882882345566
11.93918918918919,0.11359319909718531,0.11326535332170445,0.01877578019740239
11.93968968968969,0.11355258991784199,0.11323286865877348,0.01879970222835869
11.94019019019019,0.1135013738400808,0.11318957751637825,0.01882365447513683
11.94069069069069,0.11343955219385768,0.11313547759613649,0.018847642524108827
11.94119119119119,0.1133671302890435,0.11307057075636415,0.01887167203384027
11.941691691691691,0.11328411747408412,0.11299486307276714,0.018895748720058336
11.942192192192191,0.11319052719133865,0.1129083648956167,0.01891987833987766
11.942692692692694,0.11308637702904195,0.112811090903343,0.018944066675312128
11.943193193193194,0.1129716887698252,0.11270306015250212,0.018968319516110055
11.943693693693694,0.11284648843576331,0.11258429612406111,0.018992642641951517
11.944194194194194,0.11271080632991165,0.11245482676598029,0.019017041804050436
11.944694694694695,0.11256467707426245,0.11231468453202652,0.019041522706207455
11.945195195195195,0.11240813964413385,0.11216390641681448,0.019066090985363406
11.945695695695695,0.11224123739893099,0.1120025339870309,0.01909075219170582
11.946196196196196,0.11206401810925881,0.11183061340882149,0.019115511768382606
11.946696696696696,0.11187653398037598,0.11164819547132407,0.01914037503088193
11.947197197197196,0.11167884167196812,0.1114553356063347,0.01916534714613916
11.947697697697699,0.11147100231422268,0.1112520939040961,0.01919043311143365
11.948198198198199,0.11125308152021066,0.11103853512520055,0.01921563773313638
11.9486986986987,0.111025149394555,0.11081472870860319,0.019240965605383006
11.9491991991992,0.11078728053840534,0.11058074877576163,0.019266421088731476
11.9496996996997,0.11053955405069471,0.11033667413089092,0.019292008288880176
11.9502002002002,0.11028205352572462,0.11008258825736443,0.019317731035513055
11.9507007007007,0.11001486704704867,0.10981857931025185,0.019343592861345654
11.9512012012012,0.1097380871777068,0.10954474010504363,0.019369596981441133
11.951701701701701,0.10945181094680703,0.10926116810255301,0.01939574627286878
11.952202202202201,0.1091561398324748,0.10896796539004622,0.019422043254777383
11.952702702702704,0.10885117974122059,0.10866523865862192,0.019448490068953092
11.953203203203204,0.10853704098373637,0.1083530991768712,0.01947508846093202
11.953703703703704,0.10821383824714363,0.10803166276085656,0.01950183976173753
11.954204204204204,0.10788169056376203,0.10770104974045988,0.019528744870310207
11.954704704704705,0.10754072127641003,0.1073613849221291,0.01955580423669409
11.955205205205205,0.10719105800028825,0.10701279754807608,0.019583017846046623
11.955705705705705,0.10683283258150057,0.10665542125198575,0.019610385203533136
11.956206206206206,0.10646618105224186,0.10628939401126829,0.01963790532016305
11.956706706706706,0.10609124358272752,0.10591485809593307,0.019665576699629636
11.957207207207206,0.10570816442988806,0.10553196001412245,0.01969339732620092
11.957707707707709,0.10531709188292253,0.10514085045438008,0.019721364653717547
11.958208208208209,0.10491817820573437,0.10474168422471815,0.019749475595741806
11.95870870870871,0.10451157957632884,0.10433462018852971,0.019777726516903706
11.95920920920921,0.1040974560232302,0.10391982119743921,0.019806113225481304
11.95970970970971,0.10367597135898987,0.10349745402114534,0.019834630967253113
11.96021021021021,0.103247293110842,0.10306768927433331,0.01986327442065317
11.96071071071071,0.10281159244857943,0.10263070134072673,0.019892037693259385
11.96121121121121,0.102369044109722,0.1021866682943593,0.019920914319633224
11.961711711711711,0.10191982632205339,0.10173577181813852,0.019949897260534637
11.962212212212211,0.10146412072358446,0.10127819711978019,0.019978978903524153
11.962712712712714,0.10100211228003582,0.10081413284519845,0.0200081510649632
11.963213213213214,0.1005339891999072,0.10034377098942776,0.02003740499341668
11.963713713713714,0.10005994284720429,0.09986730680515268,0.020066731374462198
11.964214214214214,0.09958016765191306,0.09938493870894093,0.020096120336897328
11.964714714714715,0.09909486101829533,0.0988968681852585,0.02012556146034275
11.965215215215215,0.09860422323108027,0.09840329968834298,0.020155043784223895
11.965715715715715,0.0981084573596472,0.09790444054203458,0.020184555818118784
11.966216216216216,0.09760776916024626,0.09740050083763288,0.02021408555344825
11.966716716716716,0.09710236697639664,0.0968916933298909,0.0202436204764853
11.967217217217216,0.09659246163747665,0.09637823333119681,0.020273147582654534
11.967717717717719,0.09607826635563796,0.09586033860406666,0.02030265339208904
11.968218218218219,0.09555999662110704,0.09533822925201364,0.020332123966408128
11.96871871871872,0.09503787009595195,0.0948121276088761,0.020361544926677206
11.96921921921922,0.09451210650639738,0.0942822581267087,0.020390901472505028
11.96971971971972,0.09398292753379298,0.09374884726231472,0.020420178402235034
11.97022022022022,0.09345055670427677,0.09321212336249696,0.020449360134178064
11.97072072072072,0.09291521927725004,0.09267231654812678,0.020478430728837694
11.97122122122122,0.09237714213272644,0.09212965859711116,0.020507373912073697
11.971721721721721,0.09183655365764014,0.09158438282633481,0.02053617309914357
11.972222222222221,0.09129368363120258,0.0910367239726814,0.020564811419569638
11.972722722722724,0.09074876310936499,0.09048691807319056,0.020593271742765446
11.973223223223224,0.09020202430850176,0.0899352023444658,0.02062153670436218
11.973723723723724,0.08965370048834578,0.08938181506137964,0.020649588733172197
11.974224224224224,0.08910402583430513,0.08882699543519008,0.020677410078722386
11.974724724724725,0.08855323533919596,0.08827098349113056,0.020704982839294814
11.975225225225225,0.08800156468449298,0.08771401994555575,0.020732288990404114
11.975725725725725,0.08744925012116411,0.08715634608273044,0.02075931041365031
11.976226226226226,0.08689652835016344,0.08659820363132589,0.020786028925872776
11.976726726726726,0.08634363640266139,0.08603983464071269,0.020812426308543762
11.977227227227226,0.0857908115200712,0.08548148135712035,0.020838484337329367
11.977727727727729,0.08523829103397282,0.0849233860997362,0.020864184811754845
11.978228228228229,0.08468631224596386,0.08436579113683138,0.02088950958490134
11.97872872872873,0.08413511230754829,0.08380893856195568,0.02091444059307546
11.97922922922923,0.08358492810009747,0.08325307017031251,0.02093895988537699
11.97972972972973,0.083035996114979,0.0826984273353522,0.02096304965310607
11.98023023023023,0.08248855233390018,0.08214525088567348,0.020986692258945082
11.98073073073073,0.0819428321095483,0.08159378098228376,0.021009870265847944
11.98123123123123,0.08139907004656909,0.08104425699630062,0.02103256646558019
11.981731731731731,0.08085749988297794,0.08049691738715277,0.021054763906847886
11.982232232232231,0.08031835437203762,0.07995199958134207,0.02107644592295317
11.982732732732734,0.07978186516468157,0.07940973985183615,0.02109759615892552
11.983233233233234,0.07924826269254248,0.07887037319815796,0.021118198598066063
11.983733733733734,0.07871777605162912,0.0783341332272111,0.02113823758785703
11.984234234234235,0.07819063288673093,0.07780125203492858,0.021157697865178952
11.984734734734735,0.07766705927659892,0.07727196008879049,0.021176564580789817
11.985235235235235,0.07714727961995145,0.07674648611126435,0.02119482332301359
11.985735735735735,0.07663151652237878,0.0762250569642332,0.021212460140596242
11.986236236236236,0.07611999068417936,0.07570789753446418,0.021229461564681508
11.986736736736736,0.07561292078919957,0.0751952306201649,0.02124581462986407
11.987237237237236,0.07511052339471361,0.07468727681869475,0.02126150689428559
11.987737737737739,0.0746130128224148,0.07418425441547023,0.021276526458726422
11.988238238238239,0.0741206010505519,0.07368637927412795,0.021290861984666804
11.98873873873874,0.07363349760725962,0.07319386472797748,0.02130450271127821
11.98923923923924,0.07315190946515152,0.0727069214728166,0.021317438471316803
11.98973973973974,0.07267604093720688,0.0722257574611383,0.02132965970588751
11.99024024024024,0.07220609357399863,0.07175057779778933,0.021341157478056413
11.99074074074074,0.07174226606232467,0.0712815846371177,0.02135192348528299
11.99124124124124,0.07128475412526608,0.07081897708166347,0.021361950070654848
11.991741741741741,0.07083375042374307,0.07036295108243033,0.021371230232901144
11.992242242242241,0.07038944445958825,0.06991369934078855,0.02137975763517318
11.992742742742744,0.06995202248020153,0.0694714112120468,0.02138752661257207
11.993243243243244,0.06952166738482192,0.06903627261074596,0.02139453217841772
11.993743743743744,0.06909855863245166,0.06860846591769529,0.021400770029242712
11.994244244244245,0.06868287215149287,0.06818816988882198,0.021406236548511377
11.994744744744745,0.06827478025111569,0.06777555956584846,0.021410928809052522
11.995245245245245,0.06787445153442653,0.06737080618885359,0.02141484457420951
11.995745745745745,0.06748205081344774,0.0669740771107488,0.021417982297704755
11.996246246246246,0.06709773902597183,0.06658553571371013,0.021420341122221426
11.996746746746746,0.06672167315431542,0.06620534132760478,0.021421920876709546
11.997247247247246,0.06635400614602131,0.06583364915044984,0.021422722072423565
11.997747747747749,0.06599488683653808,0.06547061017093593,0.021422745897700886
11.998248248248249,0.06564445987392968,0.06511637109306401,0.021421994211494714
11.99874874874875,0.06530286564562847,0.0647710742629039,0.02142046953567629
11.99924924924925,0.0649702402072974,0.06443485759754897,0.021418175046126257
11.99974974974975,0.0646467152138164,0.06410785451626395,0.02141511456263057
12.00025025025025,0.06433241785243562,0.06379019387388454,0.02141129253760944
12.00075075075075,0.06402747077814039,0.06348199989648903,0.02140671404369973
12.00125125125125,0.06373199205123971,0.06318339211938014,0.021401384760220344
12.001751751751751,0.06344609507724343,0.06289448532740795,0.021395310958551
12.002252252252251,0.063169888549033,0.06261538949766457,0.02138849948645481
12.002752752752754,0.06290347639138114,0.062346209744584234,0.021380957751381297
12.003253253253254,0.06264695770783932,0.062087046267475396,0.02137269370278442
12.003753753753754,0.06240042673003302,0.06183799430051474,0.02136371581349667
12.004254254254255,0.062163972769388204,0.06159914406523666,0.021354033060200207
12.004754754754755,0.061937680171335975,0.061370580725542176,0.021343654903037093
12.005255255255255,0.0617216282720057,0.06115238434525479,0.02133259126440556
12.005755755755755,0.06151589135744793,0.06094462984825371,0.021320852506990323
12.006256256256256,0.061320538625419835,0.06074738698120702,0.021308449411074033
12.006756756756756,0.06113563414974477,0.060560720278932834,0.021295393151185643
12.007257257257256,0.060961236847294466,0.06038468903241015,0.02128169527213249
12.007757757757759,0.06079740044760051,0.06021934725946504,0.02126736766447812
12.008258258258259,0.060644173465140935,0.060064743678160254,0.02125242253951712
12.00875875875876,0.06050159917430311,0.05992092168289496,0.0212368724038075
12.00925925925926,0.060369715587065276,0.05978791932325324,0.021220730033318203
12.00975975975976,0.06024855543341844,0.059665769285612305,0.021204008447255337
12.01026026026026,0.06013814614453434,0.059554498877529935,0.021186720881624727
12.01076076076076,0.06003850983871967,0.0594541300149284,0.021168880762596785
12.01126126126126,0.05994966331016406,0.05936467921209792,0.021150501679736537
12.011761761761761,0.05987161802049911,0.0592861575745266,0.02113159735916063
12.012262262262261,0.05980438009319722,0.05921857079457669,0.021112181636690156
12.012762762762764,0.05974795031081108,0.05916191915001919,0.02109226843105933
12.013263263263264,0.059702324115075624,0.05911619750543999,0.02107187171725103
12.013763763763764,0.05966749160989056,0.059081395316524496,0.021051005500017695
12.014264264264265,0.059643437567175696,0.05905749663723228,0.021029683787657624
12.014764764764765,0.0596301414356364,0.05904448012986998,0.021007920566109835
12.015265265265265,0.05962757735242009,0.059042319078069394,0.020985729773430162
12.015765765765765,0.05963571415768974,0.05905098140266851,0.020963125274712252
12.016266266266266,0.05965451541210938,0.059070429680509386,0.020940120837516615
12.016766766766766,0.05968393941724594,0.05910062116614412,0.020916730107867095
12.017267267267266,0.05972393923889067,0.059141507816455094,0.020892966586875557
12.017767767767769,0.05977446273330044,0.05919303631818336,0.020868843608051066
12.018268268268269,0.05983545257634877,0.05925514811836275,0.020844374315351775
12.01876876876877,0.059906846295593626,0.05932777945765544,0.020819571642030795
12.01926926926927,0.05998857630524495,0.059410861406576726,0.020794448290330395
12.01976976976977,0.06008056994402596,0.05950431990460294,0.0207690167120723
12.02027027027027,0.06018274951592618,0.059608075802151356,0.020743289090191897
12.02077077077077,0.06029503233381197,0.05972204490541039,0.020717277321258047
12.02127127127127,0.06041733076590894,0.0598461380240207,0.02069099299902384
12.021771771771771,0.06054955228510906,0.059980261021567484,0.020664447399041653
12.022272272272271,0.06069159952110456,0.06012431486888277,0.02063765146437978
12.022772772772774,0.06084337031531411,0.06027819570012337,0.020610615792470584
12.023273273273274,0.06100475777857894,0.06044179487160314,0.02058335062312026
12.023773773773774,0.061175650351610905,0.060614999023359026,0.020555865827699474
12.024274274274275,0.061355931868149034,0.060797690143407954,0.020528170899541318
12.024774774774775,0.06154548162080092,0.06098974563467741,0.0205002749455572
12.025275275275275,0.06174417442954046,0.06119103838456593,0.020472186679087526
12.025775775775776,0.061951880712804525,0.061401436837099456,0.02044391441399189
12.026276276276276,0.062168466561179726,0.06162080506765105,0.020415466059987897
12.026776776776776,0.06239379381360625,0.061849002860172114,0.02038684911923439
12.027277277277276,0.06262772013608284,0.062085885786901863,0.02035807068415791
12.027777777777779,0.06287009910279928,0.0623313052905033,0.020329137436515037
12.028278278278279,0.06312078027967356,0.06258510876857697,0.02030005564767842
12.02877877877878,0.0633796093102193,0.06284713966050876,0.020270831180129862
12.02927927927928,0.06364642800370891,0.06311723753659118,0.020241469490142806
12.02977977977978,0.06392107442555359,0.0633952381893643,0.020211975631630828
12.03028028028028,0.06420338298986858,0.06368097372712268,0.020182354261132542
12.03078078078078,0.0644931845541378,0.06397427266952525,0.020152609643907724
12.03128128128128,0.06479030651592385,0.06427496004524336,0.020122745661103378
12.031781781781781,0.06509457291156169,0.06458285749158707,0.020092765817959844
12.032282282282281,0.06540580451676282,0.06489778335604439,0.02006267325301269
12.032782782782784,0.0657238189490568,0.06521955279965341,0.02003247074824486
12.033283283283284,0.06604843077199499,0.06554797790214605,0.020002160740150297
12.033783783783784,0.06637945160106143,0.06588286776879412,0.019971745331651348
12.034284284284285,0.06671669021118325,0.06622402863886612,0.019941226304826587
12.034784784784785,0.06705995264578402,0.06657126399563143,0.01991060513439041
12.035285285285285,0.06740904232728809,0.066924374677828,0.019879883001873128
12.035785785785786,0.06776376016900035,0.06728315899251072,0.019849060810442836
12.036286286286286,0.0681239046882688,0.06764741282919982,0.019818139200310832
12.036786786786786,0.06848927212084631,0.06801692977524122,0.01978711856466189
12.037287287287286,0.06885965653636823,0.06839150123229833,0.019755999066049534
12.037787787787789,0.06923484995484605,0.06877091653387891,0.01972478065319308
12.038288288288289,0.06961464246409295,0.06915496306381103,0.019693463078119543
12.03878878878879,0.06999882233798907,0.06954342637558597,0.019662045913581314
12.03928928928929,0.07038717615548849,0.06993609031245618,0.019630528570696866
12.03978978978979,0.07077948892026881,0.07033273712821309,0.019598910316745193
12.04029029029029,0.0711755441809428,0.0707331476085384,0.019567190293058784
12.04079079079079,0.07157512415171921,0.0711371011928424,0.019535367532951743
12.04129129129129,0.07197800983341171,0.07154437609648104,0.019503440979624715
12.041791791791791,0.07238398113472377,0.07195474943326795,0.019471409503989616
12.042292292292291,0.07279281699367664,0.07236799733816993,0.019439271922356123
12.042792792792794,0.07320429549909692,0.07278389509009764,0.019407027013925326
12.043293293293294,0.07361819401207025,0.07320221723467943,0.019374673538037256
12.043793793793794,0.07403428928724365,0.07362273770694372,0.019342210251121632
12.044294294294295,0.07445235759388948,0.0740452299537737,0.019309635923299297
12.044794794794795,0.07487217483662291,0.07446946705606759,0.01927694935459283
12.045295295295295,0.07529351667567545,0.07489522185048533,0.01924414939069599
12.045795795795796,0.07571615864662357,0.07532226705068629,0.01921123493826121
12.046296296296296,0.07613987627947312,0.07575037536796649,0.01917820497966928
12.046796796796796,0.07656444521699689,0.07617931963117981,0.019145058587236148
12.047297297297296,0.07698964133223533,0.07660887290586152,0.01911179493683169
12.047797797797799,0.07741524084505165,0.07703880861244566,0.019078413320871287
12.048298298298299,0.07784102043764393,0.07746890064347899,0.019044913160657227
12.0487987987988,0.07826675736894556,0.0778989234797496,0.019011294018038902
12.0492992992993,0.07869222958777058,0.0783286523052093,0.018977555606374607
12.0497997997998,0.0791172158446529,0.07875786312061904,0.018943697800770102
12.0503003003003,0.07954149580227028,0.07918633285581406,0.018909720647581573
12.0508008008008,0.07996485014436565,0.07961383948049813,0.018875624373165263
12.0513013013013,0.080387060683071,0.08004016211348032,0.018841409391865637
12.051801801801801,0.08080791046455661,0.08046508113025923,0.018807076313232144
12.052302302302301,0.08122718387291718,0.08088837826887887,0.0187726259484612
12.052802802802804,0.0816446667322063,0.08130983673396328,0.01873805931605935
12.053303303303304,0.08206014640655068,0.08172924129884672,0.01870337764673161
12.053803803803804,0.08247341189825692,0.0821463784057325,0.018668582387490695
12.054304304304305,0.08288425394382663,0.08256103626378115,0.018633675205002878
12.054804804804805,0.0832924651078349,0.08297300494507137,0.01859865798817018
12.055305305305305,0.08369783987456975,0.0833820764783519,0.018563532849966667
12.055805805805806,0.08410017473738217,0.0837880449405105,0.018528302128534804
12.056306306306306,0.08449926828567665,0.08419070654570292,0.01849296838756403
12.056806806806806,0.08489492128948133,0.08458985973206731,0.01845753441596561
12.057307307307306,0.0852869367815314,0.08498530524596004,0.018422003226861546
12.057807807807809,0.0856751201368294,0.08537684622367092,0.018386378055915028
12.058308308308309,0.08605927914959577,0.08576428827052934,0.018350662359019037
12.05880880880881,0.08643922410759418,0.08614743953738942,0.01831485980937127
12.05930930930931,0.08681476786375872,0.08652611079440307,0.018278974293961376
12.05980980980981,0.08718572590510162,0.08690011550206646,0.018243009909499276
12.06031031031031,0.08755191641883059,0.0872692698794729,0.01820697095781067
12.06081081081081,0.08791316035568107,0.0876333929697481,0.01817086194073121
12.06131131131131,0.08826928149038696,0.08799230670262152,0.01813468755453374
12.061811811811811,0.08862010647929199,0.08834583595410476,0.018098452683913874
12.062312312312311,0.08896546491505637,0.08869380860324305,0.01806216239557196
12.062812812812814,0.08930518937844867,0.08903605558592008,0.018025821931422596
12.063313313313314,0.0896391154871858,0.08937241094568073,0.017989436701465737
12.063813813813814,0.08996708194183668,0.08970271188157125,0.017953012276351026
12.064314314314315,0.09028893056874,0.09002679879296263,0.017916554379674564
12.064814814814815,0.0906045063599502,0.09034451532135186,0.017880068880036053
12.065315315315315,0.09091365751020702,0.09065570838913863,0.01784356178289467
12.065815815815816,0.0912162354509166,0.09096022823535894,0.01780703922225543
12.066316316316316,0.09151209488115046,0.09125792844838813,0.01777050745221914
12.066816816816816,0.09180109379567528,0.09154866599560599,0.017733972838432106
12.067317317317316,0.09208309351000711,0.09183230125003161,0.0176974418494618
12.067817817817819,0.09235795868251938,0.09210869801393723,0.01766092104813611
12.068318318318319,0.09262555733360456,0.09237772353945559,0.017624417082875314
12.06881881881882,0.09288576086192464,0.09263924854619589,0.017587936679042262
12.06931931931932,0.0931384440577626,0.09289314723588384,0.017551486630348605
12.06981981981982,0.0933834851134881,0.09313929730404924,0.01751507379033426
12.07032032032032,0.09362076563121197,0.09337757994880182,0.017478705063957923
12.07082082082082,0.09385017062759798,0.09360787987669275,0.017442387399313083
12.07132132132132,0.09407158853591989,0.09383008530572996,0.017406127779502532
12.071821821821821,0.09428491120537183,0.09404408796555624,0.017369933214688698
12.072322322322321,0.09449003389768676,0.0942497830948445,0.017333810734343286
12.072822822822824,0.09468685528110062,0.09444706943594289,0.017297767379714873
12.073323323323324,0.09487527742170666,0.09463584922681388,0.01726181019653365
12.073823823823824,0.09505520577226592,0.0948160281903281,0.01722594622796894
12.074324324324325,0.09522654915848658,0.0949875155209376,0.017190182507853664
12.074824824824825,0.09538921976287842,0.09515022386880691,0.01715452605419095
12.075325325325325,0.09554313310619544,0.09530406932144264,0.01711898386295443
12.075825825825826,0.09568820802654598,0.09544897138287775,0.017083562902187176
12.076326326326326,0.09582436665622343,0.09558485295047821,0.01704827010641447
12.076826826826826,0.09595153439632816,0.09571164028942984,0.01701311237137169
12.077327327327327,0.09606963988923453,0.09582926300496702,0.016978096549053575
12.077827827827829,0.09617861498897534,0.09593765401241447,0.016943229443088403
12.078328328328329,0.09627839472961071,0.09603674950509956,0.0169085178044353
12.07882882882883,0.0963689172916539,0.09612648892022338,0.016873968327409578
12.07932932932933,0.09645012396661308,0.09620681490274026,0.01683958764602764
12.07982982982983,0.09652195911973972,0.09627767326733105,0.016805382330673472
12.08033033033033,0.09658437015103528,0.0963390129585426,0.01677135888507757
12.08083083083083,0.09663730745461237,0.09639078600916597,0.0167375237436028
12.08133133133133,0.09668072437646417,0.0964329474969302,0.016703883268830173
12.081831831831831,0.0967145771707378,0.09646545549959229,0.016670443749433057
12.082332332332332,0.09673882495457281,0.09648827104849401,0.01663721139832941
12.082832832832834,0.09675342966159006,0.09650135808067759,0.016604192351102193
12.083333333333334,0.09675835599410526,0.09650468338962212,0.016571392664670767
12.083833833833834,0.09675357137415361,0.09649821657469819,0.01653881831620133
12.084334334334335,0.09673904589338,0.09648192998940905,0.01650647520224167
12.084834834834835,0.0967147522619085,0.09645579868850555,0.016474369138061933
12.085335335335335,0.09668066575624096,0.09641980037405336,0.016442505857185645
12.085835835835836,0.09663676416626615,0.09637391534053241,0.016410891011093064
12.086336336336336,0.09658302774147898,0.0963181264190512,0.016379530169077717
12.086836836836836,0.09651943913645261,0.09625241892075671,0.01634842881823782
12.087337337337337,0.09644598335567349,0.09617678057951819,0.016317592363583794
12.087837837837839,0.0963626476977936,0.0960912014939652,0.01628702612824091
12.088338338338339,0.09626942169938833,0.09599567406896255,0.016256735353727684
12.08883883883884,0.09616629707828217,0.09589019295659354,0.016226725200290677
12.08933933933934,0.09605326767652898,0.09577475499673455,0.01619700074727533
12.08983983983984,0.09593032940311809,0.09564935915730052,0.016167566993511902
12.09034034034034,0.09579748017646263,0.0955140064742278,0.016138428857699786
12.09084084084084,0.09565471986676659,0.09536869999127834,0.016109591178767445
12.09134134134134,0.09550205023831702,0.09521344469973282,0.016081058716190817
12.091841841841841,0.0953394748917845,0.0950482474780532,0.0160528361502538
12.092342342342342,0.09516699920659197,0.09487311703156942,0.01602492808222785
12.092842842842844,0.09498463028341558,0.09468806383228287,0.015997339034459455
12.093343343343344,0.09479237688689518,0.09449310005883474,0.015970073450346095
12.093843843843844,0.09459024938859163,0.09428823953671438,0.015943135694185706
12.094344344344345,0.09437825971028133,0.09407349767877381,0.01591653005088673
12.094844844844845,0.0941564212676215,0.09384889142610647,0.0158902607255228
12.095345345345345,0.09392474891426443,0.09361443918935976,0.01586433184272521
12.095845845845846,0.09368325888645607,0.0933701607905281,0.01583874744589527
12.096346346346346,0.09343196874818922,0.09311607740529819,0.015813511496233727
12.096846846846846,0.09317089733695996,0.09285221150599286,0.01578862787157447
12.097347347347347,0.09290006471016736,0.09257858680516944,0.015764100365017807
12.097847847847849,0.09261949209220897,0.09229522819992576,0.01573993268335873
12.098348348348349,0.09232920182233709,0.09200216171696628,0.01571612844530295
12.09884884884885,0.09202921730329003,0.09169941445846479,0.01569269117947371
12.09934934934935,0.09171956295074668,0.09138701454878237,0.015669624322202664
12.09984984984985,0.09140026414367519,0.09106499108207707,0.015646931215110856
12.10035035035035,0.09107134717556842,0.09073337407084625,0.015624615102479327
12.10085085085085,0.09073283920664045,0.09039219439544409,0.015602679128414116
12.10135135135135,0.09038476821698647,0.09004148375460655,0.015581126333811746
12.101851851851851,0.09002716296077268,0.08968127461702188,0.015559959653132109
12.102352352352352,0.08966005292144723,0.08931160017397838,0.015539181910987597
12.102852852852854,0.08928346826803595,0.0889324942931184,0.015518795818558561
12.103353353353354,0.08889743981253047,0.08854399147333107,0.015498803969849217
12.103853853853854,0.08850199896838504,0.08814612680079885,0.015479208837793447
12.104354354354355,0.08809717771016774,0.08773893590623533,0.015460012770229731
12.104854854854855,0.08768300853437021,0.08732245492333263,0.015441217985758753
12.105355355355355,0.08725952442138887,0.08689672044842234,0.01542282656950199
12.105855855855856,0.08682675879871629,0.08646176950139936,0.01540484046878196
12.106356356356356,0.08638474550533294,0.08601763948788467,0.015387261488740563
12.106856856856856,0.08593351875732609,0.08556436816268045,0.015370091287921623
12.107357357357357,0.08547311311474746,0.08510199359449458,0.0153533313738363
12.107857857857859,0.08500356344970163,0.08463055413196677,0.015336983098535182
12.108358358358359,0.08452490491570916,0.08415008837100227,0.015321047654214848
12.10885885885886,0.08403717291830137,0.08366063512339685,0.015305526068878408
12.10935935935936,0.08354040308689265,0.08316223338679034,0.015290419202079738
12.10985985985986,0.08303463124791732,0.08265492231592707,0.015275727740776197
12.11036036036036,0.08251989339922407,0.0821387411952359,0.015261452195316995
12.11086086086086,0.08199622568574157,0.08161372941271884,0.015247592895594195
12.11136136136136,0.08146366437640826,0.08107992643515757,0.015234149987381495
12.111861861861861,0.08092224584236232,0.08053737178462667,0.015221123428893035
12.112362362362362,0.08037200653638428,0.07998610501630828,0.015208512987584017
12.112862862862864,0.07981298297359773,0.07942616569760363,0.015196318237223772
12.113363363363364,0.07924521171341603,0.07885759338854183,0.0151845385552686
12.113863863863864,0.07866872934270987,0.07828042762344596,0.015173173120556787
12.114364364364365,0.07808357246022231,0.07769470789389098,0.015162220911358321
12.114864864864865,0.07748977766219099,0.0771004736329086,0.015151680703798083
12.115365365365365,0.07688738152917514,0.07649776420043213,0.015141551070682518
12.115865865865866,0.07627642061409214,0.07588661886998485,0.015131830380751075
12.116366366366366,0.07565693143141414,0.07526707681657212,0.015122516798374501
12.116866866866866,0.07502895044754991,0.07463917710578123,0.015113608283725651
12.117367367367367,0.07439251407237708,0.07400295868406548,0.015105102593438053
12.117867867867869,0.07374765865190791,0.07335846037019061,0.015096997281776894
12.118368368368369,0.07309442046209388,0.07270572084784957,0.015089289702337647
12.11886886886887,0.0724328357037136,0.07204477865937833,0.01508197701028814
12.11936936936937,0.0717629404983698,0.07137567220061455,0.01507505616517168
12.11986986986987,0.07108477088555915,0.07069843971683729,0.015068523934283814
12.12037037037037,0.07039836282078342,0.07001311929978062,0.01506237689663236
12.12087087087087,0.06970375217471288,0.06931974888570613,0.015056611447493479
12.121371371371371,0.0690009747333562,0.06861836625450823,0.01505122380357149
12.121871871871871,0.06829006619923715,0.06790900902983057,0.015046210008766343
12.122372372372372,0.06757106219354758,0.06719171468017984,0.015041565940556782
12.122872872872874,0.066843998259256,0.06646652052100276,0.015037287316998403
12.123373373373374,0.06610890986517505,0.06573346371773461,0.015033369704339812
12.123873873873874,0.06536583241091666,0.06499258128974165,0.01502980852525251
12.124374374374375,0.06461480123277599,0.06424391011520528,0.015026599067674012
12.124874874874875,0.06385585161048361,0.06348748693687525,0.01502373649425606
12.125375375375375,0.06308901877481395,0.06272334836869325,0.01502121585241205
12.125875875875876,0.06231433791603679,0.06195153090325837,0.015019032084953135
12.126376376376376,0.06153184419318192,0.06117207092011711,0.015017180041301629
12.126876876876876,0.06074157274410119,0.06038500469485247,0.015015654489268605
12.127377377377377,0.05994355869630849,0.05959036840895651,0.015014450127378452
12.127877877877879,0.05913783717856728,0.05878819816045819,0.0150135615977257
12.128378378378379,0.05832444333322677,0.05797852997530174,0.015012983499340653
12.12887887887888,0.05750341232924285,0.05716139981941913,0.01501271040204725
12.12937937937938,0.05667477937591644,0.05633684361152543,0.015012736860785726
12.12987987987988,0.055838579737292414,0.05550489723657614,0.015013057430376982
12.13038038038038,0.054994848747196484,0.054665596559887654,0.0150136666807032
12.13088088088088,0.05414362182491992,0.05381897744189209,0.01501455921227338
12.131381381381381,0.05328493449149156,0.05296507575350942,0.015015729672146575
12.131881881881881,0.05241882238654459,0.05210392739211677,0.01501717277017965
12.132382382382382,0.051545321285741734,0.05123556829809477,0.015018883295567215
12.132882882882884,0.05066446711874562,0.05036003447193108,0.015020856133639873
12.133383383383384,0.04977629598771509,0.04947736199187344,0.015023086282883102
12.133883883883884,0.048880844186278694,0.048587587032075365,0.015025568872142297
12.134384384384385,0.047978148219010135,0.04769074588126849,0.015028299177973617
12.134884884884885,0.047068244821344606,0.046786874961904194,0.015031272642102645
12.135385385385385,0.04615117097993393,0.045876010849755094,0.015034484888949984
12.135885885885886,0.04522696395340901,0.044958190293962155,0.01503793174318272
12.136386386386386,0.044295661293533586,0.044033450237501236,0.015041609247248853
12.136886886886886,0.04335730086672265,0.04310182783805605,0.015045513678853229
12.137387387387387,0.04241192087590552,0.04216336048927122,0.015049641568329398
12.137887887887889,0.0414595598827049,0.04121808584236848,0.015053989715865258
12.138388388388389,0.04050025682993278,0.04026604182812312,0.015058555208535752
12.13888888888889,0.03953405106432194,0.03930726667912946,0.01506333543709851
12.13938938938939,0.03856098235954718,0.03834179895240678,0.015068328112507304
12.13988988988989,0.0375810909394501,0.03736967755226761,0.015073531282095527
12.14039039039039,0.036594417501474824,0.03639094175345594,0.01507894334538703
12.14089089089089,0.035601003240273786,0.035405631224522914,0.015084563069484488
12.141391391391391,0.03460088987147409,0.03441378605142425,0.015090389603992586
12.141891891891891,0.033594119655561194,0.033415446761314804,0.015096422495428297
12.142392392392392,0.0325807354218705,0.032410654346518956,0.015102661701074105
12.142892892892894,0.03156078059264447,0.03139945028864672,0.015109107602226352
12.143393393393394,0.03053429920715872,0.030381876582861272,0.015115761016798254
12.143893893893894,0.02950133594582982,0.029357975762212496,0.015122623211229211
12.144394394394395,0.028461936154354276,0.028327790922087776,0.015129695911658844
12.144894894894895,0.027416145867790658,0.02729136574470096,0.015136981314323646
12.145395395395395,0.02636401183458584,0.02624874452361492,0.015144482095132843
12.145895895895896,0.02530558154050305,0.02519997218826734,0.015152201418383441
12.146396396396396,0.024240903232433577,0.024145094328475048,0.015160142944575863
12.146896896896896,0.02317002594205038,0.023084157218886812,0.015168310837289834
12.147397397397397,0.022092999509282354,0.02201720784335835,0.01517670976908493
12.147897897897899,0.02100987460557118,0.020944293919217326,0.015185344926390947
12.148398398398399,0.019920702756901786,0.01986546392141046,0.015194222013352066
12.1488988988989,0.018825536366517744,0.018780767106446515,0.015203347254595873
12.1493993993994,0.017724428737368254,0.01769025353618139,0.015212727396895333
12.1498998998999,0.01661743409419292,0.016593974101355272,0.015222369709695954
12.1504004004004,0.015504607605239812,0.015491980544875637,0.015232281984483922
12.1509009009009,0.014386005403573652,0.01438432548480741,0.015242472532970765
12.151401401401401,0.013261684607946123,0.013271062437038095,0.015252950184073768
12.151901901901901,0.012131703343191509,0.012152245837585805,0.015263724279674975
12.152402402402402,0.010996120760115824,0.011027931064514935,0.015274804669143537
12.152902902902904,0.00985499705483879,0.009898174459420596,0.015286201702607787
12.153403403403404,0.00870839348758097,0.008763033348472983,0.015297926222969589
12.153903903903904,0.0075563724008013075,0.007622566062924733,0.01530998955665443
12.154404404404405,0.00639899723672926,0.006476831959126664,0.015322403503094575
12.154904904904905,0.005236332554198346,0.005325891437955393,0.015335180322945457
12.155405405405405,0.004068444044771586,0.004169805963641835,0.015348332725042095
12.155905905905906,0.00289539854811891,0.0030086380819591687,0.015361873852101221
12.156406406406406,0.0017172640666138605,0.0018424514377351315,0.015375817265183117
12.156906906906906,5.341097791157085e-4,6.713107916513888e-4,0.015390176926928288
12.157407407407407,-6.539939460967194e-4,-5.047179637055667e-4,0.01540496718358939
12.157907907907909,-0.0018469755392766954,-0.0016855677885833963,0.01542020274588195
12.158408408408409,-0.0030447622180534433,-0.0028711704816021585,0.015435898668683315
12.15890890890891,-0.0042472799772645085,-0.004061456666192256,0.015452070329611217
12.15940940940941,-0.005454453579722452,-0.0052563557778818664,0.015468733406518739
12.15990990990991,-0.006666206548011326,-0.006455796052533609,0.015485903853947176
12.16041041041041,-0.007882461157316277,-0.007659704515537968,0.015503597878580768
12.16091091091091,-0.009103138429320881,-0.008868006972003113,0.015521831913753748
12.161411411411411,-0.010328158127200029,-0.010080627997973652,0.015540622593061838
12.161911911911911,-0.011557438751735162,-0.011297490932710774,0.01555998672313631
12.162412412412412,-0.012790897538580492,-0.01251851787206576,0.015579941255641412
12.162912912912914,-0.014028450456705534,-0.013743629662981595,0.015600503258559958
12.163413413413414,-0.01527001220801641,-0.014972745899126803,0.01562168988683623
12.163913913913914,-0.016515496228242298,-0.01620578491775433,0.015643518352448718
12.164414414414415,-0.01776481468901866,-0.017442663797727492,0.01566600589398619
12.164914914914915,-0.01901787850125789,-0.018683298358801642,0.015689169745807578
12.165415415415415,-0.02027459731979444,-0.019927603162163434,0.01571302710686551
12.165915915915916,-0.021534879549330477,-0.021175491512252915,0.015737595109278142
12.166416416416416,-0.022798632351692834,-0.02242687545989034,0.0157628907867336
12.166916916916916,-0.024065761654419177,-0.023681665806728817,0.015788931042816534
12.167417417417417,-0.025336172160681562,-0.024939772111050463,0.015815732619344974
12.167917917917919,-0.02660976736056619,-0.026201102694926752,0.015843312064807814
12.168418418418419,-0.02788644954368678,-0.027465564652732317,0.01587168570299466
12.16891891891892,-0.029166119813206572,-0.02873306386108975,0.01590086960190947
12.16941941941942,-0.030448678101185667,-0.030003504990169735,0.015930879543059242
12.16991991991992,-0.03173402318532099,-0.03127679151641944,0.0159617309912086
12.17042042042042,-0.03302205270705217,-0.032552825736701756,0.015993439064691705
12.17092092092092,-0.03431266319104079,-0.03383150878385202,0.01602601850636925
12.171421421421421,-0.03560575006601088,-0.03511274064365644,0.016059483655317734
12.171921921921921,-0.03690120768695326,-0.03639642017325098,0.01609384841933699
12.172422422422422,-0.03819892935868344,-0.037682445120939836,0.016129126248357047
12.172922922922924,-0.03949880736074196,-0.03897071214743294,0.016165330108825718
12.173423423423424,-0.04080073297360692,-0.040261116848468045,0.016202472459149367
12.173923923923924,-0.0421045965062647,-0.04155355377887844,0.01624056522626444
12.174424424424425,-0.04341028732503427,-0.042847916477999834,0.01627961978340152
12.174924924924925,-0.04471769388370159,-0.044144097496478234,0.01631964692911081
12.175425425425425,-0.04602670375489485,-0.0454419884244262,0.01636065686760398
12.175925925925926,-0.04733720366271494,-0.04674147992092172,0.016402659190468176
12.176426426426426,-0.048649079516559265,-0.04804246174482362,0.016445662859798968
12.176926926926926,-0.04996221644614756,-0.04934482278688427,0.01648967619279526
12.177427427427427,-0.0512764988376878,-0.05064845110313006,0.016534706847852874
12.177927927927929,-0.0525918103711847,-0.05195323394949208,0.016580761812187303
12.178428428428429,-0.05390803405880417,-0.0532590578176247,0.016627847391009774
12.17892892892893,-0.05522505228435137,-0.05456580847195045,0.016675969198275974
12.17942942942943,-0.056542746843714846,-0.05587337098780878,0.016725132149019308
12.17992992992993,-0.05786099898631746,-0.05718162979073643,0.016775340453273523
12.18043043043043,-0.05917968945750402,-0.05849046869681585,0.016826597611585052
12.18093093093093,-0.060498698541827836,-0.059799770954058314,0.016878906412110616
12.181431431431431,-0.0618179061071893,-0.06110941928477549,0.016932268929283328
12.181931931931931,-0.06313719164979092,-0.06241929592890059,0.016986686524033602
12.182432432432432,-0.06445643433984956,-0.06372928268821058,0.017042159845538384
12.182932932932934,-0.06577551306803518,-0.06503926097140732,0.017098688834468547
12.183433433433434,-0.06709430649254743,-0.0663491118399831,0.01715627272770257
12.183933933933934,-0.06841269308686439,-0.0676587160548896,0.017214910064465457
12.184434434434435,-0.06973055118800035,-0.06896795412386422,0.017274598693847287
12.184934934934935,-0.07104775904530741,-0.0702767063494344,0.017335335783655714
12.185435435435435,-0.0723641948697327,-0.07158485287751676,0.017397117830547607
12.185935935935936,-0.07367973688347686,-0.0728922737465584,0.01745994067138522
12.186436436436436,-0.07499426337001128,-0.07419884893717174,0.017523799495756016
12.186936936936936,-0.07630765272438797,-0.07550445842219923,0.017588688859595705
12.187437437437438,-0.07761978350379974,-0.07680898221716,0.01765460269984977
12.187937937937939,-0.07893053447829786,-0.07811230043099193,0.017721534350102267
12.188438438438439,-0.08023978468169107,-0.07941429331710143,0.017789476557112008
12.18893893893894,-0.08154741346247106,-0.08071484132456615,0.01785842149817693
12.18943943943944,-0.08285330053477284,-0.08201382514950771,0.017928360799263035
12.18993993993994,-0.08415732602929941,-0.08331112578654337,0.017999285553821364
12.19044044044044,-0.08545937054414861,-0.08460662458026438,0.018071186342226157
12.19094094094094,-0.08675931519548627,-0.08590020327667999,0.01814405325175812
12.191441441441441,-0.08805704166802071,-0.08719174407457488,0.018217875897065753
12.191941941941941,-0.0893524322652092,-0.08848112967671286,0.018292643441031854
12.192442442442442,-0.09064536995915347,-0.08976824334083759,0.01836834461597665
12.192942942942944,-0.09193573844013284,-0.09105296893041413,0.018444967745132188
12.193443443443444,-0.09322342216568794,-0.09233519096502756,0.018522500764315747
12.193943943943944,-0.0945083064092828,-0.09361479467044884,0.0186009312437468
12.194444444444445,-0.09579027730839386,-0.09489166602823258,0.018680246409935753
12.194944944944945,-0.09706922191204743,-0.09616569182484513,0.0187604331675918
12.195445445445445,-0.09834502822773206,-0.09743675970025696,0.018841478121487454
12.195945945945946,-0.09961758526763459,-0.09870475819594407,0.01892336759822716
12.196446446446446,-0.10088678309417178,-0.09996957680225353,0.01900608766786674
12.196946946946946,-0.1021525128647422,-0.10123110600507731,0.019089624165333365
12.197447447447448,-0.10341466687569201,-0.10248923733179859,0.01917396271160029
12.197947947947949,-0.10467313860540248,-0.10374386339643175,0.019259088734570398
12.198448448448449,-0.10592782275653587,-0.10499487794397996,0.019344987489631604
12.19894894894895,-0.10717861529731462,-0.10624217589388342,0.01943164407984115
12.19944944944945,-0.10842541350183738,-0.10748565338256745,0.019519043475705718
12.19994994994995,-0.10966811598942776,-0.10872520780504963,0.019607170534527492
12.20045045045045,-0.11090662276290487,-0.10996073785554406,0.019696010019283713
12.20095095095095,-0.11214083524581753,-0.11119214356704872,0.019785546617014062
12.201451451451451,-0.11337065631857157,-0.11241932634987013,0.019875764956695664
12.201951951951951,-0.11459599035342485,-0.11364218902905114,0.019966649626579378
12.202452452452452,-0.1158167432483405,-0.11486063588068265,0.020058185190975797
12.202952952952954,-0.1170328224596539,-0.11607457266705845,0.020150356206470228
12.203453453453454,-0.11824413703353213,-0.11728390667063984,0.020243147237557275
12.203953953953954,-0.11945059763623703,-0.11848854672684579,0.02033654287168413
12.204454454454455,-0.12065211658311649,-0.1196884032555859,0.020430527733693703
12.204954954954955,-0.12184860786635687,-0.12088338829155693,0.02052508649966239
12.205455455455455,-0.1230399871814432,-0.12207341551327103,0.020620203910128636
12.205955955955956,-0.12422617195235115,-0.12325840027080104,0.020715864782711563
12.206456456456456,-0.12540708135542156,-0.12443825961222363,0.020812054024119127
12.206956956956956,-0.12658263634193684,-0.12561291230875096,0.02090875664154767
12.207457457457458,-0.1277527596593731,-0.12678227887854265,0.02100595775347833
12.207957957957959,-0.12891737587131544,-0.12794628160916283,0.021103642599871086
12.208458458458459,-0.13007641137607664,-0.12910484457873705,0.02120179655177133
12.20895895895896,-0.13122979442395624,-0.13025789367572788,0.021300405120327756
12.20945945945946,-0.1323774551331719,-0.13140535661737043,0.021399453965236407
12.20995995995996,-0.1335193255044639,-0.1325471629667639,0.02149892890262021
12.21046046046046,-0.1346553394343707,-0.13368324414860325,0.021598815912354772
12.21096096096096,-0.13578543272717025,-0.13481353346356373,0.02169910114485146
12.211461461461461,-0.1369095431055107,-0.13593796610133882,0.02179977092731429
12.211961961961961,-0.13802761021972537,-0.1370564791523354,0.0219008117694795
12.212462462462462,-0.1391395756558378,-0.1381690116180392,0.022002210368855916
12.212962962962964,-0.14024538294228622,-0.1392755044200472,0.02210395361547982
12.213463463463464,-0.14134497755534103,-0.1403759004077744,0.022206028596197015
12.213963963963964,-0.14243830692328543,-0.14147014436488906,0.02230842259849273
12.214464464464465,-0.14352532042932023,-0.1425581830144158,0.022411123113879706
12.214964964964965,-0.14460596941322268,-0.14363996502257778,0.022514117840864028
12.215465465465465,-0.14568020717180205,-0.14471544100137804,0.022617394687503626
12.215965965965966,-0.14674798895813307,-0.1457845635099238,0.02272094177357512
12.216466466466466,-0.1478092719796166,-0.1468472870545328,0.022824747432367128
12.216966966966966,-0.1488640153948572,-0.14790356808761956,0.022928800212114308
12.217467467467468,-0.14991218030941916,-0.148953365005402,0.023033088877088603
12.217967967967969,-0.1509537297704228,-0.1499966381444134,0.023137602408363402
12.218468468468469,-0.15198862876008387,-0.1510333497769138,0.023242330004270454
12.21896896896897,-0.1530168441881456,-0.15206346410512944,0.0233472610805573
12.21946946946947,-0.15403834488326423,-0.1530869472544203,0.023452385270268345
12.21996996996997,-0.1550531015833689,-0.15410376726535727,0.02355769242335894
12.22047047047047,-0.15606108692502493,-0.15511389408476062,0.02366317260606197
12.22097097097097,-0.15706227543180645,-0.15611729955570097,0.023768816100017992
12.221471471471471,-0.15805664350173798,-0.1571139574065147,0.023874613401184148
12.221971971971971,-0.15904416939380378,-0.15810384323883894,0.023980555218536922
12.222472472472472,-0.16002483321356242,-0.15908693451470837,0.02408663247257914
12.222972972972974,-0.1609986168979032,-0.16006321054273467,0.024192836293668377
12.223473473473474,-0.16196550419895284,-0.16103265246339218,0.024299158020174613
12.223973973973974,-0.16292548066719187,-0.16199524323346773,0.024405589196484685
12.224474474474475,-0.16387853363377813,-0.16295096760965785,0.02451212157086055
12.224974974974975,-0.16482465219212358,-0.1638998121313772,0.024618747093165243
12.225475475475475,-0.16576382717874472,-0.16484176510279533,0.024725457912467684
12.225975975975976,-0.16669605115343142,-0.16577681657413665,0.024832246374534853
12.226476476476476,-0.1676213183787565,-0.1667049583222649,0.02493910501922397
12.226976976976976,-0.16853962479893073,-0.1676261838305897,0.025046026577783754
12.227477477477478,-0.16945096801807585,-0.16854048826832854,0.0251530039700717
12.227977977977979,-0.17035534727791612,-0.16944786846912835,0.025260030301699002
12.228478478478479,-0.1712527634349323,-0.17034832290912896,0.025367098861112727
12.22897897897898,-0.1721432189369839,-0.17124185168443232,0.025474203116617404
12.22947947947948,-0.1730267177994647,-0.1721284564880625,0.02558133671335188
12.22997997997998,-0.17390326558098299,-0.17300814058641076,0.02568849347021968
12.23048048048048,-0.17477286935862327,-0.17388090879521417,0.025795667376791277
12.23098098098098,-0.17563553770280552,-0.17474676745508666,0.02590285259017009
12.231481481481481,-0.17649128065176367,-0.17560572440663558,0.026010043431844057
12.231981981981981,-0.1773401096856874,-0.17645778896519243,0.026117234384516363
12.232482482482482,-0.1781820377005423,-0.17730297189517813,0.0262244200889265
12.232982982982984,-0.1790170789815975,-0.17814128538414845,0.02633159534066825
12.233483483483484,-0.17984524917667663,-0.17897274301651014,0.026438755087003298
12.233983983983984,-0.18066656526919755,-0.1797973597469954,0.026545894423682655
12.234484484484485,-0.18148104555096814,-0.18061515187385352,0.02665300859177417
12.234984984984985,-0.1822887095948056,-0.18142613701182608,0.026760092974502107
12.235485485485485,-0.18308957822699354,-0.18223033406492872,0.026867143094104224
12.235985985985986,-0.18388367349959892,-0.18302776319904945,0.026974154608707845
12.236486486486486,-0.18467101866266264,-0.1838184458143975,0.02708112330922757
12.236986986986986,-0.1854516381362962,-0.18460240451782456,0.027188045116289358
12.237487487487488,-0.18622555748273184,-0.18537966309504667,0.027294916077183547
12.237987987987989,-0.1869928033782761,-0.1861502464827706,0.027401732362846997
12.238488488488489,-0.18775340358528986,-0.18691418074078647,0.02750849026487993
12.23898898898899,-0.18850738692411165,-0.18767149302399613,0.02761518619259743
12.23948948948949,-0.18925478324502995,-0.18842221155444167,0.027721816670117503
12.23998998998999,-0.18999562340026152,-0.18916636559333153,0.027828378333488335
12.24049049049049,-0.19072993921599718,-0.18990398541309014,0.027934867927855253
12.24099099099099,-0.19145776346451124,-0.19063510226946087,0.028041282304671393
12.241491491491491,-0.1921791298363569,-0.19135974837365527,0.02814761841894782
12.241991991991991,-0.19289407291267566,-0.19207795686459161,0.028253873326550608
12.242492492492492,-0.19360262813760576,-0.19278976178123336,0.028360044181541606
12.242992992992994,-0.19430483179086502,-0.19349519803503934,0.02846612823356476
12.243493493493494,-0.1950007209604369,-0.19419430138253185,0.028572122825277792
12.243993993993994,-0.19569033351548273,-0.19488710839804455,0.028678025389833967
12.244494494494495,-0.19637370807937765,-0.19557365644659397,0.028783833448407792
12.244994994994995,-0.1970508840029936,-0.19625398365695587,0.028889544607770507
12.245495495495495,-0.19772190133814624,-0.19692812889491126,0.028995156557911142
12.245995995995996,-0.19838680081130394,-0.19759613173671084,0.02910066706970907
12.246496496496496,-0.19904562379749655,-0.1982580324427508,0.02920607399265193
12.246996996996996,-0.19969841229449334,-0.1989138719314742,0.029311375252602672
12.247497497497498,-0.2003452088972239,-0.19956369175351624,0.029416568849615424
12.247997997997999,-0.20098605677246376,-0.20020753406609587,0.02952165285579673
12.248498498498499,-0.2016209996338099,-0.20084544160767961,0.029626625413218907
12.248998998999,-0.20225008171692563,-0.20147745767290617,0.029731484731876406
12.2494994994995,-0.20287334775508784,-0.20210362608779459,0.029836229087691967
12.25,-0.20349084295504094,-0.20272399118525103,0.029940856820569184
