interval,rating,rating_boot_mean,rating_boot_se
0,0.46567820140111754,0.46836989515548955,0.09132064979235449
0.015015015015015015,0.4646400383305449,0.4673878628956511,0.08970265055798726
0.03003003003003003,0.46316899695937325,0.465976999823753,0.08811364887509834
0.04504504504504504,0.4612400605142953,0.4641120375634335,0.08656023370923689
0.06006006006006006,0.45882944147163923,0.4617688336896882,0.0850491568485207
0.07507507507507508,0.45591500295165915,0.45892478343337206,0.08358722463204844
0.09009009009009009,0.4524767087220758,0.45555926169775063,0.08218117023242043
0.10510510510510511,0.4484970942828684,0.4516540885990646,0.08083750868451188
0.12012012012012012,0.44396174901500396,0.4471940093208532,0.07956237856466764
0.13513513513513514,0.43885979676141307,0.4421671764904955,0.07836137602874575
0.15015015015015015,0.4331843596039814,0.43656562066672183,0.07723938860815295
0.16516516516516516,0.42693298718327793,0.43038569203137833,0.0762004374802666
0.18018018018018017,0.420108031896131,0.42362845421200285,0.0752475375929165
0.19519519519519518,0.4127169489496851,0.4163000095633685,0.0743825847838617
0.21021021021021022,0.40477249981622004,0.4084117344691186,0.07360627774455304
0.22522522522522523,0.39629283838177737,0.3999804035554917,0.07291808034043477
0.24024024024024024,0.3873014612398311,0.39102818338088047,0.07231622662147447
0.2552552552552553,0.3778270073055363,0.3815824793646343,0.07179776723293174
0.2702702702702703,0.3679028972671416,0.3716756245398545,0.07135865240192826
0.2852852852852853,0.3575668102606942,0.3613444051235588,0.0709938438025067
0.3003003003003003,0.3468600033002918,0.3506294257010986,0.07069744587748104
0.3153153153153153,0.33582648799465337,0.339574325653365,0.07046284690580933
0.3303303303303303,0.3245120883467652,0.3282248677767492,0.07028286126080496
0.34534534534534533,0.31296341225659713,0.3166279291729045,0.07014986663178549
0.36036036036036034,0.30122677695103867,0.3048304326402735,0.07005593297372055
0.37537537537537535,0.28934713418591906,0.2928782631845103,0.06999294297995423
0.39039039039039036,0.27736704403857326,0.28081521815368343,0.06995270633396147
0.40540540540540543,0.26532574595978237,0.2686820403343302,0.06992707142874097
0.42042042042042044,0.25325837226445874,0.2565155808027806,0.06990803843241863
0.43543543543543545,0.24119534249868765,0.24434813240693976,0.06988787659138848
0.45045045045045046,0.22916196752650198,0.23220696578191008,0.06985924681391477
0.46546546546546547,0.21717828041394063,0.2201140884127691,0.06981532834885752
0.4804804804804805,0.20525909814543386,0.2080862343320493,0.06974994629421416
0.4954954954954955,0.19341430490295944,0.19613507861191207,0.06965769519126493
0.5105105105105106,0.1816493350987739,0.18426765795270755,0.06953405336229887
0.5255255255255256,0.1699658235125807,0.17248696737194474,0.06937548298853877
0.5405405405405406,0.15836238149670537,0.1607926940711776,0.06917951203178899
0.5555555555555556,0.146835452787762,0.1491820435602573,0.06894479563712151
0.5705705705705706,0.13538020023606412,0.13765061031680112,0.06867115618458827
0.5855855855855856,0.12399137569890861,0.12619324563317152,0.06835960226649805
0.6006006006006006,0.11266412916346046,0.11480487857845874,0.06801232723956253
0.6156156156156156,0.10139471940047062,0.10348125170510314,0.067632687501749
0.6306306306306306,0.09018109650274185,0.09221954065577258,0.06722515935065634
0.6456456456456456,0.07902333586710347,0.08101883551407128,0.06679527148589555
0.6606606606606606,0.06792391286442609,0.06988047093622488,0.06634950838804536
0.6756756756756757,0.05688781698070181,0.05880820120001193,0.06589517850780008
0.6906906906906907,0.045922513056401645,0.04780822480359798,0.06544024100213955
0.7057057057057057,0.035037764959502005,0.0368890707430488,0.0649930861274237
0.7207207207207207,0.024245343275863532,0.02606136481111551,0.06456226759805925
0.7357357357357357,0.013558643184743467,0.015337499018289751,0.06415619019358827
0.7507507507507507,0.002992241516173014,0.004731230462150815,0.06378276222788848
0.7657657657657657,-0.007438576928765293,-0.005742762337645776,0.06344902938558233
0.7807807807807807,-0.017718294277429013,-0.016069337403708885,0.06316081277829812
0.7957957957957957,-0.027831608233213262,-0.026233334480112742,0.06292237862640597
0.8108108108108109,-0.037763830308528756,-0.0362199827210288,0.06273616858072659
0.8258258258258259,-0.047501213797144615,-0.04601524962360276,0.06260261760398728
0.8408408408408409,-0.057031196686317884,-0.055606114249964485,0.06252008041348399
0.8558558558558559,-0.06634255019766569,-0.06498075274915395,0.06248487837997089
0.8708708708708709,-0.07542542929056643,-0.07412862957636422,0.06249146778983418
0.8858858858858859,-0.08427132698974225,-0.08304049336136374,0.06253271920225953
0.9009009009009009,-0.092872939558748,-0.09170828183648734,0.06260028795087696
0.9159159159159159,-0.10122395411450415,-0.10012494533310272,0.06268504893083911
0.9309309309309309,-0.10931877408642382,-0.10828420284417158,0.06277756531232602
0.9459459459459459,-0.11715220083668562,-0.11618024831037291,0.06286856067714051
0.960960960960961,-0.12471909169817035,-0.123807427446669,0.06294936668820304
0.975975975975976,-0.13201401563049814,-0.13115990697501043,0.06301232287579271
0.990990990990991,-0.1390309276715367,-0.13823135852690507,0.06305111051904205
1.006006006006006,-0.14576288244606173,-0.14501467875827406,0.06306100812323337
1.021021021021021,-0.1522018052931696,-0.15150176547466332,0.06303906109490127
1.0360360360360361,-0.15833833721768945,-0.15768336694483964,0.06298416260993842
1.0510510510510511,-0.1641617669899076,-0.16354901826364424,0.062897046288482
1.0660660660660661,-0.16966006043324883,-0.16908707479887883,0.06278019422753586
1.0810810810810811,-0.17481999334889575,-0.1742848485983663,0.06263766638724097
1.0960960960960962,-0.17962739069851802,-0.1791288492912935,0.062474859508464174
1.1111111111111112,-0.18406747064176507,-0.18360512660552936,0.0622982058772466
1.1261261261261262,-0.18812528782463833,-0.187699707217946,0.062114824508427896
1.1411411411411412,-0.19178626595493758,-0.19139911431161724,0.06193213975590014
1.1561561561561562,-0.19503680521522582,-0.19469095397953826,0.061757484884152294
1.1711711711711712,-0.1978649455262566,-0.19756454855351296,0.06159771049569316
1.1861861861861862,-0.20026106222117476,-0.20001159315327752,0.061458819474258
1.2012012012012012,-0.20221856653762887,-0.2020268084070728,0.061345650731634685
1.2162162162162162,-0.20373457977865073,-0.20360855961947932,0.06126163298424141
1.2312312312312312,-0.20481054740331678,-0.2047594109444119,0.061208626618059876
1.2462462462462462,-0.20545275809773111,-0.20548658268695483,0.061186866297607265
1.2612612612612613,-0.20567273345603668,-0.2058022810309003,0.061195009600068455
1.2762762762762763,-0.20548745661596046,-0.20572387253730928,0.06123028828485547
1.2912912912912913,-0.2049194132578401,-0.2052738808353978,0.061288749839261816
1.3063063063063063,-0.20399642580668412,-0.20447979001101338,0.06136556881278842
1.3213213213213213,-0.20275127124418588,-0.2033736480577213,0.06145540123115137
1.3363363363363363,-0.20122108414674536,-0.2019914739317125,0.061552751862101227
1.3513513513513513,-0.19944655867411734,-0.20037248257800658,0.06165232369631083
1.3663663663663663,-0.1974709753127383,-0.19855815295530085,0.06174932169732966
1.3813813813813813,-0.19533908921026005,-0.1965911737012254,0.061839688283626015
1.3963963963963963,-0.19309592593866473,-0.19451430881423754,0.06192025547099414
1.4114114114114114,-0.19078553666696516,-0.19236923089980712,0.061988807282940504
1.4264264264264264,-0.1884497674535084,-0.19019537169389056,0.06204405500141671
1.4414414414414414,-0.18612709646456407,-0.18802883858656028,0.06208553614899376
1.4564564564564564,-0.18385158853375136,-0.18590144187680252,0.06211345491367231
1.4714714714714714,-0.1816520090690126,-0.18383987091750925,0.06212848635945635
1.4864864864864864,-0.17955112961649886,-0.18186504877710566,0.06213156876679428
1.5015015015015014,-0.17756524627716372,-0.17999168527779272,0.06212370768847696
1.5165165165165164,-0.17570392054824602,-0.17822803801110307,0.06210581200462749
1.5315315315315314,-0.17396994086408782,-0.1765758808557719,0.06207857695111076
1.5465465465465464,-0.17235949282839302,-0.17503067018797996,0.062042422551191745
1.5615615615615615,-0.17086251736453772,-0.17358189079286965,0.061997488978677746
1.5765765765765765,-0.169463229068496,-0.17221355672980537,0.06194368396006567
1.5915915915915915,-0.16814076206350856,-0.17090483722325409,0.0618807720542718
1.6066066066066067,-0.1668699076255656,-0.16963077410996963,0.06180849195790801
1.6216216216216217,-0.16562190668328783,-0.16836305548004643,0.061726686038893745
1.6366366366366367,-0.1643652608545333,-0.16707080988224915,0.061635426049140844
1.6516516516516517,-0.16306652780332473,-0.16572138678173204,0.06153512020853087
1.6666666666666667,-0.1616910702147413,-0.16428109179808562,0.061426589315853306
1.6816816816816818,-0.16020373241334945,-0.16271584951611368,0.06131110293857699
1.6966966966966968,-0.15856942439398242,-0.16099177219931238,0.061190370777527925
1.7117117117117118,-0.1567535995590781,-0.15907561932355452,0.06106648870673621
1.7267267267267268,-0.1547226194844223,-0.1569351401803952,0.060941843438898934
1.7417417417417418,-0.15244400623389126,-0.15453929948987358,0.060818983904633396
1.7567567567567568,-0.1498865897378138,-0.15185839356124756,0.06070047085993483
1.7717717717717718,-0.14702056413665637,-0.14886407156158388,0.06058871854722955
1.7867867867867868,-0.14381747237131232,-0.14552928241548843,0.0604858430887211
1.8018018018018018,-0.14025014230844668,-0.1418281723317126,0.060393531487346636
1.8168168168168168,-0.13629260002996352,-0.1377359605917039,0.06031294266904408
1.8318318318318318,-0.13191998639791297,-0.13322882182512685,0.0602446481961305
1.8468468468468469,-0.12710850156401599,-0.1282838014723913,0.0601886156344632
1.8618618618618619,-0.1218353988003486,-0.12287878759021505,0.06014423275357141
1.8768768768768769,-0.11607904409996143,-0.11699255684774736,0.060110366510213155
1.8918918918918919,-0.10981905178167399,-0.11060490588452909,0.06008544774255469
1.906906906906907,-0.1030364992925224,-0.10369687166835836,0.06006757108545542
1.921921921921922,-0.09571421707777582,-0.0962510366882248,0.060054599896939356
1.936936936936937,-0.08783714236886202,-0.08825190736357846,0.06004426772665069
1.951951951951952,-0.07939271960856012,-0.0796863475472216,0.06003427055575443
1.966966966966967,-0.0703713255214716,-0.07054404397743244,0.060022347036843095
1.981981981981982,-0.06076669397215438,-0.06081797741126906,0.06000634659416316
1.996996996996997,-0.05057631500695303,-0.050504872203357025,0.059984286973286165
2.012012012012012,-0.039801783933167675,-0.03960559835391796,0.05995440336204707
2.027027027027027,-0.028449079827618094,-0.02812550340790569,0.05991519054507948
2.042042042042042,-0.016528758158142698,-0.01607465672313379,0.059865437992678794
2.057057057057057,-0.004056048742124248,-0.0034679950545578745,0.05980425582532501
2.0720720720720722,0.008949142573660593,0.009674634476582346,0.05973108784240615
2.0870870870870872,0.02246232303455026,0.023328530801817092,0.059645706832395166
2.1021021021021022,0.036454581066588776,0.03746428493278899,0.059548187619657605
2.1171171171171173,0.050892816456074234,0.052048000432367576,0.05943885494618088
2.1321321321321323,0.06574001244840176,0.0670415693793466,0.05931820625864761
2.1471471471471473,0.08095552829229462,0.08240298295293416,0.05918681342920804
2.1621621621621623,0.09649539149771535,0.0980866557843755,0.059045211817403846
2.1771771771771773,0.11231257172979019,0.11404374509943462,0.05889378917257306
2.1921921921921923,0.12835722254084206,0.13022244917106088,0.05873268992894382
2.2072072072072073,0.14457688264919694,0.14656827437004047,0.058561751776249685
2.2222222222222223,0.16091663473825155,0.16302426572566192,0.058380490491810245
2.2372372372372373,0.1773192262726787,0.17953120193712233,0.05818814565895343
2.2522522522522523,0.19372516310984567,0.19602776175305409,0.0579837941583581
2.2672672672672673,0.21007279224253306,0.212450674119471,0.05776653062230597
2.2822822822822824,0.22629839439657698,0.2287348690709145,0.05753570509933903
2.2972972972972974,0.24233631002247769,0.24481364962586744,0.057291198921238566
2.3123123123123124,0.25811912312261043,0.260618906609676,0.05703371126252373
2.3273273273273274,0.2735779260892249,0.2760813980888884,0.056765022256565816
2.3423423423423424,0.2886426851546088,0.2911311127659543,0.05648819489275549
2.3573573573573574,0.3032427201952145,0.3056977321773075,0.056207678299826556
2.3723723723723724,0.31730730471058816,0.31971119994790204,0.05592928027655263
2.3873873873873874,0.3307663822756397,0.33310239797382935,0.055659987561013036
2.4024024024024024,0.34355138534571633,0.34580391976096614,0.0554076282017175
2.4174174174174174,0.35559613189788375,0.35775092101146994,0.0551803904158317
2.4324324324324325,0.3668377660789144,0.3688820178936631,0.05498623417480809
2.4474474474474475,0.3772177018805946,0.3791401953419445,0.05483225190677722
2.4624624624624625,0.3866825248241212,0.3884736822788143,0.05472404885822221
2.4774774774774775,0.3951848063649013,0.39683674871033153,0.05466521778667769
2.4924924924924925,0.40268378946211836,0.4041903817421542,0.05465697434546541
2.5075075075075075,0.40914591123453514,0.41050280373053455,0.054697999150047645
2.5225225225225225,0.41454513910127494,0.4157498055104207,0.05478450365240953
2.5375375375375375,0.41886310915365543,0.4199148799180023,0.054910505578618166
2.5525525525525525,0.42208906837543353,0.42298915427542955,0.05506827243012864
2.5675675675675675,0.42421963437072774,0.42497113361968575,0.05524887362315052
2.5825825825825826,0.42525839631397105,0.4258662778333281,0.05544277559541131
2.5975975975975976,0.4252153881003474,0.42568644439957554,0.05564041885696691
2.6126126126126126,0.42410646877975033,0.42444923366120063,0.055832728394514426
2.6276276276276276,0.42195264636762997,0.4221772751334221,0.05601152502238199
2.6426426426426426,0.418779379467831,0.41889749198855614,0.05616982154800158
2.6576576576576576,0.414615887477303,0.4146403770045684,0.05630200148629246
2.6726726726726726,0.40949449523001646,0.40943930791822936,0.056403888361528244
2.6876876876876876,0.40345003250373723,0.40332992410500945,0.05647272031283159
2.7027027027027026,0.39651930345770864,0.3963495805427412,0.05650704835545164
2.7177177177177176,0.38874063620527866,0.38853688960853333,0.0565065780557957
2.7327327327327327,0.3801535185701754,0.3799313566746572,0.056471974296844675
2.7477477477477477,0.370798322665584,0.3705731117575823,0.05640464777252907
2.7627627627627627,0.3607161181721181,0.36050273651808823,0.05630654015110873
2.7777777777777777,0.3499485718892357,0.34976118349130064,0.05617992260500266
2.7927927927927927,0.33853792907705893,0.3383897822890797,0.05602721964247697
2.8078078078078077,0.3265270700885865,0.32643032542840833,0.055850866916981476
2.8228228228228227,0.3139596336626061,0.31392522422530544,0.05565320802211288
2.8378378378378377,0.30088019592811044,0.3009177227703816,0.05543643140019433
2.8528528528528527,0.287334491672916,0.2874521553881193,0.05520254470651442
2.8678678678678677,0.2733696618561571,0.27357423029880795,0.05495338066421808
2.8828828828828827,0.2590345088839789,0.2593313196632705,0.05469062602002531
2.8978978978978978,0.24437973907590105,0.24477273408043437,0.054415864012361044
2.9129129129129128,0.22945817032420288,0.22994995825155243,0.054130620996055374
2.9279279279279278,0.21432488249858325,0.21491682425008027,0.053836409531325194
2.942942942942943,0.19903728895227615,0.19972959992921632,0.05353476309813577
2.957957957957958,0.1836551097520893,0.18444697265920323,0.05322726116367799
2.972972972972973,0.1682402310800918,0.16912991288302015,0.0529155469524359
2.987987987987988,0.15285644059009657,0.153841407818506,0.05260134320567219
3.003003003003003,0.13756903513258353,0.13864606274370722,0.05228647278491136
3.018018018018018,0.12244430480376209,0.12360957523277499,0.05197289068944052
3.033033033033033,0.1075489051972011,0.10879809587091467,0.05166273177079313
3.048048048048048,0.09294913740573055,0.09427749669021583,0.051358374396722806
3.063063063063063,0.07871016206499039,0.08011257514235819,0.05106251520781719
3.078078078078078,0.06489517891521641,0.06636622623943349,0.05077824489598994
3.093093093093093,0.051564606470520115,0.0530986180823594,0.05050911072622681
3.108108108108108,0.03877529709798519,0.04036640610410087,0.05025914935127612
3.123123123123123,0.026579821028259926,0.028222018977576098,0.05003287407098618
3.138138138138138,0.015025848698477486,0.016713044519591942,0.04983520434498997
3.153153153153153,0.00415565474965391,0.005881737519782039,0.04967133181957672
3.168168168168168,-0.0059942404741921106,-0.004235336154544956,0.04954652558122918
3.183183183183183,-0.015393284279730971,-0.013607512900910881,0.049465888563130875
3.198198198198198,-0.02401696041838835,-0.02221010379593326,0.049434085503143384
3.2132132132132134,-0.03184672152913066,-0.0300243348473723,0.04945506905599463
3.2282282282282284,-0.0388697999195187,-0.03703716978085097,0.04953183333812446
3.2432432432432434,-0.04507891634722813,-0.043241034490652794,0.04966622262070921
3.2582582582582584,-0.050471909734775354,-0.04863346509808925,0.04985881713313075
3.2732732732732734,-0.055051312294493115,-0.05321670278746569,0.05010890885374441
3.2882882882882885,-0.058823894479167096,-0.05699725837948507,0.05041456926219756
3.3033033033033035,-0.061800202734546256,-0.059985468187628926,0.05077280014157515
3.3183183183183185,-0.06399411050837951,-0.06219506036023356,0.05117974937482266
3.3333333333333335,-0.0654223996887594,-0.06364274792353532,0.0516309675164818
3.3483483483483485,-0.06610438591759747,-0.06434786137428591,0.052121678276988166
3.3633633633633635,-0.06606159733546621,-0.06433203015337842,0.05264703677605397
3.3783783783783785,-0.06531751249509071,-0.06361891884720576,0.053202352833850546
3.3933933933933935,-0.06389735960821692,-0.062234020646571776,0.05378326175859156
3.4084084084084085,-0.061827976081660074,-0.06020450753576124,0.054385831150678625
3.4234234234234235,-0.0591377245159494,-0.057559133942654946,0.05500659845082613
3.4384384384384385,-0.05585645900093071,-0.05432818818343175,0.05564253983125326
3.4534534534534536,-0.05201553362798975,-0.05054348399312303,0.056290976302739625
3.4684684684684686,-0.04764784360556455,-0.04623838274618363,0.056949427463154546
3.4834834834834836,-0.04278788815908356,-0.04144783563421746,0.05761542706838959
3.4984984984984986,-0.03747184346481682,-0.036208434074324405,0.058286317460815557
3.5135135135135136,-0.031737633167415076,-0.03055845596497955,0.05895904168066882
3.5285285285285286,-0.02562498354220194,-0.024537895082481193,0.05962995260687589
3.5435435435435436,-0.019175450092365494,-0.018188460918970795,0.060294657537146135
3.5585585585585586,-0.012432402356154509,-0.01155353660783746,0.060947914132531526
3.5735735735735736,-0.005440954008731115,-0.004678083278038316,0.061583589703560086
3.5885885885885886,0.0017521739280617426,0.0023915197483362354,0.06219469070434521
3.6036036036036037,0.009098867696460051,0.009607708010975834,0.06277346353262371
3.6186186186186187,0.016549922261467235,0.016922045354672573,0.06331156194778767
3.6336336336336337,0.024055436002846958,0.024285622407794735,0.06380027128270578
3.6486486486486487,0.031565301578802316,0.03164954166891666,0.06423077571320596
3.6636636636636637,0.039029791637819625,0.038965487082038446,0.06459445254514065
3.6786786786786787,0.04640023304065625,0.04618637167630892,0.06488317691988081
3.6936936936936937,0.053629757635934916,0.05326705199928312,0.06508962140963989
3.7087087087087087,0.06067411165269674,0.06016509283490384,0.06520753734503824
3.7237237237237237,0.06749249976646331,0.06684156031448442,0.06523200791221123
3.7387387387387387,0.07404843427752454,0.07326181634371719,0.06515966652967675
3.7537537537537538,0.08031055508421689,0.07939628270937947,0.06498887722764991
3.7687687687687688,0.08625338273570414,0.0852211397828795,0.06471987624052974
3.7837837837837838,0.09185796528265594,0.09071892290745583,0.06435487545081094
3.798798798798799,0.09711238031315322,0.09587897980607617,0.06389812851858806
3.813813813813814,0.10201205674438835,0.1006977550398644,0.06335595950749486
3.828828828828829,0.10655988674649493,0.10517887287776641,0.06273675177027949
3.843843843843844,0.11076610650323665,0.10933299788107431,0.06205089214414447
3.858858858858859,0.11464793503763843,0.11317746277724317,0.06131066262062277
3.873873873873874,0.11822897249540369,0.11673566524538627,0.06053006919278522
3.888888888888889,0.12153837233300135,0.12003624826910145,0.059724596215441156
3.903903903903904,0.12460981490199219,0.1231120917587735,0.05891087506352802
3.918918918918919,0.12748032198518833,0.12599915514507048,0.0581062588671668
3.933933933933934,0.1301889619687498,0.12873522056226777,0.057328301268289465
3.948948948948949,0.1327755026831177,0.13135859318125398,0.056594146814299175
3.963963963963964,0.13527907287011018,0.13390681857299847,0.05591985350458617
3.978978978978979,0.1377368933598161,0.13641547636557133,0.05531968290970229
3.993993993993994,0.1401831353104501,0.1389171049458773,0.05480540779510978
4.009009009009009,0.1426479555441896,0.1414403039493716,0.05438569788865439
4.024024024024024,0.14515674866926648,0.14400905047636064,0.05406564761309968
4.039039039039039,0.14772964312188075,0.14664225228551686,0.05384650245927596
4.054054054054054,0.15038125445677974,0.1493535476653297,0.05372562265002861
4.069069069069069,0.15312069518743096,0.15215134829150495,0.05369669631506739
4.084084084084084,0.15595182720932313,0.1550391090614412,0.05375018470778811
4.099099099099099,0.1588737311867792,0.15801579839809385,0.05387395533242522
4.114114114114114,0.161881357900514,0.16107653435405128,0.05405404055736958
4.129129129129129,0.16496631985778346,0.16421334630269185,0.054275452110452385
4.1441441441441444,0.16811777762808833,0.1674160191285747,0.05452298540480669
4.1591591591591595,0.1713233743214901,0.17067297647896132,0.054781959112079996
4.1741741741741745,0.17457017311537779,0.17397216151585512,0.055038850890647646
4.1891891891891895,0.17784555635819388,0.17730187731497468,0.05528180606015963
4.2042042042042045,0.18113805004837125,0.1806515541437742,0.055501009757440906
4.2192192192192195,0.1844380438863986,0.18401241685465813,0.055688923502134134
4.2342342342342345,0.18773838412633576,0.18737803211624304,0.05584039403920985
4.2492492492492495,0.19103482366098293,0.1907447217882931,0.05595264640413831
4.2642642642642645,0.19432632078648118,0.19411183510217667,0.05602517526747786
4.2792792792792795,0.1976151846151957,0.19748187818599205,0.05605954964966087
4.2942942942942945,0.20090707093045643,0.20086050468984862,0.05605914676113329
4.3093093093093096,0.2042108372673703,0.20425637570463576,0.0560288314522708
4.324324324324325,0.2075382700857109,0.20768090076570703,0.05597459868742238
4.33933933933934,0.2109037000461656,0.2111478744753499,0.05590319744298472
4.354354354354355,0.21432352361615528,0.21467302518346865,0.05582175510199938
4.36936936936937,0.21781565054646396,0.21827349327803372,0.05573742128325832
4.384384384384385,0.2213988972234079,0.2219672570157124,0.055657048616907207
4.3993993993994,0.22509234557782637,0.22577252354074803,0.05558692494206338
4.414414414414415,0.22891468620363803,0.22970710187812685,0.055532566742155974
4.42942942942943,0.23288356270694252,0.23378777333720108,0.05549857772513114
4.444444444444445,0.2370149321965942,0.23802967302833888,0.05548857004330905
4.45945945945946,0.2413224543873456,0.24244569419607645,0.05550513971787004
4.474474474474475,0.24581691918666304,0.2470459249408331,0.05554988339692202
4.48948948948949,0.2505057200593829,0.2518371247823255,0.05562344142318316
4.504504504504505,0.2553923780962909,0.25682224656165553,0.05572555268162399
4.51951951951952,0.2604761197257409,0.2620000075300369,0.05585510967796031
4.534534534534535,0.2657515095452308,0.2673645122559554,0.056010207111683585
4.54954954954955,0.2712081389100362,0.2729049292905609,0.05618818285532666
4.564564564564565,0.276830370739396,0.278605223407711,0.05638565561801565
4.57957957957958,0.2825971414633769,0.2844439456673752,0.056598567654424205
4.594594594594595,0.28848182204730727,0.2903940844651862,0.05682224298446321
4.60960960960961,0.2944521414497309,0.2964229819945464,0.057051471431400776
4.624624624624625,0.30047017750332544,0.3024923219803222,0.05728062650406794
4.63963963963964,0.30649242183745146,0.3085581959314332,0.057503821219469405
4.654654654654655,0.31246992685793207,0.31457125627774013,0.057715101063796015
4.66966966966967,0.3183485437463328,0.3204769653872875,0.05790866814689387
4.684684684684685,0.32406926074620107,0.3262159494156772,0.058079125856524534
4.6996996996997,0.3295686505175923,0.33172446508034664,0.058221729437542294
4.714714714714715,0.334779433965994,0.33693498570033253,0.058332625196198036
4.72972972972973,0.3396311656496568,0.34177691018824075,0.05840905959895599
4.744744744744745,0.3440510426669144,0.34617739518989044,0.0584495394490302
4.75975975975976,0.3479648349149289,0.3500623063725499,0.0584539256124772
4.774774774774775,0.3512979299507318,0.35335728016148993,0.05842344548341292
4.78978978978979,0.35397648059145015,0.3559888822624153,0.058360613607354665
4.804804804804805,0.35592863813104264,0.3578858443640516,0.05826905568944651
4.81981981981982,0.35708584893096623,0.3589803557846246,0.058153238562380145
4.834834834834835,0.35738418748568646,0.3592093827967987,0.05801811731902366
4.84984984984985,0.3567656951904688,0.3585159851998005,0.05786872013979054
4.864864864864865,0.3551796912374224,0.3568505976210183,0.0577097003915974
4.87987987987988,0.35258402056723837,0.3541722421750574,0.057544893031299116
4.894894894894895,0.34894620375684393,0.3504496395620145,0.05737691674308531
4.90990990990991,0.3442444551727402,0.34566218743878857,0.057206863266235364
4.924924924924925,0.33846853859994297,0.3398007778505535,0.05703411025454176
4.93993993993994,0.3316204336900886,0.3328684294845191,0.05685628384103451
4.954954954954955,0.3237147916873821,0.3248807152563945,0.056669382944234604
4.96996996996997,0.314779164649074,0.3158659709672031,0.056468061173994444
4.984984984984985,0.304853998409785,0.30586527616238773,0.05624604633986612
5,0.29399238549324613,0.29493220359347416,0.05599666428492706
5.015015015015015,0.2822595797547782,0.2831323385861129,0.055713424707129
5.03003003003003,0.2697322795398333,0.27054257400564713,0.055390622539296316
5.045045045045045,0.25649769048027443,0.2572501903399714,0.05502390918314796
5.06006006006006,0.24265238275246984,0.2433517337618438,0.05461079258485391
5.075075075075075,0.22830096082671555,0.2289517080614629,0.054151032580515755
5.09009009009009,0.21355456665435643,0.2141610992911527,0.053646906846395254
5.105105105105105,0.19852924009979966,0.19909575508314784,0.05310333203465146
5.12012012012012,0.1833441634302773,0.18387464407984064,0.052527833411855254
5.135135135135135,0.16811981994257078,0.168618024828357,0.05193036402054958
5.15015015015015,0.15297610031982917,0.15344555774970386,0.05132298086752784
5.165165165165165,0.13803039390764363,0.13847439812664394,0.05071939105666349
5.18018018018018,0.12339570546006066,0.12381731202682554,0.05013438558587823
5.195195195195195,0.10917884059562544,0.10958086013675569,0.049583183379796114
5.21021021021021,0.0954787047178516,0.09586369604250244,0.0490807136828783
5.225225225225225,0.08238476000004466,0.0827550250328852,0.04864087149010802
5.24024024024024,0.06997568280948507,0.0703332666575546,0.04827578779888516
5.255255255255255,0.058318259417376055,0.058664958917328446,0.04799516268344895
5.27027027027027,0.04746655100110222,0.047803934242622394,0.04780571219159363
5.285285285285285,0.037461350038686655,0.037790787743755966,0.047710777259378216
5.3003003003003,0.02832993970813425,0.028652647234884972,0.04771013245708676
5.315315315315315,0.020086156517958375,0.020403243027457208,0.047800014519361785
5.33033033033033,0.012730744909846416,0.013043264293425566,0.04797336773913779
5.345345345345345,0.006251981815830677,0.006560978695735116,0.048220279751968104
5.36036036036036,6.26539875583805e-4,9.330836204509359e-4,0.04852856183254332
5.375375375375375,-0.0041794491743701815,-0.0038742488279223638,0.048884416264436355
5.39039039039039,-0.008209174151023704,-0.007904174663078358,0.04927313108160878
5.405405405405405,-0.011513812433094203,-0.011207871619608819,0.049679748581056844
5.42042042042042,-0.014151131227354171,-0.013843165573521285,0.050089665859274615
5.435435435435435,-0.016184064348057473,-0.0158731290793361,0.05048914003470351
5.45045045045045,-0.017679302342611197,-0.01736468715032377,0.05086568495460602
5.465465465465465,-0.018705928139593743,-0.018387260313764732,0.051208358113875425
5.48048048048048,-0.019334124070880445,-0.019011469446609273,0.05150794529112092
5.495495495495495,-0.019633969665623016,-0.01930792138035069,0.05175705589447772
5.51051051051051,-0.019674343492621673,-0.019346089118434526,0.05195014458571093
5.525525525525525,-0.01952193689672344,-0.019193295996108903,0.05208347505350556
5.54054054054054,-0.01924038297181925,-0.018913809384582807,0.052155040543225055
5.555555555555555,-0.018889500654019904,-0.018568046647597734,0.052164453587530586
5.57057057057057,-0.018524651407956786,-0.01821189395585137,0.052112814887160616
5.585585585585585,-0.018196204526776883,-0.01789613713709715,0.05200256890298937
5.6006006006006,-0.017949106410433333,-0.01766600282206897,0.05183735173698991
5.615615615615615,-0.017822549119128044,-0.01756080755037357,0.05162183545242201
5.63063063063063,-0.017849733790808883,-0.01761371204046145,0.051361572121918476
5.645645645645645,-0.018057724939666307,-0.017851577343796353,0.051062840479861406
5.66066066066066,-0.018467392019630727,-0.018294918979740133,0.050732497881952304
5.675675675675675,-0.01909343479049369,-0.01895795432509667,0.050377840082207664
5.6906906906906904,-0.01994448886888248,-0.019848737511832863,0.050006470879388476
5.7057057057057055,-0.021023307348607953,-0.020969374925598028,0.04962618278990636
5.7207207207207205,-0.02232701356245602,-0.02231631319791801,0.04924484853333549
5.7357357357357355,-0.023847419010227248,-0.023880690473921294,0.04887032139895757
5.7507507507507505,-0.025571399314001087,-0.02564874084697786,0.04851034079756363
5.7657657657657655,-0.02748131991965494,-0.02760224129587974,0.04817243792311244
5.7807807807807805,-0.02955550228287224,-0.029718990317306897,0.04786383593127422
5.7957957957957955,-0.031768720580004295,-0.0319733077462812,0.04759133979132494
5.8108108108108105,-0.034092718658832635,-0.034336545977975495,0.04736121318551483
5.8258258258258255,-0.03649673703961764,-0.03677760387572599,0.04717904340167426
5.8408408408408405,-0.03894804029616376,-0.0392634359663542,0.04704959960542829
5.8558558558558556,-0.041412436051291024,-0.041759550958913275,0.04697669436529178
5.870870870870871,-0.0438547780379304,-0.044230495048664234,0.04696306181383478
5.885885885885886,-0.046239447109293445,-0.046640316770757785,0.047010267364414896
5.900900900900901,-0.048530805620900105,-0.0489530112610229,0.0471186627637358
5.915915915915916,-0.05069362214551816,-0.0511329426120583,0.047287396269390304
5.930930930930931,-0.05269346492102457,-0.05314524356507866,0.0475144813592061
5.945945945945946,-0.05449706368958414,-0.054956192068024504,0.04779691964292343
5.960960960960961,-0.056072640604222075,-0.05653356430033662,0.04813086594525294
5.975975975975976,-0.05739021161829981,-0.05784696367328919,0.048511817281396606
5.990990990990991,-0.05842186021870555,-0.05886812512754144,0.04893480378530881
6.006006006006006,-0.05914198551851994,-0.05957119383041249,0.04939455920978237
6.021021021021021,-0.05952752660958744,-0.05993297717853824,0.049885651453804775
6.036036036036036,-0.05955816472328989,-0.05993316887655151,0.050402559227452015
6.051051051051051,-0.05921650420229212,-0.059554543810623015,0.05093968859930878
6.066066066066066,-0.05848823259798739,-0.05878312247001785,0.05149133173065351
6.081081081081081,-0.05736225943340563,-0.057608303775960955,0.05205157846310246
6.096096096096096,-0.055830832367794334,-0.05602296532774916,0.05261419853391024
6.111111111111111,-0.05388962872553347,-0.05402353023609888,0.05317251716272982
6.126126126126126,-0.051537819665333585,-0.05160999984730158,0.05371930897792713
6.141141141141141,-0.04877810371820992,-0.04878595173895763,0.05424673447844868
6.156156156156156,-0.04561670606006724,-0.045558502371368235,0.05474633960629862
6.171171171171171,-0.04206333974292251,-0.04193823370732528,0.05520913306246708
6.186186186186186,-0.03813112521199367,-0.03793908298523039,0.055625748554424745
6.201201201201201,-0.03383646479458644,-0.033578194682168966,0.05598669117825111
6.216216216216216,-0.029198869456599653,-0.028875733584757927,0.05628265954545322
6.231231231231231,-0.02424073596452928,-0.02385465785391425,0.05650492880969263
6.246246246246246,-0.018987073632530556,-0.01854045108273026,0.05664577488955513
6.261261261261261,-0.013465181031874069,-0.012960812653988059,0.05669891705894518
6.276276276276276,-0.007704274343057976,-0.007145306240306684,0.05665995454461444
6.291291291291291,-0.001735070384909312,-0.001124967070814081,0.05652677249356702
6.306306306306306,0.004410671292071122,0.0050681303923603,0.056299893226725614
6.321321321321321,0.010700641555362322,0.011401341492692785,0.05598274967455468
6.336336336336336,0.01710250316868428,0.017841952856309417,0.05558185900795138
6.351351351351351,0.023584432571229937,0.024357710513155127,0.05510687564924372
6.366366366366366,0.030115672937315714,0.030917367293262433,0.054570504268108444
6.381381381381381,0.03666708862417162,0.03749124055641176,0.05398825557127819
6.396396396396396,0.04321171035814372,0.04405176979858663,0.0533780315850959
6.411411411411412,0.04972525985665464,0.05057406227285101,0.05275953391199174
6.426426426426427,0.056186642028316754,0.05703641351393607,0.0521534993967734
6.441441441441442,0.06257839243966748,0.06342078861375268,0.051580783652993255
6.456456456456457,0.06888706740258377,0.06971324931311819,0.05106133375063784
6.471471471471472,0.0751035638600891,0.07590431151671152,0.05061311492672349
6.486486486486487,0.08122335629063658,0.08198921777935234,0.05025107795355971
6.501501501501502,0.08724663819412701,0.08796810973994774,0.04998626735592728
6.516516516516517,0.0931783564659006,0.09384608649039546,0.0498251693845227
6.531531531531532,0.09902812821540037,0.09963313655499846,0.04976937849263337
6.546546546546547,0.10481003144865723,0.10534393360242252,0.04981562322016562
6.561561561561562,0.11054226359447086,0.11099748926835633,0.04995614413095187
6.576576576576577,0.11624666516466044,0.11661666053804103,0.05017936914781372
6.591591591591592,0.12194810989884004,0.12222751396697305,0.050470796615616216
6.606606606606607,0.12767376748736195,0.12785855447523883,0.05081398077272566
6.621621621621622,0.13345225024958154,0.13353983232734692,0.05119151876438189
6.636636636636637,0.13931266074625417,0.13930194792159892,0.05158595810859692
6.651651651651652,0.14528356292914105,0.14517497981645297,0.05198057110765795
6.666666666666667,0.1513919047248404,0.1511873666343552,0.052359970825320554
6.681681681681682,0.1576619245290748,0.15736477771993784,0.052710566827005485
6.696696696696697,0.1641140775701048,0.16372901033599754,0.053020875470286576
6.711711711711712,0.1707640201445466,0.170296952475528,0.05328170884735203
6.726726726726727,0.1776216900741521,0.1770796498743247,0.05348626951091779
6.741741741741742,0.18469052022907673,0.18408151347809118,0.05363017636242699
6.756756756756757,0.19196681859836184,0.19129969953989032,0.05371144208039906
6.771771771771772,0.19943934329155208,0.1987236889185883,0.05373041557857698
6.786786786786787,0.20708909429114977,0.20633508534462183,0.05368969536672854
6.801801801801802,0.2148893361188396,0.21410764481630948,0.053594012343655996
6.816816816816817,0.22280585727609498,0.22200754031743114,0.053450074380333036
6.831831831831832,0.23079746384591915,0.22999385811981768,0.053266360870040635
6.846846846846847,0.23881669645057604,0.23801931441542795,0.05305285395429061
6.861861861861862,0.2468107522419182,0.2460311741935814,0.05282069494047162
6.876876876876877,0.2547225870549111,0.2539723483308843,0.05258175980041226
6.891891891891892,0.2624921674707747,0.2617826398934856,0.05234815644598404
6.906906906906907,0.27005783839346714,0.26940010668642894,0.05213165799627185
6.921921921921922,0.27735776882640845,0.27676250409207603,0.051943099048186295
6.936936936936937,0.28433143675955397,0.28380877016037737,0.05179177391455579
6.951951951951952,0.29092111331624626,0.290480513687908,0.05168488434268235
6.966966966966967,0.2970733064358188,0.29672346560865853,0.051627086918697336
6.981981981981982,0.30274012527658717,0.3024888544075972,0.05162018558265391
6.996996996996997,0.3078805281541473,0.30773466748411005,0.05166300233117637
7.012012012012012,0.3124614191747531,0.31242676249295065,0.05175144100588915
7.027027027027027,0.31645856182609144,0.31653979574973756,0.0518787383288462
7.042042042042042,0.31985728172517053,0.3200579388792038,0.05203587697596224
7.057057057057057,0.3226529355803981,0.32297536005579547,0.05221212091188471
7.072072072072072,0.3248511292631787,0.3252964524376583,0.05239562545695036
7.087087087087087,0.3264676747051572,0.3270357996548068,0.052574073840071664
7.102102102102102,0.3275282830534984,0.3282178763196756,0.05273529700833986
7.117117117117117,0.3280679999305298,0.3288764902238777,0.052867842070897134
7.132132132132132,0.32813039744081773,0.3290539818121996,0.05296146472090183
7.147147147147147,0.3277665463262418,0.3288002052446868,0.05300753053969161
7.162162162162162,0.3270337998869487,0.32817132337717664,0.05299931817768839
7.177177177177177,0.32599442842783555,0.3272284558041315,0.052932223627611324
7.192192192192192,0.32471414854134695,0.32603622424581274,0.05280386922905223
7.207207207207207,0.3232605950633512,0.32466124264438917,0.05261412398401754
7.222222222222222,0.3217017847393534,0.3231706001164341,0.05236504359276492
7.237237237237237,0.32010461939023355,0.32163038332013144,0.052060739658628626
7.252252252252252,0.31853347274571336,0.3201042809516274,0.0517071879916342
7.267267267267267,0.3170488993940159,0.31865230728799177,0.051311986022231554
7.282282282282282,0.3157064969248765,0.31732967440462295,0.05088406914358066
7.297297297297297,0.3145559438960134,0.31618583448576765,0.0504333954663311
7.312312312312312,0.31364022737539676,0.31526370514626734,0.04997060815838661
7.327327327327327,0.31299506515251374,0.314599082510778,0.04950668444590526
7.342342342342342,0.31264851986299314,0.3142202395051725,0.049052580653860395
7.357357357357357,0.31262079571302354,0.31414770083810467,0.04861888347469725
7.372372372372372,0.3129242035555197,0.3143941817703466,0.04821547893234178
7.387387387387387,0.3135632769222372,0.31496467509864173,0.047851252004051895
7.402402402402402,0.31453502024671054,0.31585666976370047,0.047533831092806095
7.4174174174174174,0.3158292707538041,0.3170604849208116,0.04726939185387486
7.4324324324324325,0.3174291570402382,0.3185597048547062,0.04706253358577765
7.4474474474474475,0.3193116398229461,0.32033170235918873,0.0469162379865621
7.4624624624624625,0.3214481232235268,0.3223482406736924,0.0468319144245374
7.4774774774774775,0.323805127803619,0.3245761463104004,0.04680952837622457
7.4924924924924925,0.3263450189095869,0.3269780466989344,0.046847801269422125
7.5075075075075075,0.32902678533564866,0.32951316718978935,0.04694446193660733
7.5225225225225225,0.3318068635917762,0.33213818138617873,0.047096523638152844
7.5375375375375375,0.3346400020284309,0.3348081069631427,0.04730055736045531
7.5525525525525525,0.33748015675452747,0.3374772361990888,0.04755293258535126
7.5675675675675675,0.340281407894965,0.34010008667389674,0.047850001126754374
7.5825825825825826,0.3429988806459345,0.3426323534146876,0.048188207483835045
7.597597597597598,0.34558965131390806,0.3450318397379922,0.048564119461144604
7.612612612612613,0.3480136146674097,0.3472593407348371,0.048974384126544125
7.627627627627628,0.35023428610305246,0.3492794513344119,0.049415624849182806
7.642642642642643,0.3522195108753956,0.35106127061702747,0.04988430351065169
7.657657657657658,0.35394205336247636,0.3525789758059602,0.050376576622004336
7.672672672672673,0.3553800422201262,0.3538122432030707,0.05088817418769101
7.687687687687688,0.35651725225088193,0.3547464990544093,0.05141432570571843
7.702702702702703,0.35734321055477786,0.355372990523795,0.05194974950764047
7.717717717717718,0.3578531224984776,0.35568867502671453,0.05248871125851616
7.732732732732733,0.3580476215460753,0.35569593445054437,0.05302514676576972
7.747747747747748,0.35793235529309847,0.35540212857195863,0.053552835136094344
7.762762762762763,0.3575174274310479,0.3548190086717452,0.054065602158368774
7.777777777777778,0.3568167212699377,0.35396201748592643,0.05455753125372161
7.792792792792793,0.35584713448259836,0.3528495049584328,0.05502316034220212
7.807807807807808,0.3546277567544763,0.3515018907189559,0.05545764683785063
7.822822822822823,0.35317902209597146,0.3499408039325641,0.05585688865116956
7.837837837837838,0.3515218659586295,0.3481882294362044,0.05621759541768772
7.852852852852853,0.34967691438208937,0.3462656862677406,0.05653731019043429
7.867867867867868,0.34766372864276673,0.3441934612197365,0.05681438681336469
7.882882882882883,0.3455001247377712,0.3419899163114667,0.05704793172980236
7.897897897897898,0.34320158292452846,0.3396708854080281,0.05723772096269861
7.912912912912913,0.34078075876011904,0.337249171874678,0.0573841035417427
7.927927927927928,0.33824710383812084,0.3347341562804126,0.057487901995150595
7.942942942942943,0.3356066017727534,0.332131520789763,0.05755031898304048
7.957957957957958,0.3328616228808287,0.32944309493587565,0.05757285703932102
7.972972972972973,0.3300108993134549,0.326666825797031,0.05755725598959838
7.987987987987988,0.3270496208752812,0.3237968739913676,0.05750545015071307
8.003003003003004,0.3239696501907644,0.32082383512519486,0.05741954506606621
8.018018018018019,0.3207598539938767,0.3177350841575446,0.05730181141828672
8.033033033033034,0.31740654493978754,0.3145152374104135,0.05715469198516837
8.048048048048049,0.3138940253626167,0.3111467235852782,0.05698081614839181
8.063063063063064,0.3102052208514106,0.3076104511894186,0.056783015603520136
8.078078078078079,0.3063223875436037,0.3038865554171451,0.05656433462739308
8.093093093093094,0.30222787293527026,0.29995520309510537,0.056328028599878614
8.108108108108109,0.29790490618773297,0.29579743022236415,0.05607754549253239
8.123123123123124,0.29333839084388413,0.29139598341030537,0.05581648672397629
8.138138138138139,0.28851567102835696,0.2867361346407167,0.055548546068637586
8.153153153153154,0.2834272419894553,0.2818064386091485,0.055277428029918085
8.168168168168169,0.2780673774914278,0.27659940373515934,0.05500674999082134
8.183183183183184,0.27243465011798484,0.27111205170967945,0.05473993518908504
8.198198198198199,0.266532325800176,0.26534634597494916,0.05448010573825946
8.213213213213214,0.2603686204073308,0.2593094763288476,0.05422998615652711
8.228228228228229,0.2539568134380742,0.25301399427735044,0.05399182789127715
8.243243243243244,0.24731522102598616,0.24647780110821704,0.05376736402505294
8.258258258258259,0.24046703694230676,0.23972399722736484,0.05355780081224692
8.273273273273274,0.23344005544761418,0.23278060650445037,0.053363849228472066
8.288288288288289,0.22626629330364562,0.22568019282435256,0.05318579577495809
8.303303303303304,0.2189815298159406,0.2184593875767652,0.05302360789343843
8.318318318318319,0.21162478348129596,0.21115834651345872,0.052877065997136236
8.333333333333334,0.20423774191486008,0.20382015254660887,0.05274591166227984
8.348348348348349,0.19686415864798315,0.19649017809348115,0.052630000117118034
8.363363363363364,0.18954922664103518,0.1892154170283945,0.05252944478700851
8.378378378378379,0.18233893450886815,0.18204379274819735,0.052444742134982555
8.393393393393394,0.1752794080583896,0.17502344583123416,0.05237686613901124
8.408408408408409,0.16841623727380484,0.16820200273633612,0.052327323250075226
8.423423423423424,0.16179378774189376,0.16162582630082917,0.05229816045132933
8.438438438438439,0.1554544959450931,0.15533924966790688,0.052291921094364674
8.453453453453454,0.14943814996943397,0.1493837977548241,0.052311545660679644
8.468468468468469,0.1437811609093194,0.14379740433547303,0.05236021769844079
8.483483483483484,0.13851583534357673,0.13861363793553638,0.05244115910573934
8.498498498498499,0.13366966525087245,0.1338609555183399,0.0525573837063996
8.513513513513514,0.12926465798037415,0.12956200869772205,0.05271142344509963
8.528528528528529,0.1253167345897828,0.12573303214764883,0.05290504690609199
8.543543543543544,0.12183522910690756,0.1223833471311916,0.05313899428465687
8.558558558558559,0.11882252316651126,0.11951501383781209,0.05341275527579938
8.573573573573574,0.11627384925758558,0.11712266386386977,0.05372441554494356
8.588588588588589,0.11417729099948432,0.1151935383619168,0.05407059289509585
8.603603603603604,0.11251400036687706,0.11370774818844046,0.054446476047294835
8.618618618618619,0.11125864001678605,0.11263876032815162,0.05484596804444644
8.633633633633634,0.11038004475965005,0.1119541009460196,0.05526192431827987
8.64864864864865,0.10984208111847664,0.11161625095297449,0.055686464421628716
8.663663663663664,0.10960466946023424,0.11158369649300437,0.056111328195913135
8.67867867867868,0.10962492101769859,0.11181208576520991,0.056528243026265
8.693693693693694,0.10985833367525215,0.1122554363253395,0.05692926931439058
8.70870870870871,0.11025998663716106,0.11286733426105883,0.0573070959898928
8.723723723723724,0.11078567539014542,0.1136020686333744,0.057655265717051415
8.73873873873874,0.1113929344226896,0.11441565097012214,0.05796831898609005
8.753753753753754,0.1120419051079097,0.11526667953091067,0.05824185600019755
8.76876876876877,0.11269601872939507,0.11611702033651927,0.05847252388974928
8.783783783783784,0.11332247838568744,0.11693229022438059,0.058657943391587204
8.7987987987988,0.11389253705028007,0.11768214016362438,0.0587965932509309
8.813813813813814,0.11438158122124802,0.11834034866165224,0.05888767217118062
8.82882882882883,0.1147690395438828,0.1188847445598871,0.058930957406031
8.843843843843844,0.11503814309001087,0.11929698544181717,0.058926676518118774
8.85885885885886,0.11517556854193105,0.119562222181544,0.05887540497324966
8.873873873873874,0.11517099754740832,0.11966868202564399,0.058777997658533726
8.88888888888889,0.11501662535484489,0.11960720237675623,0.05863555760937551
8.903903903903904,0.11470664995682435,0.11937074556741202,0.05844944061813558
8.91891891891892,0.11423676982065128,0.11895392181665408,0.05822129029380875
8.933933933933934,0.11360371427071617,0.11835254364256843,0.05795309477901636
8.94894894894895,0.1128048260386142,0.11756323057930149,0.05764725387520746
8.963963963963964,0.11183771066608847,0.11658307835798802,0.05730664390514954
8.97897897897898,0.1106999625272619,0.11540940193491843,0.056934667354968695
8.993993993993994,0.10938897239056106,0.11403955702717929,0.05653527526524438
9.00900900900901,0.1079018168186737,0.11247084027662621,0.05611295252161329
9.024024024024024,0.10623522546677101,0.11070046395119579,0.055672659593078766
9.03903903903904,0.10438561865879895,0.10872559737653317,0.05521972871892315
9.054054054054054,0.10234920467756055,0.1065434642589215,0.05475971772149886
9.06906906906907,0.10012212415949483,0.104151482901022,0.05429823000340128
9.084084084084084,0.09770062795903205,0.10154743518227817,0.05384071419593105
9.0990990990991,0.09508127488806498,0.09872965016628778,0.05339226061165375
9.114114114114114,0.0922611367993179,0.09569718930037471,0.05295741343352591
9.12912912912913,0.08923800042453374,0.09245002226524998,0.05254001698892088
9.144144144144144,0.08601055796523759,0.08898918537947867,0.05214311141470354
9.15915915915916,0.08257858136536676,0.08531691773980923,0.051768887854088286
9.174174174174174,0.07894307814158764,0.08143677361116208,0.05141870676356768
9.18918918918919,0.07510642928992102,0.07735371259761298,0.05109317592534682
9.204204204204204,0.07107251185666569,0.07307417150730212,0.05079227837689231
9.21921921921922,0.06684681006542051,0.06860612333877555,0.050515535533617005
9.234234234234235,0.06243651933140438,0.06395912934519277,0.050262187817060815
9.24924924924925,0.05785064706545165,0.05914438967383534,0.05003137424975408
9.264264264264265,0.053100112953975986,0.05417479673284304,0.04982229354102247
9.27927927927928,0.04819784954543097,0.04906499338612418,0.04963433174480556
9.294294294294295,0.04315890167059122,0.043831435551861656,0.049467145120037775
9.30930930930931,0.03800052068886997,0.038492456031836875,0.04932069090616657
9.324324324324325,0.03274224700662648,0.03306832367641774,0.049195202993862916
9.33933933933934,0.027405971968515654,0.027581289521335203,0.04909111370468648
9.354354354354355,0.02201596827494929,0.022055609514244068,0.0490089269694884
9.36936936936937,0.016598876701190642,0.016517532043310763,0.04894905202599701
9.384384384384385,0.011183636234770871,0.010995237812504246,0.0489116102285362
9.3993993993994,0.005801344928194589,0.005518719769699634,0.04889623049742121
9.414414414414415,4.850398719929513e-4,1.1959184028222463e-4,0.04890185107847339
9.42942942942943,-0.0047306132194230525,-0.005169182828879185,0.0489265463392886
9.444444444444445,-0.009809727243191983,-0.010313650570747446,0.04896739702790855
9.45945945945946,-0.014715700186079326,-0.015279315635370369,0.04902042059497814
9.474474474474475,-0.019411818424090437,-0.02003167677382989,0.049080574837411094
9.48948948948949,-0.02386194892998216,-0.024536845449255884,0.04914184346621491
9.504504504504505,-0.028031306586507185,-0.028762233895207667,0.049197406618971
9.51951951951952,-0.03188727684541723,-0.03267729592810602,0.04923989332349766
9.534534534534535,-0.03540026833542238,-0.03625429837818648,0.049261706981585184
9.54954954954955,-0.038544565141904415,-0.03946909659334296,0.049255409509504224
9.564564564564565,-0.04129914480980032,-0.04230188406832736,0.04921414513546059
9.57957957957958,-0.04364842609119243,-0.04473788422189442,0.049132081152335326
9.594594594594595,-0.045582910438653895,-0.046767952004465374,0.049004840178635954
9.60960960960961,-0.04709968348992276,-0.0483890546030635,0.04882989666203298
9.624624624624625,-0.04820274739662689,-0.04960460413198128,0.048606909465519633
9.63963963963964,-0.0489031617224398,-0.05042462081657144,0.04833796250314331
9.654654654654655,-0.049218979461857756,-0.05086571257794646,0.04802768679056394
9.66966966966967,-0.049174974984281514,-0.050950865711315414,0.04768324037181117
9.684684684684685,-0.048802171680201796,-0.05070905095772795,0.04731412795788123
9.6996996996997,-0.048137187941541836,-0.05017465900838215,0.04693185040835802
9.714714714714715,-0.04722142996580004,-0.04938678859591636,0.04654938592010519
9.72972972972973,-0.04610016790332452,-0.04838841807140137,0.04618052003795669
9.744744744744745,-0.04482153738664831,-0.047225497085827677,0.04583905961665365
9.75975975975976,-0.04343551104037152,-0.04594599820965464,0.04553798467634169
9.774774774774775,-0.04199288400842988,-0.04459896878582195,0.04528860840877623
9.78978978978979,-0.040544313999250826,-0.04323362103900711,0.045099825186242316
9.804804804804805,-0.03913945026977572,-0.04189849373938976,0.04497752524690997
9.81981981981982,-0.03782617800268716,-0.04064071205177889,0.04492424048140468
9.834834834834835,-0.03664999547020128,-0.03950536425917075,0.04493905932974237
9.84984984984985,-0.03565353205176345,-0.03853500557624489,0.04501781477467822
9.864864864864865,-0.03487620635146977,-0.037769290990230256,0.045153514933186006
9.87987987987988,-0.034354015975553286,-0.03724473161621685,0.04533695821838561
9.894894894894895,-0.034119444423869064,-0.03699456291013589,0.04555745964224099
9.90990990990991,-0.03420146625716364,-0.03704870853937671,0.0458036129793061
9.924924924924925,-0.034625629261234116,-0.03743382087482624,0.04606402299526597
9.93993993993994,-0.03541419161140206,-0.03817337787873552,0.046327958306381055
9.954954954954955,-0.03658629279789533,-0.039287816430948135,0.04658589381918067
9.96996996996997,-0.03815813898725195,-0.04079468358881242,0.04682992826875118
9.984984984984985,-0.04014318622664763,-0.04270878960282244,0.04705407495236925
10,-0.042552308122373046,-0.04504234940118305,0.04725443175322609
10.015015015015015,-0.045393938057117326,-0.04780510243308422,0.04742924050056727
10.03003003003003,-0.048674179425129326,-0.0510044039916931,0.047578846735711736
10.045045045045045,-0.052396880590061944,-0.05464528424799548,0.047705570319636154
10.06006006006006,-0.05656367419130369,-0.05873047409297661,0.04781349618575582
10.075075075075075,-0.061173982968402464,-0.06326039943016512,0.04790819382636741
10.09009009009009,-0.06622499639884272,-0.06823314773808248,0.04799637442354111
10.105105105105105,-0.07171162413083892,-0.07364441250757689,0.048085496199533485
10.12012012012012,-0.07762643342936139,-0.07948742253639754,0.048183331538137995
10.135135135135135,-0.08395957863464883,-0.0857528640179832,0.04829751333839347
10.15015015015015,-0.09069873095562934,-0.09242880387671493,0.04843508219311451
10.165165165165165,-0.09782901678935764,-0.09950062286107653,0.048602059367173475
10.18018018018018,-0.10533297218626998,-0.10695096649887385,0.04880307212356354
10.195195195195195,-0.11319052010221334,-0.11475972115046763,0.04904105680425224
10.21021021021021,-0.12137897574877861,-0.1229040210994446,0.04931706074415758
10.225225225225225,-0.1298730837589877,-0.13135829096417923,0.04963015674859892
10.24024024024024,-0.13864508914018867,-0.14009432580855957,0.04997747435863429
10.255255255255255,-0.1476648422279106,-0.14908140932540073,0.05035434186220582
10.27027027027027,-0.15689993623461598,-0.15828646854073838,0.05075452358457431
10.285285285285285,-0.1663158746550928,-0.16767426183145415,0.051170529821623824
10.3003003003003,-0.1758762648762263,-0.1772075958402882,0.05159397276433226
10.315315315315315,-0.1855430339372161,-0.1868475662503185,0.05201594113975174
10.33033033033033,-0.19527666254031242,-0.19655381742280878,0.052427368683929026
10.345345345345345,-0.20503643410503022,-0.20628481660671155,0.0528193761568361
10.36036036036036,-0.21478069681049886,-0.21599813970922274,0.05318357241296605
10.375375375375375,-0.22446713804214224,-0.22565076730894437,0.05351230608681649
10.39039039039039,-0.23405307226254343,-0.23519939146662738,0.05379886494679382
10.405405405405405,-0.24349574484124858,-0.2446007356729452,0.05403762436290466
10.42042042042042,-0.2527526555688489,-0.25381189168573026,0.05422414932359236
10.435435435435435,-0.26178190621750075,-0.2627906777853502,0.05435525595442893
10.45045045045045,-0.27054257639124796,-0.27149602289643165,0.054429038657530245
10.465465465465465,-0.27899513088223393,-0.27988837993730653,0.05444486807979787
10.48048048048048,-0.28710185973153374,-0.2879301696071009,0.054403363516950486
10.495495495495495,-0.2948273491951749,-0.2955862526539121,0.05430634152269774
10.51051051051051,-0.3021389779557448,-0.3028244246540699,0.05415674088683126
10.525525525525525,-0.30900742843758006,-0.30961592276142236,0.05395852319389
10.54054054054054,-0.3154071983418014,-0.31593592915936103,0.05371654818301685
10.555555555555555,-0.32131709298954647,-0.3217640515608213,0.05343642423036694
10.57057057057057,-0.32672067529882715,-0.3270847575988013,0.05312433637582137
10.585585585585585,-0.3316066477977326,-0.3318877378756063,0.05278685708758835
10.6006006006006,-0.33596914052173377,-0.33616817226390316,0.052430747870157265
10.615615615615615,-0.3398078803495104,-0.33992687610096445,0.05206276222409474
10.63063063063063,-0.34312822147851024,-0.34317030729559694,0.05168946172597286
10.645645645645645,-0.34594102322515424,-0.34591042191605637,0.05131705664925188
10.66066066066066,-0.34826236974128144,-0.3481643741039711,0.050951280439786306
10.675675675675675,-0.35011313586207404,-0.3499540654664921,0.0505973037332961
10.69069069069069,-0.35151841321538335,-0.3513055585552696,0.050259689073336486
10.705705705705705,-0.3525068198998247,-0.3522483776916146,0.049942382923342875
10.72072072072072,-0.3531097244936642,-0.35281472734302316,0.04964873786865631
10.735735735735735,-0.3533604200903981,-0.3530386627810391,0.04938155577621959
10.75075075075075,-0.3532932859765562,-0.3529552494213758,0.049143142431587454
10.765765765765765,-0.3529429733490842,-0.3525997459703888,0.048935365645029594
10.78078078078078,-0.3523436473637032,-0.3520068425229691,0.048759711437101075
10.795795795795796,-0.35152831137853086,-0.35120997860933445,0.04861733586401894
10.81081081081081,-0.35052823129111266,-0.35024075860259585,0.04850911249863433
10.825825825825826,-0.3493724692375979,-0.3491284736930256,0.048435676925145964
10.84084084084084,-0.34808752747902505,-0.34789973160379845,0.048397469569463614
10.855855855855856,-0.34669709576820684,-0.3465781880508036,0.04839477690193255
10.87087087087087,-0.3452218894139322,-0.3451843681501053,0.04842776897954353
10.885885885885886,-0.3436795609708188,-0.3437355618704894,0.048496529105867534
10.9009009009009,-0.3420846661161175,-0.3422457753449669,0.04860106977773421
10.915915915915916,-0.34044866379027494,-0.34072571936029944,0.04874132863304932
10.93093093093093,-0.33877993190549194,-0.33918281747624845,0.04891713914673175
10.945945945945946,-0.33708378260363847,-0.3376212187363562,0.04912817336823034
10.96096096096096,-0.3353624648532229,-0.33604180351441465,0.049373857768960444
10.975975975975976,-0.3336151467646954,-0.33444217536044485,0.04965326771884568
10.99099099099099,-0.33183787501278483,-0.3328166364210739,0.04996501050713137
11.006006006006006,-0.3300235138228001,-0.3311561487678588,0.050307110375693166
11.02102102102102,-0.3281616707572397,-0.3294482884429407,0.05067691103792344
11.036036036036036,-0.32623862070771387,-0.3276772029200661,0.05107101112790861
11.05105105105105,-0.32423724277550925,-0.3258235857165141,0.051485245804986
11.066066066066066,-0.32213698689165293,-0.32386468387088885,0.0519147235445547
11.08108108108108,-0.3199138879403531,-0.32177435478872823,0.052353921537498856
11.096096096096096,-0.3175406447533234,-0.3195231885023771,0.052796836894272225
11.11111111111111,-0.3149867796756043,-0.31707870973210023,0.05323718487898535
11.126126126126126,-0.31221889159341754,-0.3144056713933544,0.053668630465461754
11.14114114114114,-0.30920101156116003,-0.3114664475596821,0.05408503616785781
11.156156156156156,-0.3058950657168901,-0.3082215295960288,0.05448070761730868
11.17117117117117,-0.3022614453031887,-0.3046301244766877,0.054850618711905594
11.186186186186186,-0.29825967857685187,-0.3006508494427691,0.055190600119594556
11.2012012012012,-0.29384919443294133,-0.29624251235998317,0.055497478099110834
11.216216216216216,-0.2889901628829869,-0.2913649625979244,0.0557691546316915
11.23123123123123,-0.2836443932692625,-0.28597999312312145,0.056004624374668466
11.246246246246246,-0.2777762673880103,-0.2800522709086264,0.05620392867334881
11.26126126126126,-0.27135368163418094,-0.2735502698262464,0.05636805157172569
11.276276276276276,-0.26434896996150054,-0.2664471780125837,0.056498767233634284
11.29129129129129,-0.25673977797167563,-0.2587217503975788,0.0565984521801438
11.306306306306306,-0.2485098579119515,-0.25035907676741603,0.056669878956726705
11.32132132132132,-0.23964975488323448,-0.2413512365101551,0.05671600988976766
11.336336336336336,-0.23015735624690462,-0.2316978131498679,0.056739810080676197
11.35135135135135,-0.22003827914719679,-0.22140624496318617,0.05674409738927634
11.366366366366366,-0.20930607526907066,-0.21049199238324384,0.05673144372701699
11.381381381381381,-0.19798223739138557,-0.19897850845056972,0.05670413664568707
11.396396396396396,-0.18609599884908212,-0.18689700510800195,0.05666420343311707
11.411411411411411,-0.17368392447154174,-0.1742860154177094,0.05661349248975901
11.426426426426426,-0.16078929961603583,-0.16119075949474293,0.05655379964138541
11.441441441441441,-0.14746133219357943,-0.14766232974696386,0.05648702126452968
11.456456456456456,-0.13375419067447458,-0.13375671850751772,0.05641531253314892
11.471471471471471,-0.11972590853663832,-0.11953371797231353,0.056341228293677284
11.486486486486486,-0.10543719207972356,-0.10505572817508793,0.05626782618284958
11.501501501501501,-0.09095017362505434,-0.0903865132673533,0.05619871632363762
11.516516516516516,-0.07632715558563215,-0.07558994941152285,0.05613804858895719
11.531531531531531,-0.06162939254044949,-0.06072880900954677,0.05609043604891037
11.546546546546546,-0.0469159581895294,-0.0458636257137371,0.05606082070977288
11.561561561561561,-0.03224274188465634,-0.03105168269718421,0.05605429391774026
11.576576576576576,-0.0176616153718605,-0.01634616303891943,0.05607588791930926
11.591591591591591,-0.0032198045381461294,-0.0017954958759087204,0.05613035646240781
11.606606606606606,0.011040506543474757,0.01255707471288024,0.056221960882813726
11.621621621621621,0.025082320962259878,0.02667367917149237,0.05635427429681024
11.636636636636636,0.038873715657778016,0.04052176060403559,0.05653001128884708
11.651651651651651,0.05238747262729655,0.054073762118757196,0.05675088518606204
11.666666666666666,0.06560046965416233,0.06730657478581681,0.05701749107235229
11.681681681681681,0.07849285746249197,0.0802007687306307,0.05732921124477111
11.696696696696696,0.09104706156110498,0.092739640714985,0.057684141341319085
11.711711711711711,0.1032466571275905,0.10490812147754293,0.05807903949152778
11.726726726726726,0.11507517333811026,0.11669159443148175,0.05850930631743456
11.741741741741741,0.12651488885103793,0.12807468337765104,0.058969008608036215
11.756756756756756,0.13754568213115764,0.13904007010992928,0.05945096206409086
11.771771771771771,0.14814399863190572,0.149567402772667,0.05994688718564405
11.786786786786786,0.15828199153663924,0.1596323524444174,0.060447646617004094
11.801801801801801,0.16792688415189866,0.16920586883546357,0.060943562700422664
11.816816816816816,0.17704059082990845,0.17825367666567182,0.061424802291976804
11.831831831831831,0.18557962039967174,0.18673604294705867,0.06188180435688351
11.846846846846846,0.1934952725429253,0.1946078328964338,0.06230571682681867
11.861861861861861,0.2007341243616749,0.20181885944235414,0.06268880450016916
11.876876876876876,0.20723879237159107,0.20831451906994577,0.06302479034998518
11.891891891891891,0.21294894487158103,0.21403669567829928,0.06330909843074643
11.906906906906906,0.2178025313264528,0.2189249045721633,0.06353897671991175
11.921921921921921,0.22173718901587397,0.22291764078715903,0.06371349114971507
11.936936936936936,0.22469178250538566,0.22595388957067805,0.06383339592552183
11.951951951951951,0.22660802815104064,0.22797475181219873,0.06390089811515096
11.966966966966966,0.22743215355416868,0.22892513333437933,0.06391934476982221
11.981981981981981,0.22711654045919139,0.22875544410777943,0.0638928672420418
11.996996996996996,0.2256212990408894,0.22742325168244185,0.06382601918140829
12.012012012012011,0.22291572205035953,0.22489483265864016,0.06372344184220237
12.027027027027026,0.21897956921352985,0.22114656720716924,0.06358958343404453
12.042042042042041,0.2138041359851816,0.21616612491419843,0.06342848951800117
12.057057057057056,0.20739306657667517,0.20995339592783208,0.0632436705651103
12.072072072072071,0.1997628792473236,0.2025211297057883,0.06303804256937996
12.087087087087086,0.19094318206930844,0.19389525450846437,0.06281392865336607
12.102102102102101,0.18097656933584505,0.18411486371487587,0.06257310499966615
12.117117117117116,0.16991820178509728,0.17323186929339898,0.0623168735248433
12.132132132132131,0.1578350869415632,0.16131033730533825,0.06204614605530818
12.147147147147146,0.14480508810813467,0.14842553399029537,0.06176152932952063
12.162162162162161,0.13091570088199195,0.13466272263340637,0.061463405580392094
12.177177177177176,0.11626264368955005,0.1201157600852312,0.06115200840694778
12.192192192192191,0.10094831319344391,0.10488554685405023,0.060827497096460126
12.207207207207206,0.08508015632050836,0.08907838587848103,0.060490033968403675
12.222222222222221,0.06876900826022389,0.07280430259739193,0.060139868669008986
12.237237237237236,0.05212744058153728,0.056175373321753395,0.05977743107959864
12.252252252252251,0.03526815635311505,0.03930410101764074,0.059403431313039004
12.267267267267266,0.018302460711785165,0.02230186842555582,0.059018961935560825
12.282282282282281,0.0013388266214298947,0.0052774889886956595,0.05862559474886462
12.297297297297296,-0.015518432554869297,-0.011664132728423305,0.05822546268472638
12.312312312312311,-0.0321703788874637,-0.028423226827699728,0.057821316852314814
12.327327327327327,-0.048524554403663545,-0.04490627121268936,0.05741654957644561
12.342342342342342,-0.06449597761430459,-0.06102699645347314,0.05701517625485252
12.357357357357357,-0.08000803629389294,-0.07670728777354956,0.05662177182704878
12.372372372372372,-0.09499327977394093,-0.09187798851808957,0.05624136131217055
12.387387387387387,-0.1093941114189358,-0.10647960674854304,0.055879267923569294
12.402402402402402,-0.1231633782273589,-0.12046292270462763,0.055540926345332295
12.417417417417417,-0.1362648501882659,-0.13378949035562693,0.055231672450027434
12.432432432432432,-0.14867357772378736,-0.1464320217399968,0.05495652359348219
12.447447447447447,-0.16037611185559075,-0.15837463886820013,0.054719965183771
12.462462462462462,-0.1713705691978801,-0.16961297518820562,0.05452575910670715
12.477477477477477,-0.18166652295788774,-0.1801541074400539,0.054376787600972164
12.492492492492492,-0.19128470213893267,-0.190016299473648,0.05427494240116705
12.507507507507507,-0.20025648424221404,-0.1992285424224624,0.05422106384091957
12.522522522522522,-0.20862317190729876,-0.20782988047497988,0.05421492888909369
12.537537537537537,-0.21643505087020326,-0.21586851812930202,0.054255281744623844
12.552552552552552,-0.2237502349138804,-0.2234007128364804,0.054339896614252876
12.567567567567567,-0.23063331254555328,-0.23048946576992144,0.054465660402513265
12.582582582582582,-0.23715381926696716,-0.2372030324449725,0.05462866360968472
12.597597597597597,-0.24338456778990575,-0.24361328337470306,0.054824290611452026
12.612612612612612,-0.24939987572707603,-0.24979395225653253,0.05504730504890503
12.627627627627627,-0.2552737356247475,-0.2558188148321174,0.05529193130315652
12.642642642642642,-0.2610779753561656,-0.2617598452169031,0.055551937839925125
12.657657657657657,-0.2668804577478512,-0.26768539802785357,0.055820731559699334
12.672672672672672,-0.2727433669786962,-0.2736584641256559,0.05609147346049891
12.687687687687687,-0.2787216260909621,-0.2797350454868317,0.0563572246364798
12.702702702702702,-0.2848614853453739,-0.2859626910134328,0.05661112809435939
12.717717717717717,-0.29119931567298923,-0.2923792304137915,0.05684662667129302
12.732732732732732,-0.29776063564521893,-0.2990117380736679,0.057057711335596804
12.747747747747747,-0.30455939463113546,-0.3058757534299234,0.057239188265247626
12.762762762762762,-0.31159752941706176,-0.31297477897598164,0.05738694814125386
12.777777777777777,-0.3188648066186557,-0.3203000717322904,0.057498217650324146
12.792792792792792,-0.326338958619565,-0.32783073871533314,0.05757177157940632
12.807807807807807,-0.33398611625636576,-0.33553414142259075,0.05760808417665779
12.822822822822824,-0.34176153666228126,-0.34336660833742255,0.05760940055887363
12.837837837837839,-0.34961061917757935,-0.35127444767119415,0.0575797127074829
12.852852852852854,-0.357470195692344,-0.35919524480826537,0.057524629869122205
12.867867867867869,-0.36527007402300543,-0.3670594201703101,0.05745113985899926
12.882882882882884,-0.3729348039884587,-0.3747920136544344,0.05736726575376792
12.897897897897899,-0.38038562607924026,-0.3823146518531576,0.05728163154443888
12.912912912912914,-0.3875425526298524,-0.3895476445951251,0.05720296002309319
12.927927927927929,-0.3943265220830782,-0.3964121487928844,0.05713953561492778
12.942942942942944,-0.4006615593029814,-0.40283233107145844,0.05709867269720488
12.957957957957959,-0.4064768699939404,-0.4087374570618254,0.057086234502253815
12.972972972972974,-0.4117087960183448,-0.4140638352846327,0.05710624734510891
12.987987987987989,-0.4163025613788626,-0.4187565476303201,0.057160648559194775
13.003003003003004,-0.42021374602397493,-0.4227709065825583,0.057249194146507004
13.018018018018019,-0.4234094361436312,-0.42607359112767995,0.05736953509331471
13.033033033033034,-0.4258690144663578,-0.4286434279408528,0.057517452146957075
13.048048048048049,-0.4275845710847766,-0.43047180082830677,0.05768722084759752
13.063063063063064,-0.4285609331239066,-0.4315626882504036,0.057872064865058664
13.078078078078079,-0.42881532868030803,-0.4319323447602432,0.058064648376553424
13.093093093093094,-0.42837671559729507,-0.43160865622511907,0.05825755811166627
13.108108108108109,-0.4272848177995122,-0.4306302098929726,0.05844373214491657
13.123123123123124,-0.4255889204857894,-0.4290451282240193,0.0586168038256555
13.138138138138139,-0.4233464802973587,-0.42690971981138315,0.05877134315450081
13.153153153153154,-0.4206216078548209,-0.4242870018917053,0.05890299216941772
13.168168168168169,-0.4174834783073614,-0.4212451473863101,0.059008503548791925
13.183183183183184,-0.4140047214578197,-0.4178559057595506,0.05908570125151233
13.198198198198199,-0.41025983736965926,-0.41419304191755413,0.0591333877558574
13.213213213213214,-0.40632367682817194,-0.41033083152630934,0.05915122406238505
13.228228228228229,-0.4022700191932249,-0.40634264500655304,0.05913960635317581
13.243243243243244,-0.39817027345580575,-0.4022996464114583,0.059099557777444627
13.258258258258259,-0.39409232194197746,-0.39826962760432955,0.05903264635358089
13.273273273273274,-0.3900995202052439,-0.39431599269667017,0.058940931750420825
13.288288288288289,-0.38624986122958993,-0.39049690257397507,0.0588269360750862
13.303303303303304,-0.38259530710624,-0.3868645844935102,0.05869362791394453
13.318318318318319,-0.37918128682447405,-0.38346480716861203,0.05854440555523673
13.333333333333334,-0.3760463547385988,-0.3803365174861946,0.058383064908126274
13.348348348348349,-0.37322200068969213,-0.3775116311211421,0.05821373997588704
13.363363363363364,-0.370732599758891,-0.37501496593953754,0.05804080826934864
13.378378378378379,-0.3685954873137345,-0.37286430436931434,0.05786875939493292
13.393393393393394,-0.36682114347657413,-0.37107056899759094,0.05770203122056466
13.408408408408409,-0.3654134704561171,-0.36963809462326574,0.05754482354063487
13.423423423423424,-0.3643701463460668,-0.36856497988083403,0.057400903221638835
13.438438438438439,-0.36368303994910145,-0.36784350230994234,0.05727341687450588
13.453453453453454,-0.3633386728054617,-0.3674605822526292,0.05716472695669726
13.468468468468469,-0.3633187167150661,-0.3673982830322794,0.0570762849859664
13.483483483483484,-0.3636005174269815,-0.36763433728056927,0.057008551681994056
13.498498498498499,-0.3641576376057763,-0.3681426917922833,0.05696096899856551
13.513513513513514,-0.3649604144563851,-0.3688940656743828,0.056931983930211205
13.528528528528529,-0.3659765293136278,-0.369856518618543,0.05691911940975192
13.543543543543544,-0.36717158793813504,-0.3709960277138513,0.05691908414631722
13.558558558558559,-0.3685097111155107,-0.37227707222936823,0.056927911244166164
13.573573573573574,-0.36995413538763605,-0.37366322618638415,0.05694111498214874
13.588588588588589,-0.37146782335612644,-0.37511775830517785,0.056953856066782764
13.603603603603604,-0.3730140820254987,-0.37660423808448035,0.05696110765794925
13.618618618618619,-0.37455718616142814,-0.37808714541404675,0.056957817060861504
13.633633633633634,-0.376063001709148,-0.3795324793097672,0.056939060715664014
13.64864864864865,-0.3774996020418178,-0.3809083591866835,0.05690019257718344
13.663663663663664,-0.3788378672921862,-0.3821856096488735,0.056836987832276246
13.67867867867868,-0.38005205437889855,-0.38333831718993655,0.056745784931800845
13.693693693693694,-0.38112032270589075,-0.3843443445967977,0.05662362901101322
13.70870870870871,-0.3820251980511737,-0.3851857863935196,0.0564684189289349
13.723723723723724,-0.38275395506771137,-0.38584934654777747,0.05627905844899901
13.73873873873874,-0.3832988973338178,-0.3863266181293545,0.05605560964917331
13.753753753753754,-0.3836575132942311,-0.3866142439362467,0.05579944367841745
13.76876876876877,-0.3838324870373247,-0.38671393759772255,0.05551338069943931
13.783783783783784,-0.3838315449760264,-0.38663234663753093,0.05520180755225735
13.7987987987988,-0.38366712342514175,-0.38638074271341705,0.05487075867334629
13.813813813813814,-0.38335584799516675,-0.38597452993564896,0.05452794351929489
13.82882882882883,-0.38291782370547683,-0.3854325698579116,0.05418270266613453
13.843843843843844,-0.3823757446014407,-0.38477633127629995,0.05384587545749862
13.85885885885886,-0.3817538430255292,-0.3840288839640736,0.053529565154134665
13.873873873873874,-0.3810767108438644,-0.38321376723735645,0.05324679349964624
13.88888888888889,-0.380368036903461,-0.3823537758618598,0.053011045680531915
13.903903903903904,-0.379649315630394,-0.38146971615423025,0.05283571849757413
13.91891891891892,-0.3789385897345631,-0.38057919300793375,0.052733498068975405
13.933933933933934,-0.37824929430374343,-0.37969549286110454,0.05271570655280237
13.94894894894895,-0.377589269250258,-0.3788266274463709,0.0527916675091681
13.963963963963964,-0.3769600016473887,-0.3779745980493795,0.05296814380629611
13.97897897897898,-0.37635614903609416,-0.37713493000461956,0.05324889837324649
13.993993993993994,-0.3757653799590792,-0.3762965128916799,0.05363441626703299
14.00900900900901,-0.37516854998583543,-0.375441764501226,0.05412180826992962
14.024024024024024,-0.3745402119145793,-0.37454711764510923,0.05470489524330941
14.03903903903904,-0.3738494394364361,-0.3735838100027377,0.05537445319935696
14.054054054054054,-0.3730609260193235,-0.37251894009128866,0.05611858532461358
14.06906906906907,-0.3721363065190083,-0.37131673851367625,0.05692318101686572
14.084084084084084,-0.37103563900005787,-0.36993999382435944,0.05777242321273644
14.0990990990991,-0.3697189788560924,-0.3683515670745242,0.05864931196708422
14.114114114114114,-0.3681479764297583,-0.36651592823712126,0.05953618164382312
14.12912912912913,-0.366287432375897,-0.36440065070370237,0.06041519855180674
14.144144144144144,-0.3641067511104755,-0.3619778060182285,0.06126883351399863
14.15915915915916,-0.36158124082881893,-0.3592252089608628,0.062080308753382676
14.174174174174174,-0.3586932177639855,-0.3561274720340992,0.0628340205105748
14.18918918918919,-0.3554328817396434,-0.3526768375046406,0.06351593842582055
14.204204204204204,-0.35179893903042936,-0.3488737638221471,0.06411398062964621
14.21921921921922,-0.34779895671992744,-0.3447272511423654,0.06461836043122998
14.234234234234235,-0.34344944004452177,-0.34025489775292034,0.06502189711161133
14.24924924924925,-0.33877563075111794,-0.3354826855690545,0.06532028011421535
14.264264264264265,-0.3338110305544348,-0.33044449880831317,0.0655122732377562
14.27927927927928,-0.32859665970981244,-0.32518138580529243,0.06559984354668662
14.294294294294295,-0.32318006687315054,-0.3197405800148041,0.06558819885891894
14.30930930930931,-0.3176141130726498,-0.3141743028130979,0.06548571810398435
14.324324324324325,-0.311955559890932,-0.3085383778370203,0.06530376086982391
14.33933933933934,-0.30626349977199413,-0.30289069420531134,0.06505634641886597
14.354354354354355,-0.3005976744153696,-0.29728956373720233,0.06475969868599904
14.36936936936937,-0.29501673495674996,-0.2917920247010866,0.06443166246926649
14.384384384384385,-0.2895765043192517,-0.2864521509893865,0.06409100706538395
14.3993993993994,-0.2843283068836253,-0.28131943010569826,0.06375664632501475
14.414414414414415,-0.27931743257839015,-0.27643727512544947,0.06344681712798274
14.42942942942943,-0.2745818008496186,-0.2718417341069835,0.06317826948322382
14.444444444444445,-0.27015088419951355,-0.26756045477037976,0.0629655282261349
14.45945945945946,-0.2660449409198893,-0.26361195245993796,0.0628202860964048
14.474474474474475,-0.2622745925870596,-0.2600052157352542,0.06275097924602824
14.48948948948949,-0.2588407646101676,-0.256739667137144,0.06276257910871424
14.504504504504505,-0.2557349888561958,-0.2538054779216146,0.06285661135339954
14.51951951951952,-0.25294004765043143,-0.2511842163383212,0.06303138744110719
14.534534534534535,-0.250430919947095,-0.24884979098315696,0.06328241193342732
14.54954954954955,-0.24817597478279377,-0.24676963544594036,0.063602913298457
14.564564564564565,-0.24613834558480213,-0.24490606919966504,0.06398443977859751
14.57957957957958,-0.24427741237699213,-0.24321776329471706,0.06441746481467005
14.594594594594595,-0.24255031773179023,-0.24166123825013222,0.06489195644664324
14.60960960960961,-0.24091344621876754,-0.24019232534324297,0.06539787883764853
14.624624624624625,-0.23932380536758818,-0.23876753057315264,0.06592560836776042
14.63963963963964,-0.2377402576999727,-0.2373452518417012,0.06646625914130345
14.654654654654655,-0.2361245669013669,-0.23588681309752627,0.06701192186883476
14.66966966966967,-0.23444223538361295,-0.23435729304326386,0.06755582559515844
14.684684684684685,-0.23266312414789145,-0.23272613935751835,0.06809243408312857
14.6996996996997,-0.23076185804131516,-0.2309675713075752,0.06861748866912355
14.714714714714715,-0.22871802955606288,-0.22906078348937797,0.0691280080129179
14.72972972972973,-0.22651622189957857,-0.22698997088920408,0.06962225318933882
14.744744744744745,-0.2241458771008813,-0.22474420044795926,0.07009966460936615
14.75975975975976,-0.22160103756989108,-0.22231715697293286,0.07056077567212567
14.774774774774775,-0.21887999011074252,-0.21970679188530107,0.07100710698608569
14.78978978978979,-0.21598484031422022,-0.2169149023052639,0.07144104445423233
14.804804804804805,-0.21292104295705885,-0.21394666578238186,0.07186570439665875
14.81981981981982,-0.20969691093920365,-0.2108101529846682,0.07228478904398936
14.834834834834835,-0.2063231217680171,-0.2075158372299571,0.07270243602918584
14.84984984984985,-0.20281223695782613,-0.20407611617781066,0.07312306580316538
14.864864864864865,-0.19917824618820734,-0.20050485753144062,0.07355123109962103
14.87987987987988,-0.19543614481812197,-0.19681697739030124,0.07399147260733631
14.894894894894895,-0.1916015504859216,-0.19302805704819642,0.07444818483661232
14.90990990990991,-0.18769036208608914,-0.18915400160105933,0.07492549578124566
14.924924924924925,-0.18371846241140308,-0.1852107417259568,0.07542716339423029
14.93993993993994,-0.17970146416490815,-0.18121397840263917,0.07595649114946466
14.954954954954955,-0.17565449784213985,-0.1771789691366884,0.07651626410374503
14.96996996996997,-0.17159203911315637,-0.17312035336373724,0.07710870596338287
14.984984984984985,-0.1675277727447818,-0.1690520141176069,0.07773545676164961
15,-0.1634744897454751,-0.16498697268165965,0.07839756992786852
