interval,output,model_id,model_label,model_theory,model_colour,timbre_label
11.75,129.26686042237122,PraatF0,Praat (F0),harmonicity,#11A3FF,3 dB roll-off
11.7505005005005,129.27011786240877,PraatF0,Praat (F0),harmonicity,#11A3FF,3 dB roll-off
11.751001001001,129.27337139268445,PraatF0,Praat (F0),harmonicity,#11A3FF,3 dB roll-off
11.751501501501501,129.27664415835147,PraatF0,Praat (F0),harmonicity,#11A3FF,3 dB roll-off
11.752002002002001,129.2799138202069,PraatF0,Praat (F0),harmonicity,#11A3FF,3 dB roll-off
11.752502502502503,129.28318160235966,PraatF0,Praat (F0),harmonicity,#11A3FF,3 dB roll-off
11.753003003003004,129.2864473590279,PraatF0,Praat (F0),harmonicity,#11A3FF,3 dB roll-off
11.753503503503504,129.28971473422968,PraatF0,Praat (F0),harmonicity,#11A3FF,3 dB roll-off
11.754004004004004,129.2929754008972,PraatF0,Praat (F0),harmonicity,#11A3FF,3 dB roll-off
11.754504504504505,129.29627916763093,PraatF0,Praat (F0),harmonicity,#11A3FF,3 dB roll-off
11.755005005005005,129.29953592953058,PraatF0,Praat (F0),harmonicity,#11A3FF,3 dB roll-off
11.755505505505505,129.30279587456116,PraatF0,Praat (F0),harmonicity,#11A3FF,3 dB roll-off
11.756006006006006,129.3060338639406,PraatF0,Praat (F0),harmonicity,#11A3FF,3 dB roll-off
11.756506506506506,129.30930188278435,PraatF0,Praat (F0),harmonicity,#11A3FF,3 dB roll-off
11.757007007007006,129.31254617476458,PraatF0,Praat (F0),harmonicity,#11A3FF,3 dB roll-off
11.757507507507508,129.31579871089178,PraatF0,Praat (F0),harmonicity,#11A3FF,3 dB roll-off
11.758008008008009,129.31904906555536,PraatF0,Praat (F0),harmonicity,#11A3FF,3 dB roll-off
11.758508508508509,129.32229885132267,PraatF0,Praat (F0),harmonicity,#11A3FF,3 dB roll-off
11.75900900900901,129.32556915536247,PraatF0,Praat (F0),harmonicity,#11A3FF,3 dB roll-off
11.75950950950951,129.3288403364133,PraatF0,Praat (F0),harmonicity,#11A3FF,3 dB roll-off
11.76001001001001,129.33222379546896,PraatF0,Praat (F0),harmonicity,#11A3FF,3 dB roll-off
11.76051051051051,129.33562036779733,PraatF0,Praat (F0),harmonicity,#11A3FF,3 dB roll-off
11.76101101101101,129.339005624268,PraatF0,Praat (F0),harmonicity,#11A3FF,3 dB roll-off
11.761511511511511,129.34240206383413,PraatF0,Praat (F0),harmonicity,#11A3FF,3 dB roll-off
11.762012012012011,129.34576909426573,PraatF0,Praat (F0),harmonicity,#11A3FF,3 dB roll-off
11.762512512512513,129.3490188393485,PraatF0,Praat (F0),harmonicity,#11A3FF,3 dB roll-off
11.763013013013014,129.35223354085798,PraatF0,Praat (F0),harmonicity,#11A3FF,3 dB roll-off
11.763513513513514,129.35545480184783,PraatF0,Praat (F0),harmonicity,#11A3FF,3 dB roll-off
11.764014014014014,129.35866012809893,PraatF0,Praat (F0),harmonicity,#11A3FF,3 dB roll-off
11.764514514514515,129.36187527169582,PraatF0,Praat (F0),harmonicity,#11A3FF,3 dB roll-off
11.765015015015015,129.36508051839294,PraatF0,Praat (F0),harmonicity,#11A3FF,3 dB roll-off
11.765515515515515,129.36828873320906,PraatF0,Praat (F0),harmonicity,#11A3FF,3 dB roll-off
11.766016016016016,129.37149367106014,PraatF0,Praat (F0),harmonicity,#11A3FF,3 dB roll-off
11.766516516516516,129.37469886476194,PraatF0,Praat (F0),harmonicity,#11A3FF,3 dB roll-off
11.767017017017016,129.3778964824545,PraatF0,Praat (F0),harmonicity,#11A3FF,3 dB roll-off
11.767517517517518,129.38110026403064,PraatF0,Praat (F0),harmonicity,#11A3FF,3 dB roll-off
11.768018018018019,129.38429969505967,PraatF0,Praat (F0),harmonicity,#11A3FF,3 dB roll-off
11.768518518518519,129.38754425101467,PraatF0,Praat (F0),harmonicity,#11A3FF,3 dB roll-off
11.76901901901902,129.3908362173491,PraatF0,Praat (F0),harmonicity,#11A3FF,3 dB roll-off
11.76951951951952,129.39413647930795,PraatF0,Praat (F0),harmonicity,#11A3FF,3 dB roll-off
11.77002002002002,129.39742713959077,PraatF0,Praat (F0),harmonicity,#11A3FF,3 dB roll-off
11.77052052052052,129.40072574173425,PraatF0,Praat (F0),harmonicity,#11A3FF,3 dB roll-off
11.77102102102102,129.4040170990354,PraatF0,Praat (F0),harmonicity,#11A3FF,3 dB roll-off
11.771521521521521,129.4073154616534,PraatF0,Praat (F0),harmonicity,#11A3FF,3 dB roll-off
11.772022022022021,129.41060639727493,PraatF0,Praat (F0),harmonicity,#11A3FF,3 dB roll-off
11.772522522522523,129.41390603348302,PraatF0,Praat (F0),harmonicity,#11A3FF,3 dB roll-off
11.773023023023024,129.41720064157306,PraatF0,Praat (F0),harmonicity,#11A3FF,3 dB roll-off
11.773523523523524,129.42049168670266,PraatF0,Praat (F0),harmonicity,#11A3FF,3 dB roll-off
11.774024024024024,129.42377702368896,PraatF0,Praat (F0),harmonicity,#11A3FF,3 dB roll-off
11.774524524524525,129.4270733195597,PraatF0,Praat (F0),harmonicity,#11A3FF,3 dB roll-off
11.775025025025025,129.43036229326594,PraatF0,Praat (F0),harmonicity,#11A3FF,3 dB roll-off
11.775525525525525,129.4336523195011,PraatF0,Praat (F0),harmonicity,#11A3FF,3 dB roll-off
11.776026026026026,129.43693972544588,PraatF0,Praat (F0),harmonicity,#11A3FF,3 dB roll-off
11.776526526526526,129.44023212153505,PraatF0,Praat (F0),harmonicity,#11A3FF,3 dB roll-off
11.777027027027026,129.4435126815643,PraatF0,Praat (F0),harmonicity,#11A3FF,3 dB roll-off
11.777527527527528,129.44680158801503,PraatF0,Praat (F0),harmonicity,#11A3FF,3 dB roll-off
11.778028028028029,129.45005820768932,PraatF0,Praat (F0),harmonicity,#11A3FF,3 dB roll-off
11.778528528528529,129.45329610893282,PraatF0,Praat (F0),harmonicity,#11A3FF,3 dB roll-off
11.77902902902903,129.45650606880605,PraatF0,Praat (F0),harmonicity,#11A3FF,3 dB roll-off
11.77952952952953,129.4596299832609,PraatF0,Praat (F0),harmonicity,#11A3FF,3 dB roll-off
11.78003003003003,129.46262933021555,PraatF0,Praat (F0),harmonicity,#11A3FF,3 dB roll-off
11.78053053053053,129.46576447142138,PraatF0,Praat (F0),harmonicity,#11A3FF,3 dB roll-off
11.78103103103103,129.46889088812048,PraatF0,Praat (F0),harmonicity,#11A3FF,3 dB roll-off
11.781531531531531,129.47202087818502,PraatF0,Praat (F0),harmonicity,#11A3FF,3 dB roll-off
11.782032032032031,129.4751380015664,PraatF0,Praat (F0),harmonicity,#11A3FF,3 dB roll-off
11.782532532532533,129.47827295193042,PraatF0,Praat (F0),harmonicity,#11A3FF,3 dB roll-off
11.783033033033034,129.48138666125888,PraatF0,Praat (F0),harmonicity,#11A3FF,3 dB roll-off
11.783533533533534,129.48451086976263,PraatF0,Praat (F0),harmonicity,#11A3FF,3 dB roll-off
11.784034034034034,129.48761928600663,PraatF0,Praat (F0),harmonicity,#11A3FF,3 dB roll-off
11.784534534534535,129.49073619932074,PraatF0,Praat (F0),harmonicity,#11A3FF,3 dB roll-off
11.785035035035035,129.4938445898007,PraatF0,Praat (F0),harmonicity,#11A3FF,3 dB roll-off
11.785535535535535,129.49695456777965,PraatF0,Praat (F0),harmonicity,#11A3FF,3 dB roll-off
11.786036036036036,129.50005824309733,PraatF0,Praat (F0),harmonicity,#11A3FF,3 dB roll-off
11.786536536536536,129.50317341585514,PraatF0,Praat (F0),harmonicity,#11A3FF,3 dB roll-off
11.787037037037036,129.50630122261964,PraatF0,Praat (F0),harmonicity,#11A3FF,3 dB roll-off
11.787537537537538,129.50954129036353,PraatF0,Praat (F0),harmonicity,#11A3FF,3 dB roll-off
11.788038038038039,129.51277450951483,PraatF0,Praat (F0),harmonicity,#11A3FF,3 dB roll-off
11.788538538538539,129.5160149740064,PraatF0,Praat (F0),harmonicity,#11A3FF,3 dB roll-off
11.78903903903904,129.5192513670109,PraatF0,Praat (F0),harmonicity,#11A3FF,3 dB roll-off
11.78953953953954,129.5224897940396,PraatF0,Praat (F0),harmonicity,#11A3FF,3 dB roll-off
11.79004004004004,129.525726182762,PraatF0,Praat (F0),harmonicity,#11A3FF,3 dB roll-off
11.79054054054054,129.5289688020721,PraatF0,Praat (F0),harmonicity,#11A3FF,3 dB roll-off
11.79104104104104,129.53220126359673,PraatF0,Praat (F0),harmonicity,#11A3FF,3 dB roll-off
11.791541541541541,129.5354455263947,PraatF0,Praat (F0),harmonicity,#11A3FF,3 dB roll-off
11.792042042042041,129.5386744089507,PraatF0,Praat (F0),harmonicity,#11A3FF,3 dB roll-off
11.792542542542543,129.5419106156951,PraatF0,Praat (F0),harmonicity,#11A3FF,3 dB roll-off
11.793043043043044,129.54513896314558,PraatF0,Praat (F0),harmonicity,#11A3FF,3 dB roll-off
11.793543543543544,129.54832671080382,PraatF0,Praat (F0),harmonicity,#11A3FF,3 dB roll-off
11.794044044044044,129.55138702798752,PraatF0,Praat (F0),harmonicity,#11A3FF,3 dB roll-off
11.794544544544545,129.55445012252585,PraatF0,Praat (F0),harmonicity,#11A3FF,3 dB roll-off
11.795045045045045,129.5575082837433,PraatF0,Praat (F0),harmonicity,#11A3FF,3 dB roll-off
11.795545545545545,129.560616298759,PraatF0,Praat (F0),harmonicity,#11A3FF,3 dB roll-off
11.796046046046046,129.56374226914508,PraatF0,Praat (F0),harmonicity,#11A3FF,3 dB roll-off
11.796546546546546,129.56686877523407,PraatF0,Praat (F0),harmonicity,#11A3FF,3 dB roll-off
11.797047047047046,129.569991108814,PraatF0,Praat (F0),harmonicity,#11A3FF,3 dB roll-off
11.797547547547548,129.57311707010888,PraatF0,Praat (F0),harmonicity,#11A3FF,3 dB roll-off
11.798048048048049,129.57643980594898,PraatF0,Praat (F0),harmonicity,#11A3FF,3 dB roll-off
11.798548548548549,129.579801852685,PraatF0,Praat (F0),harmonicity,#11A3FF,3 dB roll-off
11.79904904904905,129.58315874459413,PraatF0,Praat (F0),harmonicity,#11A3FF,3 dB roll-off
11.79954954954955,129.58650591095278,PraatF0,Praat (F0),harmonicity,#11A3FF,3 dB roll-off
11.80005005005005,129.58984192185005,PraatF0,Praat (F0),harmonicity,#11A3FF,3 dB roll-off
11.80055055055055,129.59317145959966,PraatF0,Praat (F0),harmonicity,#11A3FF,3 dB roll-off
11.80105105105105,129.59648167038563,PraatF0,Praat (F0),harmonicity,#11A3FF,3 dB roll-off
11.801551551551551,129.5997930156711,PraatF0,Praat (F0),harmonicity,#11A3FF,3 dB roll-off
11.802052052052051,129.60302470827892,PraatF0,Praat (F0),harmonicity,#11A3FF,3 dB roll-off
11.802552552552553,129.60618974131464,PraatF0,Praat (F0),harmonicity,#11A3FF,3 dB roll-off
11.803053053053054,129.60934712025266,PraatF0,Praat (F0),harmonicity,#11A3FF,3 dB roll-off
11.803553553553554,129.61251450054164,PraatF0,Praat (F0),harmonicity,#11A3FF,3 dB roll-off
11.804054054054054,129.61567514663847,PraatF0,Praat (F0),harmonicity,#11A3FF,3 dB roll-off
11.804554554554555,129.61881560380021,PraatF0,Praat (F0),harmonicity,#11A3FF,3 dB roll-off
11.805055055055055,129.62197137804185,PraatF0,Praat (F0),harmonicity,#11A3FF,3 dB roll-off
11.805555555555555,129.62512139026646,PraatF0,Praat (F0),harmonicity,#11A3FF,3 dB roll-off
11.806056056056056,129.62826323269766,PraatF0,Praat (F0),harmonicity,#11A3FF,3 dB roll-off
11.806556556556556,129.6314077333734,PraatF0,Praat (F0),harmonicity,#11A3FF,3 dB roll-off
11.807057057057056,129.6345433289075,PraatF0,Praat (F0),harmonicity,#11A3FF,3 dB roll-off
11.807557557557558,129.63768557983127,PraatF0,Praat (F0),harmonicity,#11A3FF,3 dB roll-off
11.808058058058059,129.64081232351344,PraatF0,Praat (F0),harmonicity,#11A3FF,3 dB roll-off
11.808558558558559,129.64394899392013,PraatF0,Praat (F0),harmonicity,#11A3FF,3 dB roll-off
11.80905905905906,129.64707299549656,PraatF0,Praat (F0),harmonicity,#11A3FF,3 dB roll-off
11.80955955955956,129.6502010961747,PraatF0,Praat (F0),harmonicity,#11A3FF,3 dB roll-off
11.81006006006006,129.65334097343987,PraatF0,Praat (F0),harmonicity,#11A3FF,3 dB roll-off
11.81056056056056,129.65650642379728,PraatF0,Praat (F0),harmonicity,#11A3FF,3 dB roll-off
11.81106106106106,129.65966034604196,PraatF0,Praat (F0),harmonicity,#11A3FF,3 dB roll-off
11.811561561561561,129.66282067323485,PraatF0,Praat (F0),harmonicity,#11A3FF,3 dB roll-off
11.812062062062061,129.6659666798898,PraatF0,Praat (F0),harmonicity,#11A3FF,3 dB roll-off
11.812562562562563,129.6691171741729,PraatF0,Praat (F0),harmonicity,#11A3FF,3 dB roll-off
11.813063063063064,129.67225568521246,PraatF0,Praat (F0),harmonicity,#11A3FF,3 dB roll-off
11.813563563563564,129.67539497447675,PraatF0,Praat (F0),harmonicity,#11A3FF,3 dB roll-off
11.814064064064064,129.67851871254373,PraatF0,Praat (F0),harmonicity,#11A3FF,3 dB roll-off
11.814564564564565,129.68164962849426,PraatF0,Praat (F0),harmonicity,#11A3FF,3 dB roll-off
11.815065065065065,129.6847637719321,PraatF0,Praat (F0),harmonicity,#11A3FF,3 dB roll-off
11.815565565565565,129.68787508098234,PraatF0,Praat (F0),harmonicity,#11A3FF,3 dB roll-off
11.816066066066066,129.69100076667632,PraatF0,Praat (F0),harmonicity,#11A3FF,3 dB roll-off
11.816566566566566,129.69414418253612,PraatF0,Praat (F0),harmonicity,#11A3FF,3 dB roll-off
11.817067067067066,129.69717487194623,PraatF0,Praat (F0),harmonicity,#11A3FF,3 dB roll-off
11.817567567567568,129.70001178131133,PraatF0,Praat (F0),harmonicity,#11A3FF,3 dB roll-off
11.818068068068069,129.7028541841402,PraatF0,Praat (F0),harmonicity,#11A3FF,3 dB roll-off
11.818568568568569,129.70578470798887,PraatF0,Praat (F0),harmonicity,#11A3FF,3 dB roll-off
11.81906906906907,129.7089532737125,PraatF0,Praat (F0),harmonicity,#11A3FF,3 dB roll-off
11.81956956956957,129.71210516808756,PraatF0,Praat (F0),harmonicity,#11A3FF,3 dB roll-off
11.82007007007007,129.71524480016384,PraatF0,Praat (F0),harmonicity,#11A3FF,3 dB roll-off
11.82057057057057,129.71839237012165,PraatF0,Praat (F0),harmonicity,#11A3FF,3 dB roll-off
11.82107107107107,129.72153866854825,PraatF0,Praat (F0),harmonicity,#11A3FF,3 dB roll-off
11.821571571571571,129.72467921156857,PraatF0,Praat (F0),harmonicity,#11A3FF,3 dB roll-off
11.822072072072071,129.72781426606153,PraatF0,Praat (F0),harmonicity,#11A3FF,3 dB roll-off
11.822572572572573,129.73096003375088,PraatF0,Praat (F0),harmonicity,#11A3FF,3 dB roll-off
11.823073073073074,129.73410121473046,PraatF0,Praat (F0),harmonicity,#11A3FF,3 dB roll-off
11.823573573573574,129.73724972219088,PraatF0,Praat (F0),harmonicity,#11A3FF,3 dB roll-off
11.824074074074074,129.740387293877,PraatF0,Praat (F0),harmonicity,#11A3FF,3 dB roll-off
11.824574574574575,129.74353261281203,PraatF0,Praat (F0),harmonicity,#11A3FF,3 dB roll-off
11.825075075075075,129.7466854981098,PraatF0,Praat (F0),harmonicity,#11A3FF,3 dB roll-off
11.825575575575575,129.74983548621344,PraatF0,Praat (F0),harmonicity,#11A3FF,3 dB roll-off
11.826076076076076,129.75295743905326,PraatF0,Praat (F0),harmonicity,#11A3FF,3 dB roll-off
11.826576576576576,129.75609027984777,PraatF0,Praat (F0),harmonicity,#11A3FF,3 dB roll-off
11.827077077077076,129.75921853599726,PraatF0,Praat (F0),harmonicity,#11A3FF,3 dB roll-off
11.827577577577578,129.7623504150294,PraatF0,Praat (F0),harmonicity,#11A3FF,3 dB roll-off
11.828078078078079,129.76547344800542,PraatF0,Praat (F0),harmonicity,#11A3FF,3 dB roll-off
11.828578578578579,129.7686079923259,PraatF0,Praat (F0),harmonicity,#11A3FF,3 dB roll-off
11.82907907907908,129.7717335738088,PraatF0,Praat (F0),harmonicity,#11A3FF,3 dB roll-off
11.82957957957958,129.7748627000849,PraatF0,Praat (F0),harmonicity,#11A3FF,3 dB roll-off
11.83008008008008,129.77798855040515,PraatF0,Praat (F0),harmonicity,#11A3FF,3 dB roll-off
11.83058058058058,129.7811192431315,PraatF0,Praat (F0),harmonicity,#11A3FF,3 dB roll-off
11.83108108108108,129.78424092834217,PraatF0,Praat (F0),harmonicity,#11A3FF,3 dB roll-off
11.831581581581581,129.78737351169934,PraatF0,Praat (F0),harmonicity,#11A3FF,3 dB roll-off
11.832082082082081,129.7904967491005,PraatF0,Praat (F0),harmonicity,#11A3FF,3 dB roll-off
11.832582582582583,129.79362178748516,PraatF0,Praat (F0),harmonicity,#11A3FF,3 dB roll-off
11.833083083083084,129.79678562404382,PraatF0,Praat (F0),harmonicity,#11A3FF,3 dB roll-off
11.833583583583584,129.79996530483555,PraatF0,Praat (F0),harmonicity,#11A3FF,3 dB roll-off
11.834084084084084,129.8031038820343,PraatF0,Praat (F0),harmonicity,#11A3FF,3 dB roll-off
11.834584584584585,129.806246291462,PraatF0,Praat (F0),harmonicity,#11A3FF,3 dB roll-off
11.835085085085085,129.80938741964826,PraatF0,Praat (F0),harmonicity,#11A3FF,3 dB roll-off
11.835585585585585,129.81253681303917,PraatF0,Praat (F0),harmonicity,#11A3FF,3 dB roll-off
11.836086086086086,129.8156766827812,PraatF0,Praat (F0),harmonicity,#11A3FF,3 dB roll-off
11.836586586586586,129.81881124453622,PraatF0,Praat (F0),harmonicity,#11A3FF,3 dB roll-off
11.837087087087086,129.8219304854369,PraatF0,Praat (F0),harmonicity,#11A3FF,3 dB roll-off
11.837587587587588,129.82503995676467,PraatF0,Praat (F0),harmonicity,#11A3FF,3 dB roll-off
11.838088088088089,129.82813902888017,PraatF0,Praat (F0),harmonicity,#11A3FF,3 dB roll-off
11.838588588588589,129.83124239149163,PraatF0,Praat (F0),harmonicity,#11A3FF,3 dB roll-off
11.83908908908909,129.83433653528792,PraatF0,Praat (F0),harmonicity,#11A3FF,3 dB roll-off
11.83958958958959,129.83729410926748,PraatF0,Praat (F0),harmonicity,#11A3FF,3 dB roll-off
11.84009009009009,129.840404969115,PraatF0,Praat (F0),harmonicity,#11A3FF,3 dB roll-off
11.84059059059059,129.84351971367022,PraatF0,Praat (F0),harmonicity,#11A3FF,3 dB roll-off
11.84109109109109,129.8466244170603,PraatF0,Praat (F0),harmonicity,#11A3FF,3 dB roll-off
11.841591591591591,129.8497491270159,PraatF0,Praat (F0),harmonicity,#11A3FF,3 dB roll-off
11.842092092092091,129.85285046773808,PraatF0,Praat (F0),harmonicity,#11A3FF,3 dB roll-off
11.842592592592593,129.85596306463054,PraatF0,Praat (F0),harmonicity,#11A3FF,3 dB roll-off
11.843093093093094,129.85906547803617,PraatF0,Praat (F0),harmonicity,#11A3FF,3 dB roll-off
11.843593593593594,129.86217106503338,PraatF0,Praat (F0),harmonicity,#11A3FF,3 dB roll-off
11.844094094094094,129.86528323137256,PraatF0,Praat (F0),harmonicity,#11A3FF,3 dB roll-off
11.844594594594595,129.86839465987012,PraatF0,Praat (F0),harmonicity,#11A3FF,3 dB roll-off
11.845095095095095,129.87149945072247,PraatF0,Praat (F0),harmonicity,#11A3FF,3 dB roll-off
11.845595595595595,129.8746095653028,PraatF0,Praat (F0),harmonicity,#11A3FF,3 dB roll-off
11.846096096096096,129.87771781574384,PraatF0,Praat (F0),harmonicity,#11A3FF,3 dB roll-off
11.846596596596596,129.8808261618551,PraatF0,Praat (F0),harmonicity,#11A3FF,3 dB roll-off
11.847097097097096,129.88393299198574,PraatF0,Praat (F0),harmonicity,#11A3FF,3 dB roll-off
11.847597597597598,129.8870407913979,PraatF0,Praat (F0),harmonicity,#11A3FF,3 dB roll-off
11.848098098098099,129.8901358707115,PraatF0,Praat (F0),harmonicity,#11A3FF,3 dB roll-off
11.848598598598599,129.89324433199454,PraatF0,Praat (F0),harmonicity,#11A3FF,3 dB roll-off
11.8490990990991,129.89633761854498,PraatF0,Praat (F0),harmonicity,#11A3FF,3 dB roll-off
11.8495995995996,129.8994394393074,PraatF0,Praat (F0),harmonicity,#11A3FF,3 dB roll-off
11.8501001001001,129.90253403029698,PraatF0,Praat (F0),harmonicity,#11A3FF,3 dB roll-off
11.8506006006006,129.90563497761497,PraatF0,Praat (F0),harmonicity,#11A3FF,3 dB roll-off
11.8511011011011,129.90873104708783,PraatF0,Praat (F0),harmonicity,#11A3FF,3 dB roll-off
11.851601601601601,129.91183188577057,PraatF0,Praat (F0),harmonicity,#11A3FF,3 dB roll-off
11.852102102102101,129.91492494278145,PraatF0,Praat (F0),harmonicity,#11A3FF,3 dB roll-off
11.852602602602603,129.9180264982492,PraatF0,Praat (F0),harmonicity,#11A3FF,3 dB roll-off
11.853103103103104,129.92112118563557,PraatF0,Praat (F0),harmonicity,#11A3FF,3 dB roll-off
11.853603603603604,129.92422059777346,PraatF0,Praat (F0),harmonicity,#11A3FF,3 dB roll-off
11.854104104104104,129.9273145051627,PraatF0,Praat (F0),harmonicity,#11A3FF,3 dB roll-off
11.854604604604605,129.93018367065207,PraatF0,Praat (F0),harmonicity,#11A3FF,3 dB roll-off
11.855105105105105,129.93273100338877,PraatF0,Praat (F0),harmonicity,#11A3FF,3 dB roll-off
11.855605605605605,129.9353404853164,PraatF0,Praat (F0),harmonicity,#11A3FF,3 dB roll-off
11.856106106106106,129.93802116491216,PraatF0,Praat (F0),harmonicity,#11A3FF,3 dB roll-off
11.856606606606606,129.94111789736823,PraatF0,Praat (F0),harmonicity,#11A3FF,3 dB roll-off
11.857107107107106,129.9442332764662,PraatF0,Praat (F0),harmonicity,#11A3FF,3 dB roll-off
11.857607607607608,129.94736358660376,PraatF0,Praat (F0),harmonicity,#11A3FF,3 dB roll-off
11.858108108108109,129.9504947747674,PraatF0,Praat (F0),harmonicity,#11A3FF,3 dB roll-off
11.858608608608609,129.9536398158862,PraatF0,Praat (F0),harmonicity,#11A3FF,3 dB roll-off
11.85910910910911,129.95678568719794,PraatF0,Praat (F0),harmonicity,#11A3FF,3 dB roll-off
11.85960960960961,129.95994215352334,PraatF0,Praat (F0),harmonicity,#11A3FF,3 dB roll-off
11.86011011011011,129.963100473276,PraatF0,Praat (F0),harmonicity,#11A3FF,3 dB roll-off
11.86061061061061,129.9662746225584,PraatF0,Praat (F0),harmonicity,#11A3FF,3 dB roll-off
11.86111111111111,129.96944468529193,PraatF0,Praat (F0),harmonicity,#11A3FF,3 dB roll-off
11.861611611611611,129.972630053493,PraatF0,Praat (F0),harmonicity,#11A3FF,3 dB roll-off
11.862112112112111,129.97581565600848,PraatF0,Praat (F0),harmonicity,#11A3FF,3 dB roll-off
11.862612612612613,129.97897034124787,PraatF0,Praat (F0),harmonicity,#11A3FF,3 dB roll-off
11.863113113113114,129.9818649729756,PraatF0,Praat (F0),harmonicity,#11A3FF,3 dB roll-off
11.863613613613614,129.9847675895926,PraatF0,Praat (F0),harmonicity,#11A3FF,3 dB roll-off
11.864114114114114,129.98766483112186,PraatF0,Praat (F0),harmonicity,#11A3FF,3 dB roll-off
11.864614614614615,129.9905734707549,PraatF0,Praat (F0),harmonicity,#11A3FF,3 dB roll-off
11.865115115115115,129.99347384424277,PraatF0,Praat (F0),harmonicity,#11A3FF,3 dB roll-off
11.865615615615615,129.9964095626928,PraatF0,Praat (F0),harmonicity,#11A3FF,3 dB roll-off
11.866116116116116,129.99932000414748,PraatF0,Praat (F0),harmonicity,#11A3FF,3 dB roll-off
11.866616616616616,130.00224034148096,PraatF0,Praat (F0),harmonicity,#11A3FF,3 dB roll-off
11.867117117117116,130.0051946140717,PraatF0,Praat (F0),harmonicity,#11A3FF,3 dB roll-off
11.867617617617618,130.00829375069077,PraatF0,Praat (F0),harmonicity,#11A3FF,3 dB roll-off
11.868118118118119,130.01140577216415,PraatF0,Praat (F0),harmonicity,#11A3FF,3 dB roll-off
11.868618618618619,130.01453172610104,PraatF0,Praat (F0),harmonicity,#11A3FF,3 dB roll-off
11.86911911911912,130.01765342324066,PraatF0,Praat (F0),harmonicity,#11A3FF,3 dB roll-off
11.86961961961962,130.0207891620194,PraatF0,Praat (F0),harmonicity,#11A3FF,3 dB roll-off
11.87012012012012,130.02392344423075,PraatF0,Praat (F0),harmonicity,#11A3FF,3 dB roll-off
11.87062062062062,130.02706954990583,PraatF0,Praat (F0),harmonicity,#11A3FF,3 dB roll-off
11.87112112112112,130.03021421736742,PraatF0,Praat (F0),harmonicity,#11A3FF,3 dB roll-off
11.871621621621621,130.03337318345092,PraatF0,Praat (F0),harmonicity,#11A3FF,3 dB roll-off
11.872122122122121,130.03652904018756,PraatF0,Praat (F0),harmonicity,#11A3FF,3 dB roll-off
11.872622622622623,130.03969319701292,PraatF0,Praat (F0),harmonicity,#11A3FF,3 dB roll-off
11.873123123123124,130.0428581159335,PraatF0,Praat (F0),harmonicity,#11A3FF,3 dB roll-off
11.873623623623624,130.04601513563847,PraatF0,Praat (F0),harmonicity,#11A3FF,3 dB roll-off
11.874124124124124,130.04903225439995,PraatF0,Praat (F0),harmonicity,#11A3FF,3 dB roll-off
11.874624624624625,130.0520503492622,PraatF0,Praat (F0),harmonicity,#11A3FF,3 dB roll-off
11.875125125125125,130.0550690385544,PraatF0,Praat (F0),harmonicity,#11A3FF,3 dB roll-off
11.875625625625625,130.05810473810948,PraatF0,Praat (F0),harmonicity,#11A3FF,3 dB roll-off
11.876126126126126,130.06115002798953,PraatF0,Praat (F0),harmonicity,#11A3FF,3 dB roll-off
11.876626626626626,130.06423553442767,PraatF0,Praat (F0),harmonicity,#11A3FF,3 dB roll-off
11.877127127127126,130.06734994957677,PraatF0,Praat (F0),harmonicity,#11A3FF,3 dB roll-off
11.877627627627628,130.07050455808468,PraatF0,Praat (F0),harmonicity,#11A3FF,3 dB roll-off
11.878128128128129,130.07371016651365,PraatF0,Praat (F0),harmonicity,#11A3FF,3 dB roll-off
11.87862862862863,130.0769562734256,PraatF0,Praat (F0),harmonicity,#11A3FF,3 dB roll-off
11.87912912912913,130.0801154653874,PraatF0,Praat (F0),harmonicity,#11A3FF,3 dB roll-off
11.87962962962963,130.08289336170526,PraatF0,Praat (F0),harmonicity,#11A3FF,3 dB roll-off
11.88013013013013,130.08567262048683,PraatF0,Praat (F0),harmonicity,#11A3FF,3 dB roll-off
11.88063063063063,130.08849550652445,PraatF0,Praat (F0),harmonicity,#11A3FF,3 dB roll-off
11.88113113113113,130.09132317955834,PraatF0,Praat (F0),harmonicity,#11A3FF,3 dB roll-off
11.881631631631631,130.0941556607155,PraatF0,Praat (F0),harmonicity,#11A3FF,3 dB roll-off
11.882132132132131,130.09700213968154,PraatF0,Praat (F0),harmonicity,#11A3FF,3 dB roll-off
11.882632632632633,130.09987625313545,PraatF0,Praat (F0),harmonicity,#11A3FF,3 dB roll-off
11.883133133133134,130.10279902723383,PraatF0,Praat (F0),harmonicity,#11A3FF,3 dB roll-off
11.883633633633634,130.10575609210457,PraatF0,Praat (F0),harmonicity,#11A3FF,3 dB roll-off
11.884134134134134,130.10872850812436,PraatF0,Praat (F0),harmonicity,#11A3FF,3 dB roll-off
11.884634634634635,130.11173564633228,PraatF0,Praat (F0),harmonicity,#11A3FF,3 dB roll-off
11.885135135135135,130.11481341269598,PraatF0,Praat (F0),harmonicity,#11A3FF,3 dB roll-off
11.885635635635635,130.11791150686173,PraatF0,Praat (F0),harmonicity,#11A3FF,3 dB roll-off
11.886136136136136,130.12100519057404,PraatF0,Praat (F0),harmonicity,#11A3FF,3 dB roll-off
11.886636636636636,130.12410875252783,PraatF0,Praat (F0),harmonicity,#11A3FF,3 dB roll-off
11.887137137137136,130.12721011521882,PraatF0,Praat (F0),harmonicity,#11A3FF,3 dB roll-off
11.887637637637638,130.13032186957759,PraatF0,Praat (F0),harmonicity,#11A3FF,3 dB roll-off
11.888138138138139,130.13346760021753,PraatF0,Praat (F0),harmonicity,#11A3FF,3 dB roll-off
11.88863863863864,130.13664624005054,PraatF0,Praat (F0),harmonicity,#11A3FF,3 dB roll-off
11.88913913913914,130.1398331616166,PraatF0,Praat (F0),harmonicity,#11A3FF,3 dB roll-off
11.88963963963964,130.14304291695976,PraatF0,Praat (F0),harmonicity,#11A3FF,3 dB roll-off
11.89014014014014,130.14626322134774,PraatF0,Praat (F0),harmonicity,#11A3FF,3 dB roll-off
11.89064064064064,130.14950639262554,PraatF0,Praat (F0),harmonicity,#11A3FF,3 dB roll-off
11.89114114114114,130.15276129113363,PraatF0,Praat (F0),harmonicity,#11A3FF,3 dB roll-off
11.891641641641641,130.15603618584538,PraatF0,Praat (F0),harmonicity,#11A3FF,3 dB roll-off
11.892142142142141,130.15859390477732,PraatF0,Praat (F0),harmonicity,#11A3FF,3 dB roll-off
11.892642642642643,130.16174022587165,PraatF0,Praat (F0),harmonicity,#11A3FF,3 dB roll-off
11.893143143143144,130.16487462554568,PraatF0,Praat (F0),harmonicity,#11A3FF,3 dB roll-off
11.893643643643644,130.16800932046948,PraatF0,Praat (F0),harmonicity,#11A3FF,3 dB roll-off
11.894144144144144,130.17115439325363,PraatF0,Praat (F0),harmonicity,#11A3FF,3 dB roll-off
11.894644644644645,130.17431050463625,PraatF0,Praat (F0),harmonicity,#11A3FF,3 dB roll-off
11.895145145145145,130.17746183295787,PraatF0,Praat (F0),harmonicity,#11A3FF,3 dB roll-off
11.895645645645645,130.18036339648393,PraatF0,Praat (F0),harmonicity,#11A3FF,3 dB roll-off
11.896146146146146,130.1832305246807,PraatF0,Praat (F0),harmonicity,#11A3FF,3 dB roll-off
11.896646646646646,130.18610836322307,PraatF0,Praat (F0),harmonicity,#11A3FF,3 dB roll-off
11.897147147147146,130.18899097140184,PraatF0,Praat (F0),harmonicity,#11A3FF,3 dB roll-off
11.897647647647648,130.1919244882879,PraatF0,Praat (F0),harmonicity,#11A3FF,3 dB roll-off
11.898148148148149,130.19497100977128,PraatF0,Praat (F0),harmonicity,#11A3FF,3 dB roll-off
11.89864864864865,130.1980223362272,PraatF0,Praat (F0),harmonicity,#11A3FF,3 dB roll-off
11.89914914914915,130.2010652490503,PraatF0,Praat (F0),harmonicity,#11A3FF,3 dB roll-off
11.89964964964965,130.20411128657298,PraatF0,Praat (F0),harmonicity,#11A3FF,3 dB roll-off
11.90015015015015,130.20715018057246,PraatF0,Praat (F0),harmonicity,#11A3FF,3 dB roll-off
11.90065065065065,130.21018594026765,PraatF0,Praat (F0),harmonicity,#11A3FF,3 dB roll-off
11.90115115115115,130.2132258033455,PraatF0,Praat (F0),harmonicity,#11A3FF,3 dB roll-off
11.901651651651651,130.21634354973315,PraatF0,Praat (F0),harmonicity,#11A3FF,3 dB roll-off
11.902152152152151,130.2194696858915,PraatF0,Praat (F0),harmonicity,#11A3FF,3 dB roll-off
11.902652652652653,130.22260272405936,PraatF0,Praat (F0),harmonicity,#11A3FF,3 dB roll-off
11.903153153153154,130.22571553892885,PraatF0,Praat (F0),harmonicity,#11A3FF,3 dB roll-off
11.903653653653654,130.22867937055958,PraatF0,Praat (F0),harmonicity,#11A3FF,3 dB roll-off
11.904154154154154,130.2316305960444,PraatF0,Praat (F0),harmonicity,#11A3FF,3 dB roll-off
11.904654654654655,130.23459418876587,PraatF0,Praat (F0),harmonicity,#11A3FF,3 dB roll-off
11.905155155155155,130.23755411423696,PraatF0,Praat (F0),harmonicity,#11A3FF,3 dB roll-off
11.905655655655655,130.24074299593318,PraatF0,Praat (F0),harmonicity,#11A3FF,3 dB roll-off
11.906156156156156,130.24388841865272,PraatF0,Praat (F0),harmonicity,#11A3FF,3 dB roll-off
11.906656656656656,130.24687942728656,PraatF0,Praat (F0),harmonicity,#11A3FF,3 dB roll-off
11.907157157157156,130.24986716553005,PraatF0,Praat (F0),harmonicity,#11A3FF,3 dB roll-off
11.907657657657658,130.25291306698324,PraatF0,Praat (F0),harmonicity,#11A3FF,3 dB roll-off
11.908158158158159,130.2559912021308,PraatF0,Praat (F0),harmonicity,#11A3FF,3 dB roll-off
11.90865865865866,130.25906913377014,PraatF0,Praat (F0),harmonicity,#11A3FF,3 dB roll-off
11.90915915915916,130.26213632787722,PraatF0,Praat (F0),harmonicity,#11A3FF,3 dB roll-off
11.90965965965966,130.2652077926255,PraatF0,Praat (F0),harmonicity,#11A3FF,3 dB roll-off
11.91016016016016,130.2682681401961,PraatF0,Praat (F0),harmonicity,#11A3FF,3 dB roll-off
11.91066066066066,130.27133392075774,PraatF0,Praat (F0),harmonicity,#11A3FF,3 dB roll-off
11.91116116116116,130.27420580261315,PraatF0,Praat (F0),harmonicity,#11A3FF,3 dB roll-off
11.911661661661661,130.27705500501,PraatF0,Praat (F0),harmonicity,#11A3FF,3 dB roll-off
11.912162162162161,130.27990606794347,PraatF0,Praat (F0),harmonicity,#11A3FF,3 dB roll-off
11.912662662662663,130.28281395284066,PraatF0,Praat (F0),harmonicity,#11A3FF,3 dB roll-off
11.913163163163164,130.2857517785673,PraatF0,Praat (F0),harmonicity,#11A3FF,3 dB roll-off
11.913663663663664,130.28878958070823,PraatF0,Praat (F0),harmonicity,#11A3FF,3 dB roll-off
11.914164164164164,130.29185794034765,PraatF0,Praat (F0),harmonicity,#11A3FF,3 dB roll-off
11.914664664664665,130.29493752753805,PraatF0,Praat (F0),harmonicity,#11A3FF,3 dB roll-off
11.915165165165165,130.29801266546784,PraatF0,Praat (F0),harmonicity,#11A3FF,3 dB roll-off
11.915665665665665,130.30111925010996,PraatF0,Praat (F0),harmonicity,#11A3FF,3 dB roll-off
11.916166166166166,130.30423601866653,PraatF0,Praat (F0),harmonicity,#11A3FF,3 dB roll-off
11.916666666666666,130.30739543815386,PraatF0,Praat (F0),harmonicity,#11A3FF,3 dB roll-off
11.917167167167166,130.3107203117091,PraatF0,Praat (F0),harmonicity,#11A3FF,3 dB roll-off
11.917667667667668,130.31397177554908,PraatF0,Praat (F0),harmonicity,#11A3FF,3 dB roll-off
11.918168168168169,130.3170006387674,PraatF0,Praat (F0),harmonicity,#11A3FF,3 dB roll-off
11.91866866866867,130.32005656700056,PraatF0,Praat (F0),harmonicity,#11A3FF,3 dB roll-off
11.91916916916917,130.32325505281761,PraatF0,Praat (F0),harmonicity,#11A3FF,3 dB roll-off
11.91966966966967,130.32649426957957,PraatF0,Praat (F0),harmonicity,#11A3FF,3 dB roll-off
11.92017017017017,130.3297228453439,PraatF0,Praat (F0),harmonicity,#11A3FF,3 dB roll-off
11.92067067067067,130.33264819086403,PraatF0,Praat (F0),harmonicity,#11A3FF,3 dB roll-off
11.92117117117117,130.33529240367557,PraatF0,Praat (F0),harmonicity,#11A3FF,3 dB roll-off
11.921671671671671,130.33827363491793,PraatF0,Praat (F0),harmonicity,#11A3FF,3 dB roll-off
11.922172172172171,130.34132468587927,PraatF0,Praat (F0),harmonicity,#11A3FF,3 dB roll-off
11.922672672672673,130.34437662895124,PraatF0,Praat (F0),harmonicity,#11A3FF,3 dB roll-off
11.923173173173174,130.34742222535556,PraatF0,Praat (F0),harmonicity,#11A3FF,3 dB roll-off
11.923673673673674,130.35047194975704,PraatF0,Praat (F0),harmonicity,#11A3FF,3 dB roll-off
11.924174174174174,130.353514840733,PraatF0,Praat (F0),harmonicity,#11A3FF,3 dB roll-off
11.924674674674675,130.35656593527153,PraatF0,Praat (F0),harmonicity,#11A3FF,3 dB roll-off
11.925175175175175,130.35949739105226,PraatF0,Praat (F0),harmonicity,#11A3FF,3 dB roll-off
11.925675675675675,130.36254897322345,PraatF0,Praat (F0),harmonicity,#11A3FF,3 dB roll-off
11.926176176176176,130.36558922999194,PraatF0,Praat (F0),harmonicity,#11A3FF,3 dB roll-off
11.926676676676676,130.36863037430197,PraatF0,Praat (F0),harmonicity,#11A3FF,3 dB roll-off
11.927177177177176,130.37166553372344,PraatF0,Praat (F0),harmonicity,#11A3FF,3 dB roll-off
11.927677677677679,130.37473326820998,PraatF0,Praat (F0),harmonicity,#11A3FF,3 dB roll-off
11.928178178178179,130.37776645729699,PraatF0,Praat (F0),harmonicity,#11A3FF,3 dB roll-off
11.92867867867868,130.38064437275742,PraatF0,Praat (F0),harmonicity,#11A3FF,3 dB roll-off
11.92917917917918,130.38373513867822,PraatF0,Praat (F0),harmonicity,#11A3FF,3 dB roll-off
11.92967967967968,130.38681077861216,PraatF0,Praat (F0),harmonicity,#11A3FF,3 dB roll-off
11.93018018018018,130.38986352059462,PraatF0,Praat (F0),harmonicity,#11A3FF,3 dB roll-off
11.93068068068068,130.39290667182746,PraatF0,Praat (F0),harmonicity,#11A3FF,3 dB roll-off
11.93118118118118,130.39596217143074,PraatF0,Praat (F0),harmonicity,#11A3FF,3 dB roll-off
11.931681681681681,130.39899905623548,PraatF0,Praat (F0),harmonicity,#11A3FF,3 dB roll-off
11.932182182182181,130.40203295992654,PraatF0,Praat (F0),harmonicity,#11A3FF,3 dB roll-off
11.932682682682684,130.40507183169916,PraatF0,Praat (F0),harmonicity,#11A3FF,3 dB roll-off
11.933183183183184,130.4080957047633,PraatF0,Praat (F0),harmonicity,#11A3FF,3 dB roll-off
11.933683683683684,130.41112347053559,PraatF0,Praat (F0),harmonicity,#11A3FF,3 dB roll-off
11.934184184184184,130.41426511879516,PraatF0,Praat (F0),harmonicity,#11A3FF,3 dB roll-off
11.934684684684685,130.417309647438,PraatF0,Praat (F0),harmonicity,#11A3FF,3 dB roll-off
11.935185185185185,130.42038162810525,PraatF0,Praat (F0),harmonicity,#11A3FF,3 dB roll-off
11.935685685685685,130.42339210934514,PraatF0,Praat (F0),harmonicity,#11A3FF,3 dB roll-off
11.936186186186186,130.42642736820812,PraatF0,Praat (F0),harmonicity,#11A3FF,3 dB roll-off
11.936686686686686,130.42946673336792,PraatF0,Praat (F0),harmonicity,#11A3FF,3 dB roll-off
11.937187187187186,130.43248900051998,PraatF0,Praat (F0),harmonicity,#11A3FF,3 dB roll-off
11.937687687687689,130.43550746346577,PraatF0,Praat (F0),harmonicity,#11A3FF,3 dB roll-off
11.938188188188189,130.43851707864656,PraatF0,Praat (F0),harmonicity,#11A3FF,3 dB roll-off
11.93868868868869,130.44148070142782,PraatF0,Praat (F0),harmonicity,#11A3FF,3 dB roll-off
11.93918918918919,130.44454545768815,PraatF0,Praat (F0),harmonicity,#11A3FF,3 dB roll-off
11.93968968968969,130.44756473126466,PraatF0,Praat (F0),harmonicity,#11A3FF,3 dB roll-off
11.94019019019019,130.4505774398688,PraatF0,Praat (F0),harmonicity,#11A3FF,3 dB roll-off
11.94069069069069,130.45359454426546,PraatF0,Praat (F0),harmonicity,#11A3FF,3 dB roll-off
11.94119119119119,130.4566036043221,PraatF0,Praat (F0),harmonicity,#11A3FF,3 dB roll-off
11.941691691691691,130.45961630405458,PraatF0,Praat (F0),harmonicity,#11A3FF,3 dB roll-off
11.942192192192191,130.4626216647505,PraatF0,Praat (F0),harmonicity,#11A3FF,3 dB roll-off
11.942692692692694,130.46563578857064,PraatF0,Praat (F0),harmonicity,#11A3FF,3 dB roll-off
11.943193193193194,130.46863288789032,PraatF0,Praat (F0),harmonicity,#11A3FF,3 dB roll-off
11.943693693693694,130.47166898001262,PraatF0,Praat (F0),harmonicity,#11A3FF,3 dB roll-off
11.944194194194194,130.47469718294906,PraatF0,Praat (F0),harmonicity,#11A3FF,3 dB roll-off
11.944694694694695,130.47781398584394,PraatF0,Praat (F0),harmonicity,#11A3FF,3 dB roll-off
11.945195195195195,130.48088377447016,PraatF0,Praat (F0),harmonicity,#11A3FF,3 dB roll-off
11.945695695695695,130.48396749901676,PraatF0,Praat (F0),harmonicity,#11A3FF,3 dB roll-off
11.946196196196196,130.4871479066025,PraatF0,Praat (F0),harmonicity,#11A3FF,3 dB roll-off
11.946696696696696,130.4902083387785,PraatF0,Praat (F0),harmonicity,#11A3FF,3 dB roll-off
11.947197197197196,130.49327617041268,PraatF0,Praat (F0),harmonicity,#11A3FF,3 dB roll-off
11.947697697697699,130.4963461937361,PraatF0,Praat (F0),harmonicity,#11A3FF,3 dB roll-off
11.948198198198199,130.4991497068089,PraatF0,Praat (F0),harmonicity,#11A3FF,3 dB roll-off
11.9486986986987,130.50196394186236,PraatF0,Praat (F0),harmonicity,#11A3FF,3 dB roll-off
11.9491991991992,130.50502200567274,PraatF0,Praat (F0),harmonicity,#11A3FF,3 dB roll-off
11.9496996996997,130.50807369753346,PraatF0,Praat (F0),harmonicity,#11A3FF,3 dB roll-off
11.9502002002002,130.51109947523616,PraatF0,Praat (F0),harmonicity,#11A3FF,3 dB roll-off
11.9507007007007,130.5141178618075,PraatF0,Praat (F0),harmonicity,#11A3FF,3 dB roll-off
11.9512012012012,130.51712237076396,PraatF0,Praat (F0),harmonicity,#11A3FF,3 dB roll-off
11.951701701701701,130.5202786667519,PraatF0,Praat (F0),harmonicity,#11A3FF,3 dB roll-off
11.952202202202201,130.52346430418868,PraatF0,Praat (F0),harmonicity,#11A3FF,3 dB roll-off
11.952702702702704,130.52647237489242,PraatF0,Praat (F0),harmonicity,#11A3FF,3 dB roll-off
11.953203203203204,130.5294694533472,PraatF0,Praat (F0),harmonicity,#11A3FF,3 dB roll-off
11.953703703703704,130.53254809172603,PraatF0,Praat (F0),harmonicity,#11A3FF,3 dB roll-off
11.954204204204204,130.53546720881803,PraatF0,Praat (F0),harmonicity,#11A3FF,3 dB roll-off
11.954704704704705,130.53844426995022,PraatF0,Praat (F0),harmonicity,#11A3FF,3 dB roll-off
11.955205205205205,130.54146068803874,PraatF0,Praat (F0),harmonicity,#11A3FF,3 dB roll-off
11.955705705705705,130.54453268514666,PraatF0,Praat (F0),harmonicity,#11A3FF,3 dB roll-off
11.956206206206206,130.54760181678296,PraatF0,Praat (F0),harmonicity,#11A3FF,3 dB roll-off
11.956706706706706,130.55065998124343,PraatF0,Praat (F0),harmonicity,#11A3FF,3 dB roll-off
11.957207207207206,130.55362293929696,PraatF0,Praat (F0),harmonicity,#11A3FF,3 dB roll-off
11.957707707707709,130.55661502258693,PraatF0,Praat (F0),harmonicity,#11A3FF,3 dB roll-off
11.958208208208209,130.5595502098838,PraatF0,Praat (F0),harmonicity,#11A3FF,3 dB roll-off
11.95870870870871,130.56250681266914,PraatF0,Praat (F0),harmonicity,#11A3FF,3 dB roll-off
11.95920920920921,130.56583774644724,PraatF0,Praat (F0),harmonicity,#11A3FF,3 dB roll-off
11.95970970970971,130.56892477671255,PraatF0,Praat (F0),harmonicity,#11A3FF,3 dB roll-off
11.96021021021021,130.571976182,PraatF0,Praat (F0),harmonicity,#11A3FF,3 dB roll-off
11.96071071071071,130.5750572307963,PraatF0,Praat (F0),harmonicity,#11A3FF,3 dB roll-off
11.96121121121121,130.57779449647967,PraatF0,Praat (F0),harmonicity,#11A3FF,3 dB roll-off
11.961711711711711,130.58090982497737,PraatF0,Praat (F0),harmonicity,#11A3FF,3 dB roll-off
11.962212212212211,130.58373342417337,PraatF0,Praat (F0),harmonicity,#11A3FF,3 dB roll-off
11.962712712712714,130.58659324742231,PraatF0,Praat (F0),harmonicity,#11A3FF,3 dB roll-off
11.963213213213214,130.58966131220507,PraatF0,Praat (F0),harmonicity,#11A3FF,3 dB roll-off
11.963713713713714,130.59279348003753,PraatF0,Praat (F0),harmonicity,#11A3FF,3 dB roll-off
11.964214214214214,130.59569465138574,PraatF0,Praat (F0),harmonicity,#11A3FF,3 dB roll-off
11.964714714714715,130.5984221017759,PraatF0,Praat (F0),harmonicity,#11A3FF,3 dB roll-off
11.965215215215215,130.6011325986746,PraatF0,Praat (F0),harmonicity,#11A3FF,3 dB roll-off
11.965715715715715,130.6043161495014,PraatF0,Praat (F0),harmonicity,#11A3FF,3 dB roll-off
11.966216216216216,130.60749871471455,PraatF0,Praat (F0),harmonicity,#11A3FF,3 dB roll-off
11.966716716716716,130.6107388043026,PraatF0,Praat (F0),harmonicity,#11A3FF,3 dB roll-off
11.967217217217216,130.61399100842044,PraatF0,Praat (F0),harmonicity,#11A3FF,3 dB roll-off
11.967717717717719,130.61717273064556,PraatF0,Praat (F0),harmonicity,#11A3FF,3 dB roll-off
11.968218218218219,130.62022005981464,PraatF0,Praat (F0),harmonicity,#11A3FF,3 dB roll-off
11.96871871871872,130.6233097759606,PraatF0,Praat (F0),harmonicity,#11A3FF,3 dB roll-off
11.96921921921922,130.62637322424405,PraatF0,Praat (F0),harmonicity,#11A3FF,3 dB roll-off
11.96971971971972,130.6294859936311,PraatF0,Praat (F0),harmonicity,#11A3FF,3 dB roll-off
11.97022022022022,130.63252759832977,PraatF0,Praat (F0),harmonicity,#11A3FF,3 dB roll-off
11.97072072072072,130.63554103189767,PraatF0,Praat (F0),harmonicity,#11A3FF,3 dB roll-off
11.97122122122122,130.63857282181272,PraatF0,Praat (F0),harmonicity,#11A3FF,3 dB roll-off
11.971721721721721,130.64138184483505,PraatF0,Praat (F0),harmonicity,#11A3FF,3 dB roll-off
11.972222222222221,130.64410258551683,PraatF0,Praat (F0),harmonicity,#11A3FF,3 dB roll-off
11.972722722722724,130.64706331254467,PraatF0,Praat (F0),harmonicity,#11A3FF,3 dB roll-off
11.973223223223224,130.65044960601125,PraatF0,Praat (F0),harmonicity,#11A3FF,3 dB roll-off
11.973723723723724,130.65342952380573,PraatF0,Praat (F0),harmonicity,#11A3FF,3 dB roll-off
11.974224224224224,130.65638000229814,PraatF0,Praat (F0),harmonicity,#11A3FF,3 dB roll-off
11.974724724724725,130.65914595759398,PraatF0,Praat (F0),harmonicity,#11A3FF,3 dB roll-off
11.975225225225225,130.6621244874333,PraatF0,Praat (F0),harmonicity,#11A3FF,3 dB roll-off
11.975725725725725,130.66570243580827,PraatF0,Praat (F0),harmonicity,#11A3FF,3 dB roll-off
11.976226226226226,130.66925744287678,PraatF0,Praat (F0),harmonicity,#11A3FF,3 dB roll-off
11.976726726726726,130.67216399162245,PraatF0,Praat (F0),harmonicity,#11A3FF,3 dB roll-off
11.977227227227226,130.67470778480785,PraatF0,Praat (F0),harmonicity,#11A3FF,3 dB roll-off
11.977727727727729,130.67781961382738,PraatF0,Praat (F0),harmonicity,#11A3FF,3 dB roll-off
11.978228228228229,130.6809014270283,PraatF0,Praat (F0),harmonicity,#11A3FF,3 dB roll-off
11.97872872872873,130.6835233485391,PraatF0,Praat (F0),harmonicity,#11A3FF,3 dB roll-off
11.97922922922923,130.68612977439625,PraatF0,Praat (F0),harmonicity,#11A3FF,3 dB roll-off
11.97972972972973,130.68905662424902,PraatF0,Praat (F0),harmonicity,#11A3FF,3 dB roll-off
11.98023023023023,130.69190519909756,PraatF0,Praat (F0),harmonicity,#11A3FF,3 dB roll-off
11.98073073073073,130.6949792981875,PraatF0,Praat (F0),harmonicity,#11A3FF,3 dB roll-off
11.98123123123123,130.69827871210887,PraatF0,Praat (F0),harmonicity,#11A3FF,3 dB roll-off
11.981731731731731,130.70178426680025,PraatF0,Praat (F0),harmonicity,#11A3FF,3 dB roll-off
11.982232232232231,130.70484936117074,PraatF0,Praat (F0),harmonicity,#11A3FF,3 dB roll-off
11.982732732732734,130.707986737469,PraatF0,Praat (F0),harmonicity,#11A3FF,3 dB roll-off
11.983233233233234,130.71088292687318,PraatF0,Praat (F0),harmonicity,#11A3FF,3 dB roll-off
11.983733733733734,130.7138554362232,PraatF0,Praat (F0),harmonicity,#11A3FF,3 dB roll-off
11.984234234234235,130.71689430755885,PraatF0,Praat (F0),harmonicity,#11A3FF,3 dB roll-off
11.984734734734735,130.71956491315035,PraatF0,Praat (F0),harmonicity,#11A3FF,3 dB roll-off
11.985235235235235,130.72208363788658,PraatF0,Praat (F0),harmonicity,#11A3FF,3 dB roll-off
11.985735735735735,130.7252209132514,PraatF0,Praat (F0),harmonicity,#11A3FF,3 dB roll-off
11.986236236236236,130.72879185888,PraatF0,Praat (F0),harmonicity,#11A3FF,3 dB roll-off
11.986736736736736,130.731979154392,PraatF0,Praat (F0),harmonicity,#11A3FF,3 dB roll-off
11.987237237237236,130.73478260498024,PraatF0,Praat (F0),harmonicity,#11A3FF,3 dB roll-off
11.987737737737739,130.73769616700696,PraatF0,Praat (F0),harmonicity,#11A3FF,3 dB roll-off
11.988238238238239,130.74070636344806,PraatF0,Praat (F0),harmonicity,#11A3FF,3 dB roll-off
11.98873873873874,130.74410943029864,PraatF0,Praat (F0),harmonicity,#11A3FF,3 dB roll-off
11.98923923923924,130.7474725907685,PraatF0,Praat (F0),harmonicity,#11A3FF,3 dB roll-off
11.98973973973974,130.7505320775685,PraatF0,Praat (F0),harmonicity,#11A3FF,3 dB roll-off
11.99024024024024,130.753524393166,PraatF0,Praat (F0),harmonicity,#11A3FF,3 dB roll-off
11.99074074074074,130.75643346953223,PraatF0,Praat (F0),harmonicity,#11A3FF,3 dB roll-off
11.99124124124124,130.7593909498537,PraatF0,Praat (F0),harmonicity,#11A3FF,3 dB roll-off
11.991741741741741,130.76229855386427,PraatF0,Praat (F0),harmonicity,#11A3FF,3 dB roll-off
11.992242242242241,130.76494496065027,PraatF0,Praat (F0),harmonicity,#11A3FF,3 dB roll-off
11.992742742742744,130.76777670297022,PraatF0,Praat (F0),harmonicity,#11A3FF,3 dB roll-off
11.993243243243244,130.77074033799582,PraatF0,Praat (F0),harmonicity,#11A3FF,3 dB roll-off
11.993743743743744,130.77350315173175,PraatF0,Praat (F0),harmonicity,#11A3FF,3 dB roll-off
11.994244244244245,130.77652196081505,PraatF0,Praat (F0),harmonicity,#11A3FF,3 dB roll-off
11.994744744744745,130.77989130249284,PraatF0,Praat (F0),harmonicity,#11A3FF,3 dB roll-off
11.995245245245245,130.78350712193296,PraatF0,Praat (F0),harmonicity,#11A3FF,3 dB roll-off
11.995745745745745,130.78707008553639,PraatF0,Praat (F0),harmonicity,#11A3FF,3 dB roll-off
11.996246246246246,130.79050477475312,PraatF0,Praat (F0),harmonicity,#11A3FF,3 dB roll-off
11.996746746746746,130.7938026783111,PraatF0,Praat (F0),harmonicity,#11A3FF,3 dB roll-off
11.997247247247246,130.79697801087286,PraatF0,Praat (F0),harmonicity,#11A3FF,3 dB roll-off
11.997747747747749,130.80001176858133,PraatF0,Praat (F0),harmonicity,#11A3FF,3 dB roll-off
11.998248248248249,130.8029500000148,PraatF0,Praat (F0),harmonicity,#11A3FF,3 dB roll-off
11.99874874874875,130.80583383737792,PraatF0,Praat (F0),harmonicity,#11A3FF,3 dB roll-off
11.99924924924925,130.80863069537645,PraatF0,Praat (F0),harmonicity,#11A3FF,3 dB roll-off
11.99974974974975,130.81139003490966,PraatF0,Praat (F0),harmonicity,#11A3FF,3 dB roll-off
12.00025025025025,130.81416555444588,PraatF0,Praat (F0),harmonicity,#11A3FF,3 dB roll-off
12.00075075075075,130.81693199495822,PraatF0,Praat (F0),harmonicity,#11A3FF,3 dB roll-off
12.00125125125125,130.81972501034215,PraatF0,Praat (F0),harmonicity,#11A3FF,3 dB roll-off
12.001751751751751,130.82260395196334,PraatF0,Praat (F0),harmonicity,#11A3FF,3 dB roll-off
12.002252252252251,130.82554206311605,PraatF0,Praat (F0),harmonicity,#11A3FF,3 dB roll-off
12.002752752752754,130.82858900288755,PraatF0,Praat (F0),harmonicity,#11A3FF,3 dB roll-off
12.003253253253254,130.83175177937505,PraatF0,Praat (F0),harmonicity,#11A3FF,3 dB roll-off
12.003753753753754,130.83505647822776,PraatF0,Praat (F0),harmonicity,#11A3FF,3 dB roll-off
12.004254254254255,130.83848743764844,PraatF0,Praat (F0),harmonicity,#11A3FF,3 dB roll-off
12.004754754754755,130.84204438437314,PraatF0,Praat (F0),harmonicity,#11A3FF,3 dB roll-off
12.005255255255255,130.8456826736521,PraatF0,Praat (F0),harmonicity,#11A3FF,3 dB roll-off
12.005755755755755,130.84910125967724,PraatF0,Praat (F0),harmonicity,#11A3FF,3 dB roll-off
12.006256256256256,130.85211065800624,PraatF0,Praat (F0),harmonicity,#11A3FF,3 dB roll-off
12.006756756756756,130.8548439947724,PraatF0,Praat (F0),harmonicity,#11A3FF,3 dB roll-off
12.007257257257256,130.85780422229817,PraatF0,Praat (F0),harmonicity,#11A3FF,3 dB roll-off
12.007757757757759,130.86064290985786,PraatF0,Praat (F0),harmonicity,#11A3FF,3 dB roll-off
12.008258258258259,130.86331450451434,PraatF0,Praat (F0),harmonicity,#11A3FF,3 dB roll-off
12.00875875875876,130.86622651883172,PraatF0,Praat (F0),harmonicity,#11A3FF,3 dB roll-off
12.00925925925926,130.8691890452762,PraatF0,Praat (F0),harmonicity,#11A3FF,3 dB roll-off
12.00975975975976,130.87214514324768,PraatF0,Praat (F0),harmonicity,#11A3FF,3 dB roll-off
12.01026026026026,130.87514347764866,PraatF0,Praat (F0),harmonicity,#11A3FF,3 dB roll-off
12.01076076076076,130.87820910152794,PraatF0,Praat (F0),harmonicity,#11A3FF,3 dB roll-off
12.01126126126126,130.8815821014312,PraatF0,Praat (F0),harmonicity,#11A3FF,3 dB roll-off
12.011761761761761,130.88494422256935,PraatF0,Praat (F0),harmonicity,#11A3FF,3 dB roll-off
12.012262262262261,130.88795447247702,PraatF0,Praat (F0),harmonicity,#11A3FF,3 dB roll-off
12.012762762762764,130.89091810946223,PraatF0,Praat (F0),harmonicity,#11A3FF,3 dB roll-off
12.013263263263264,130.89374734339276,PraatF0,Praat (F0),harmonicity,#11A3FF,3 dB roll-off
12.013763763763764,130.89691278495388,PraatF0,Praat (F0),harmonicity,#11A3FF,3 dB roll-off
12.014264264264265,130.90049681879523,PraatF0,Praat (F0),harmonicity,#11A3FF,3 dB roll-off
12.014764764764765,130.90362227190826,PraatF0,Praat (F0),harmonicity,#11A3FF,3 dB roll-off
12.015265265265265,130.9061087833374,PraatF0,Praat (F0),harmonicity,#11A3FF,3 dB roll-off
12.015765765765765,130.90881311160084,PraatF0,Praat (F0),harmonicity,#11A3FF,3 dB roll-off
12.016266266266266,130.91184834541934,PraatF0,Praat (F0),harmonicity,#11A3FF,3 dB roll-off
12.016766766766766,130.91480810060477,PraatF0,Praat (F0),harmonicity,#11A3FF,3 dB roll-off
12.017267267267266,130.91779202654567,PraatF0,Praat (F0),harmonicity,#11A3FF,3 dB roll-off
12.017767767767769,130.92091098660393,PraatF0,Praat (F0),harmonicity,#11A3FF,3 dB roll-off
12.018268268268269,130.92398397467798,PraatF0,Praat (F0),harmonicity,#11A3FF,3 dB roll-off
12.01876876876877,130.9275222439513,PraatF0,Praat (F0),harmonicity,#11A3FF,3 dB roll-off
12.01926926926927,130.93078035758862,PraatF0,Praat (F0),harmonicity,#11A3FF,3 dB roll-off
12.01976976976977,130.93383595439656,PraatF0,Praat (F0),harmonicity,#11A3FF,3 dB roll-off
12.02027027027027,130.93673560444591,PraatF0,Praat (F0),harmonicity,#11A3FF,3 dB roll-off
12.02077077077077,130.93963082227032,PraatF0,Praat (F0),harmonicity,#11A3FF,3 dB roll-off
12.02127127127127,130.94222413699754,PraatF0,Praat (F0),harmonicity,#11A3FF,3 dB roll-off
12.021771771771771,130.94488811255232,PraatF0,Praat (F0),harmonicity,#11A3FF,3 dB roll-off
12.022272272272271,130.94798330576037,PraatF0,Praat (F0),harmonicity,#11A3FF,3 dB roll-off
12.022772772772774,130.9511060556476,PraatF0,Praat (F0),harmonicity,#11A3FF,3 dB roll-off
12.023273273273274,130.95364569643044,PraatF0,Praat (F0),harmonicity,#11A3FF,3 dB roll-off
12.023773773773774,130.9565632632486,PraatF0,Praat (F0),harmonicity,#11A3FF,3 dB roll-off
12.024274274274275,130.96024078938234,PraatF0,Praat (F0),harmonicity,#11A3FF,3 dB roll-off
12.024774774774775,130.96373535124584,PraatF0,Praat (F0),harmonicity,#11A3FF,3 dB roll-off
12.025275275275275,130.96672425659222,PraatF0,Praat (F0),harmonicity,#11A3FF,3 dB roll-off
12.025775775775776,130.96947141778207,PraatF0,Praat (F0),harmonicity,#11A3FF,3 dB roll-off
12.026276276276276,130.97246706549072,PraatF0,Praat (F0),harmonicity,#11A3FF,3 dB roll-off
12.026776776776776,130.97545727073145,PraatF0,Praat (F0),harmonicity,#11A3FF,3 dB roll-off
12.027277277277276,130.97891310413047,PraatF0,Praat (F0),harmonicity,#11A3FF,3 dB roll-off
12.027777777777779,130.9818331221744,PraatF0,Praat (F0),harmonicity,#11A3FF,3 dB roll-off
12.028278278278279,130.9845453492209,PraatF0,Praat (F0),harmonicity,#11A3FF,3 dB roll-off
12.02877877877878,130.98737920436068,PraatF0,Praat (F0),harmonicity,#11A3FF,3 dB roll-off
12.02927927927928,130.99043870685682,PraatF0,Praat (F0),harmonicity,#11A3FF,3 dB roll-off
12.02977977977978,130.9934641447044,PraatF0,Praat (F0),harmonicity,#11A3FF,3 dB roll-off
12.03028028028028,130.99652827108156,PraatF0,Praat (F0),harmonicity,#11A3FF,3 dB roll-off
12.03078078078078,130.99975589807173,PraatF0,Praat (F0),harmonicity,#11A3FF,3 dB roll-off
12.03128128128128,131.0027474478922,PraatF0,Praat (F0),harmonicity,#11A3FF,3 dB roll-off
12.031781781781781,131.00583313223296,PraatF0,Praat (F0),harmonicity,#11A3FF,3 dB roll-off
12.032282282282281,131.00888524673468,PraatF0,Praat (F0),harmonicity,#11A3FF,3 dB roll-off
12.032782782782784,131.01212298735695,PraatF0,Praat (F0),harmonicity,#11A3FF,3 dB roll-off
12.033283283283284,131.01540318046972,PraatF0,Praat (F0),harmonicity,#11A3FF,3 dB roll-off
12.033783783783784,131.01865624931025,PraatF0,Praat (F0),harmonicity,#11A3FF,3 dB roll-off
12.034284284284285,131.02185016095268,PraatF0,Praat (F0),harmonicity,#11A3FF,3 dB roll-off
12.034784784784785,131.02500072836398,PraatF0,Praat (F0),harmonicity,#11A3FF,3 dB roll-off
12.035285285285285,131.02770011546676,PraatF0,Praat (F0),harmonicity,#11A3FF,3 dB roll-off
12.035785785785786,131.0304391036567,PraatF0,Praat (F0),harmonicity,#11A3FF,3 dB roll-off
12.036286286286286,131.0334301554381,PraatF0,Praat (F0),harmonicity,#11A3FF,3 dB roll-off
12.036786786786786,131.03655863704927,PraatF0,Praat (F0),harmonicity,#11A3FF,3 dB roll-off
12.037287287287286,131.03965371165862,PraatF0,Praat (F0),harmonicity,#11A3FF,3 dB roll-off
12.037787787787789,131.04249978672368,PraatF0,Praat (F0),harmonicity,#11A3FF,3 dB roll-off
12.038288288288289,131.04534523456226,PraatF0,Praat (F0),harmonicity,#11A3FF,3 dB roll-off
12.03878878878879,131.04856463129983,PraatF0,Praat (F0),harmonicity,#11A3FF,3 dB roll-off
12.03928928928929,131.0512689762121,PraatF0,Praat (F0),harmonicity,#11A3FF,3 dB roll-off
12.03978978978979,131.05436951729888,PraatF0,Praat (F0),harmonicity,#11A3FF,3 dB roll-off
12.04029029029029,131.05745155599072,PraatF0,Praat (F0),harmonicity,#11A3FF,3 dB roll-off
12.04079079079079,131.0605497148984,PraatF0,Praat (F0),harmonicity,#11A3FF,3 dB roll-off
12.04129129129129,131.06385548712586,PraatF0,Praat (F0),harmonicity,#11A3FF,3 dB roll-off
12.041791791791791,131.06685172058792,PraatF0,Praat (F0),harmonicity,#11A3FF,3 dB roll-off
12.042292292292291,131.069829943096,PraatF0,Praat (F0),harmonicity,#11A3FF,3 dB roll-off
12.042792792792794,131.07284186956178,PraatF0,Praat (F0),harmonicity,#11A3FF,3 dB roll-off
12.043293293293294,131.0758248736111,PraatF0,Praat (F0),harmonicity,#11A3FF,3 dB roll-off
12.043793793793794,131.07891400282062,PraatF0,Praat (F0),harmonicity,#11A3FF,3 dB roll-off
12.044294294294295,131.08202743471998,PraatF0,Praat (F0),harmonicity,#11A3FF,3 dB roll-off
12.044794794794795,131.08509809481026,PraatF0,Praat (F0),harmonicity,#11A3FF,3 dB roll-off
12.045295295295295,131.08811173642,PraatF0,Praat (F0),harmonicity,#11A3FF,3 dB roll-off
12.045795795795796,131.09113203842102,PraatF0,Praat (F0),harmonicity,#11A3FF,3 dB roll-off
12.046296296296296,131.09406563782568,PraatF0,Praat (F0),harmonicity,#11A3FF,3 dB roll-off
12.046796796796796,131.09718189679916,PraatF0,Praat (F0),harmonicity,#11A3FF,3 dB roll-off
12.047297297297296,131.10020803211768,PraatF0,Praat (F0),harmonicity,#11A3FF,3 dB roll-off
12.047797797797799,131.10328078836642,PraatF0,Praat (F0),harmonicity,#11A3FF,3 dB roll-off
12.048298298298299,131.10656031382794,PraatF0,Praat (F0),harmonicity,#11A3FF,3 dB roll-off
12.0487987987988,131.10962777667206,PraatF0,Praat (F0),harmonicity,#11A3FF,3 dB roll-off
12.0492992992993,131.11263055659327,PraatF0,Praat (F0),harmonicity,#11A3FF,3 dB roll-off
12.0497997997998,131.11570178436193,PraatF0,Praat (F0),harmonicity,#11A3FF,3 dB roll-off
12.0503003003003,131.11875815678619,PraatF0,Praat (F0),harmonicity,#11A3FF,3 dB roll-off
12.0508008008008,131.1218414278157,PraatF0,Praat (F0),harmonicity,#11A3FF,3 dB roll-off
12.0513013013013,131.12490310462374,PraatF0,Praat (F0),harmonicity,#11A3FF,3 dB roll-off
12.051801801801801,131.12757103909814,PraatF0,Praat (F0),harmonicity,#11A3FF,3 dB roll-off
12.052302302302301,131.13058573232496,PraatF0,Praat (F0),harmonicity,#11A3FF,3 dB roll-off
12.052802802802804,131.1336829792471,PraatF0,Praat (F0),harmonicity,#11A3FF,3 dB roll-off
12.053303303303304,131.13677325333452,PraatF0,Praat (F0),harmonicity,#11A3FF,3 dB roll-off
12.053803803803804,131.1398658818253,PraatF0,Praat (F0),harmonicity,#11A3FF,3 dB roll-off
12.054304304304305,131.1431127853938,PraatF0,Praat (F0),harmonicity,#11A3FF,3 dB roll-off
12.054804804804805,131.14619378126184,PraatF0,Praat (F0),harmonicity,#11A3FF,3 dB roll-off
12.055305305305305,131.14937090834735,PraatF0,Praat (F0),harmonicity,#11A3FF,3 dB roll-off
12.055805805805806,131.15240670017118,PraatF0,Praat (F0),harmonicity,#11A3FF,3 dB roll-off
12.056306306306306,131.15544557092366,PraatF0,Praat (F0),harmonicity,#11A3FF,3 dB roll-off
12.056806806806806,131.15849396537214,PraatF0,Praat (F0),harmonicity,#11A3FF,3 dB roll-off
12.057307307307306,131.16153196272825,PraatF0,Praat (F0),harmonicity,#11A3FF,3 dB roll-off
12.057807807807809,131.16455938395814,PraatF0,Praat (F0),harmonicity,#11A3FF,3 dB roll-off
12.058308308308309,131.16760230806483,PraatF0,Praat (F0),harmonicity,#11A3FF,3 dB roll-off
12.05880880880881,131.1706484906295,PraatF0,Praat (F0),harmonicity,#11A3FF,3 dB roll-off
12.05930930930931,131.17369002114106,PraatF0,Praat (F0),harmonicity,#11A3FF,3 dB roll-off
12.05980980980981,131.1767379648675,PraatF0,Praat (F0),harmonicity,#11A3FF,3 dB roll-off
12.06031031031031,131.17978068816893,PraatF0,Praat (F0),harmonicity,#11A3FF,3 dB roll-off
12.06081081081081,131.18283083971795,PraatF0,Praat (F0),harmonicity,#11A3FF,3 dB roll-off
12.06131131131131,131.18587059379772,PraatF0,Praat (F0),harmonicity,#11A3FF,3 dB roll-off
12.061811811811811,131.1889177772922,PraatF0,Praat (F0),harmonicity,#11A3FF,3 dB roll-off
12.062312312312311,131.19195887518254,PraatF0,Praat (F0),harmonicity,#11A3FF,3 dB roll-off
12.062812812812814,131.19500910241828,PraatF0,Praat (F0),harmonicity,#11A3FF,3 dB roll-off
12.063313313313314,131.19807093090407,PraatF0,Praat (F0),harmonicity,#11A3FF,3 dB roll-off
12.063813813813814,131.20114103386388,PraatF0,Praat (F0),harmonicity,#11A3FF,3 dB roll-off
12.064314314314315,131.20420972757773,PraatF0,Praat (F0),harmonicity,#11A3FF,3 dB roll-off
12.064814814814815,131.20732358751016,PraatF0,Praat (F0),harmonicity,#11A3FF,3 dB roll-off
12.065315315315315,131.2103605495414,PraatF0,Praat (F0),harmonicity,#11A3FF,3 dB roll-off
12.065815815815816,131.21351501090086,PraatF0,Praat (F0),harmonicity,#11A3FF,3 dB roll-off
12.066316316316316,131.2165987578547,PraatF0,Praat (F0),harmonicity,#11A3FF,3 dB roll-off
12.066816816816816,131.2196606901253,PraatF0,Praat (F0),harmonicity,#11A3FF,3 dB roll-off
12.067317317317316,131.22272063379125,PraatF0,Praat (F0),harmonicity,#11A3FF,3 dB roll-off
12.067817817817819,131.22579040004607,PraatF0,Praat (F0),harmonicity,#11A3FF,3 dB roll-off
12.068318318318319,131.22885853613457,PraatF0,Praat (F0),harmonicity,#11A3FF,3 dB roll-off
12.06881881881882,131.23193702648874,PraatF0,Praat (F0),harmonicity,#11A3FF,3 dB roll-off
12.06931931931932,131.23499159804715,PraatF0,Praat (F0),harmonicity,#11A3FF,3 dB roll-off
12.06981981981982,131.23809121181162,PraatF0,Praat (F0),harmonicity,#11A3FF,3 dB roll-off
12.07032032032032,131.2411957674621,PraatF0,Praat (F0),harmonicity,#11A3FF,3 dB roll-off
12.07082082082082,131.24432108631902,PraatF0,Praat (F0),harmonicity,#11A3FF,3 dB roll-off
12.07132132132132,131.24746105720385,PraatF0,Praat (F0),harmonicity,#11A3FF,3 dB roll-off
12.071821821821821,131.2503694581094,PraatF0,Praat (F0),harmonicity,#11A3FF,3 dB roll-off
12.072322322322321,131.25344012596474,PraatF0,Praat (F0),harmonicity,#11A3FF,3 dB roll-off
12.072822822822824,131.2565157913433,PraatF0,Praat (F0),harmonicity,#11A3FF,3 dB roll-off
12.073323323323324,131.2595869614771,PraatF0,Praat (F0),harmonicity,#11A3FF,3 dB roll-off
12.073823823823824,131.26269431138314,PraatF0,Praat (F0),harmonicity,#11A3FF,3 dB roll-off
12.074324324324325,131.2657684206675,PraatF0,Praat (F0),harmonicity,#11A3FF,3 dB roll-off
12.074824824824825,131.26876947880618,PraatF0,Praat (F0),harmonicity,#11A3FF,3 dB roll-off
12.075325325325325,131.27180889466342,PraatF0,Praat (F0),harmonicity,#11A3FF,3 dB roll-off
12.075825825825826,131.27490065819217,PraatF0,Praat (F0),harmonicity,#11A3FF,3 dB roll-off
12.076326326326326,131.27798198605547,PraatF0,Praat (F0),harmonicity,#11A3FF,3 dB roll-off
12.076826826826826,131.28106810810146,PraatF0,Praat (F0),harmonicity,#11A3FF,3 dB roll-off
12.077327327327327,131.28415198924847,PraatF0,Praat (F0),harmonicity,#11A3FF,3 dB roll-off
12.077827827827829,131.28724398377656,PraatF0,Praat (F0),harmonicity,#11A3FF,3 dB roll-off
12.078328328328329,131.29033597504426,PraatF0,Praat (F0),harmonicity,#11A3FF,3 dB roll-off
12.07882882882883,131.29306177732045,PraatF0,Praat (F0),harmonicity,#11A3FF,3 dB roll-off
12.07932932932933,131.29584862466677,PraatF0,Praat (F0),harmonicity,#11A3FF,3 dB roll-off
12.07982982982983,131.29913381688192,PraatF0,Praat (F0),harmonicity,#11A3FF,3 dB roll-off
12.08033033033033,131.30239773786354,PraatF0,Praat (F0),harmonicity,#11A3FF,3 dB roll-off
12.08083083083083,131.30565392485784,PraatF0,Praat (F0),harmonicity,#11A3FF,3 dB roll-off
12.08133133133133,131.30878464022376,PraatF0,Praat (F0),harmonicity,#11A3FF,3 dB roll-off
12.081831831831831,131.31185800055,PraatF0,Praat (F0),harmonicity,#11A3FF,3 dB roll-off
12.082332332332332,131.31512684739334,PraatF0,Praat (F0),harmonicity,#11A3FF,3 dB roll-off
12.082832832832834,131.318504938806,PraatF0,Praat (F0),harmonicity,#11A3FF,3 dB roll-off
12.083333333333334,131.32168844352788,PraatF0,Praat (F0),harmonicity,#11A3FF,3 dB roll-off
12.083833833833834,131.32485523431552,PraatF0,Praat (F0),harmonicity,#11A3FF,3 dB roll-off
12.084334334334335,131.3279993855482,PraatF0,Praat (F0),harmonicity,#11A3FF,3 dB roll-off
12.084834834834835,131.33111919664975,PraatF0,Praat (F0),harmonicity,#11A3FF,3 dB roll-off
12.085335335335335,131.33424166894878,PraatF0,Praat (F0),harmonicity,#11A3FF,3 dB roll-off
12.085835835835836,131.33736439698296,PraatF0,Praat (F0),harmonicity,#11A3FF,3 dB roll-off
12.086336336336336,131.3404472249655,PraatF0,Praat (F0),harmonicity,#11A3FF,3 dB roll-off
12.086836836836836,131.34343130989083,PraatF0,Praat (F0),harmonicity,#11A3FF,3 dB roll-off
12.087337337337337,131.34637140637335,PraatF0,Praat (F0),harmonicity,#11A3FF,3 dB roll-off
12.087837837837839,131.34930840499555,PraatF0,Praat (F0),harmonicity,#11A3FF,3 dB roll-off
12.088338338338339,131.3521799070652,PraatF0,Praat (F0),harmonicity,#11A3FF,3 dB roll-off
12.08883883883884,131.35506511437453,PraatF0,Praat (F0),harmonicity,#11A3FF,3 dB roll-off
12.08933933933934,131.3581616187795,PraatF0,Praat (F0),harmonicity,#11A3FF,3 dB roll-off
12.08983983983984,131.36127009372652,PraatF0,Praat (F0),harmonicity,#11A3FF,3 dB roll-off
12.09034034034034,131.3643783613021,PraatF0,Praat (F0),harmonicity,#11A3FF,3 dB roll-off
12.09084084084084,131.3674999887347,PraatF0,Praat (F0),harmonicity,#11A3FF,3 dB roll-off
12.09134134134134,131.37062376346753,PraatF0,Praat (F0),harmonicity,#11A3FF,3 dB roll-off
12.091841841841841,131.37376049797757,PraatF0,Praat (F0),harmonicity,#11A3FF,3 dB roll-off
12.092342342342342,131.37686797200118,PraatF0,Praat (F0),harmonicity,#11A3FF,3 dB roll-off
12.092842842842844,131.3799173237348,PraatF0,Praat (F0),harmonicity,#11A3FF,3 dB roll-off
12.093343343343344,131.38294479627945,PraatF0,Praat (F0),harmonicity,#11A3FF,3 dB roll-off
12.093843843843844,131.38610773650248,PraatF0,Praat (F0),harmonicity,#11A3FF,3 dB roll-off
12.094344344344345,131.38933292768507,PraatF0,Praat (F0),harmonicity,#11A3FF,3 dB roll-off
12.094844844844845,131.3923403201196,PraatF0,Praat (F0),harmonicity,#11A3FF,3 dB roll-off
12.095345345345345,131.39534008798523,PraatF0,Praat (F0),harmonicity,#11A3FF,3 dB roll-off
12.095845845845846,131.3983408829662,PraatF0,Praat (F0),harmonicity,#11A3FF,3 dB roll-off
12.096346346346346,131.4014014621658,PraatF0,Praat (F0),harmonicity,#11A3FF,3 dB roll-off
12.096846846846846,131.40456947122556,PraatF0,Praat (F0),harmonicity,#11A3FF,3 dB roll-off
12.097347347347347,131.40774796344556,PraatF0,Praat (F0),harmonicity,#11A3FF,3 dB roll-off
12.097847847847849,131.41092489650168,PraatF0,Praat (F0),harmonicity,#11A3FF,3 dB roll-off
12.098348348348349,131.41403985532605,PraatF0,Praat (F0),harmonicity,#11A3FF,3 dB roll-off
12.09884884884885,131.41712740783632,PraatF0,Praat (F0),harmonicity,#11A3FF,3 dB roll-off
12.09934934934935,131.420210844029,PraatF0,Praat (F0),harmonicity,#11A3FF,3 dB roll-off
12.09984984984985,131.42330210802413,PraatF0,Praat (F0),harmonicity,#11A3FF,3 dB roll-off
12.10035035035035,131.4263891282513,PraatF0,Praat (F0),harmonicity,#11A3FF,3 dB roll-off
12.10085085085085,131.42948980009794,PraatF0,Praat (F0),harmonicity,#11A3FF,3 dB roll-off
12.10135135135135,131.43258387710608,PraatF0,Praat (F0),harmonicity,#11A3FF,3 dB roll-off
12.101851851851851,131.4356830651426,PraatF0,Praat (F0),harmonicity,#11A3FF,3 dB roll-off
12.102352352352352,131.43862152236963,PraatF0,Praat (F0),harmonicity,#11A3FF,3 dB roll-off
12.102852852852854,131.44155680445132,PraatF0,Praat (F0),harmonicity,#11A3FF,3 dB roll-off
12.103353353353354,131.44447801520647,PraatF0,Praat (F0),harmonicity,#11A3FF,3 dB roll-off
12.103853853853854,131.44739960429183,PraatF0,Praat (F0),harmonicity,#11A3FF,3 dB roll-off
12.104354354354355,131.45041950938912,PraatF0,Praat (F0),harmonicity,#11A3FF,3 dB roll-off
12.104854854854855,131.45362953530102,PraatF0,Praat (F0),harmonicity,#11A3FF,3 dB roll-off
12.105355355355355,131.4568311143692,PraatF0,Praat (F0),harmonicity,#11A3FF,3 dB roll-off
12.105855855855856,131.4600276030037,PraatF0,Praat (F0),harmonicity,#11A3FF,3 dB roll-off
12.106356356356356,131.46321076490165,PraatF0,Praat (F0),harmonicity,#11A3FF,3 dB roll-off
12.106856856856856,131.46640830330148,PraatF0,Praat (F0),harmonicity,#11A3FF,3 dB roll-off
12.107357357357357,131.46948379722633,PraatF0,Praat (F0),harmonicity,#11A3FF,3 dB roll-off
12.107857857857859,131.4722654979962,PraatF0,Praat (F0),harmonicity,#11A3FF,3 dB roll-off
12.108358358358359,131.4755975096703,PraatF0,Praat (F0),harmonicity,#11A3FF,3 dB roll-off
12.10885885885886,131.47889087269206,PraatF0,Praat (F0),harmonicity,#11A3FF,3 dB roll-off
12.10935935935936,131.48218900192484,PraatF0,Praat (F0),harmonicity,#11A3FF,3 dB roll-off
12.10985985985986,131.4854654165468,PraatF0,Praat (F0),harmonicity,#11A3FF,3 dB roll-off
12.11036036036036,131.48871264510035,PraatF0,Praat (F0),harmonicity,#11A3FF,3 dB roll-off
12.11086086086086,131.4919639929036,PraatF0,Praat (F0),harmonicity,#11A3FF,3 dB roll-off
12.11136136136136,131.49518465556355,PraatF0,Praat (F0),harmonicity,#11A3FF,3 dB roll-off
12.111861861861861,131.49837562288843,PraatF0,Praat (F0),harmonicity,#11A3FF,3 dB roll-off
12.112362362362362,131.50153735463314,PraatF0,Praat (F0),harmonicity,#11A3FF,3 dB roll-off
12.112862862862864,131.50469945631357,PraatF0,Praat (F0),harmonicity,#11A3FF,3 dB roll-off
12.113363363363364,131.5078537006242,PraatF0,Praat (F0),harmonicity,#11A3FF,3 dB roll-off
12.113863863863864,131.51100780569982,PraatF0,Praat (F0),harmonicity,#11A3FF,3 dB roll-off
12.114364364364365,131.51415618045343,PraatF0,Praat (F0),harmonicity,#11A3FF,3 dB roll-off
12.114864864864865,131.5172436152912,PraatF0,Praat (F0),harmonicity,#11A3FF,3 dB roll-off
12.115365365365365,131.52028776420218,PraatF0,Praat (F0),harmonicity,#11A3FF,3 dB roll-off
12.115865865865866,131.52331186934873,PraatF0,Praat (F0),harmonicity,#11A3FF,3 dB roll-off
12.116366366366366,131.52631541233373,PraatF0,Praat (F0),harmonicity,#11A3FF,3 dB roll-off
12.116866866866866,131.52925254663393,PraatF0,Praat (F0),harmonicity,#11A3FF,3 dB roll-off
12.117367367367367,131.53216516539746,PraatF0,Praat (F0),harmonicity,#11A3FF,3 dB roll-off
12.117867867867869,131.5350567134122,PraatF0,Praat (F0),harmonicity,#11A3FF,3 dB roll-off
12.118368368368369,131.53792875373344,PraatF0,Praat (F0),harmonicity,#11A3FF,3 dB roll-off
12.11886886886887,131.54078528311467,PraatF0,Praat (F0),harmonicity,#11A3FF,3 dB roll-off
12.11936936936937,131.54363002858915,PraatF0,Praat (F0),harmonicity,#11A3FF,3 dB roll-off
12.11986986986987,131.54646276643035,PraatF0,Praat (F0),harmonicity,#11A3FF,3 dB roll-off
12.12037037037037,131.54958136802816,PraatF0,Praat (F0),harmonicity,#11A3FF,3 dB roll-off
12.12087087087087,131.5528780851365,PraatF0,Praat (F0),harmonicity,#11A3FF,3 dB roll-off
12.121371371371371,131.5561554852702,PraatF0,Praat (F0),harmonicity,#11A3FF,3 dB roll-off
12.121871871871871,131.55939248101814,PraatF0,Praat (F0),harmonicity,#11A3FF,3 dB roll-off
12.122372372372372,131.56257947778602,PraatF0,Praat (F0),harmonicity,#11A3FF,3 dB roll-off
12.122872872872874,131.56573382408226,PraatF0,Praat (F0),harmonicity,#11A3FF,3 dB roll-off
12.123373373373374,131.56884968715582,PraatF0,Praat (F0),harmonicity,#11A3FF,3 dB roll-off
12.123873873873874,131.57194551966205,PraatF0,Praat (F0),harmonicity,#11A3FF,3 dB roll-off
12.124374374374375,131.57502592524924,PraatF0,Praat (F0),harmonicity,#11A3FF,3 dB roll-off
12.124874874874875,131.57810549775695,PraatF0,Praat (F0),harmonicity,#11A3FF,3 dB roll-off
12.125375375375375,131.58117996758023,PraatF0,Praat (F0),harmonicity,#11A3FF,3 dB roll-off
12.125875875875876,131.5843362473987,PraatF0,Praat (F0),harmonicity,#11A3FF,3 dB roll-off
12.126376376376376,131.58756859656646,PraatF0,Praat (F0),harmonicity,#11A3FF,3 dB roll-off
12.126876876876876,131.5907960216584,PraatF0,Praat (F0),harmonicity,#11A3FF,3 dB roll-off
12.127377377377377,131.5940170143092,PraatF0,Praat (F0),harmonicity,#11A3FF,3 dB roll-off
12.127877877877879,131.59723706535442,PraatF0,Praat (F0),harmonicity,#11A3FF,3 dB roll-off
12.128378378378379,131.60044735946414,PraatF0,Praat (F0),harmonicity,#11A3FF,3 dB roll-off
12.12887887887888,131.603655996135,PraatF0,Praat (F0),harmonicity,#11A3FF,3 dB roll-off
12.12937937937938,131.60685637727238,PraatF0,Praat (F0),harmonicity,#11A3FF,3 dB roll-off
12.12987987987988,131.61005221090844,PraatF0,Praat (F0),harmonicity,#11A3FF,3 dB roll-off
12.13038038038038,131.613241471977,PraatF0,Praat (F0),harmonicity,#11A3FF,3 dB roll-off
12.13088088088088,131.6164272237566,PraatF0,Praat (F0),harmonicity,#11A3FF,3 dB roll-off
12.131381381381381,131.6196056845216,PraatF0,Praat (F0),harmonicity,#11A3FF,3 dB roll-off
12.131881881881881,131.622775555499,PraatF0,Praat (F0),harmonicity,#11A3FF,3 dB roll-off
12.132382382382382,131.6257576289014,PraatF0,Praat (F0),harmonicity,#11A3FF,3 dB roll-off
12.132882882882884,131.6287551469181,PraatF0,Praat (F0),harmonicity,#11A3FF,3 dB roll-off
12.133383383383384,131.6317364109358,PraatF0,Praat (F0),harmonicity,#11A3FF,3 dB roll-off
12.133883883883884,131.6347154857977,PraatF0,Praat (F0),harmonicity,#11A3FF,3 dB roll-off
12.134384384384385,131.63768340853716,PraatF0,Praat (F0),harmonicity,#11A3FF,3 dB roll-off
12.134884884884885,131.64064946876067,PraatF0,Praat (F0),harmonicity,#11A3FF,3 dB roll-off
12.135385385385385,131.6436527180284,PraatF0,Praat (F0),harmonicity,#11A3FF,3 dB roll-off
12.135885885885886,131.64661430843114,PraatF0,Praat (F0),harmonicity,#11A3FF,3 dB roll-off
12.136386386386386,131.6495815530146,PraatF0,Praat (F0),harmonicity,#11A3FF,3 dB roll-off
12.136886886886886,131.65283988355372,PraatF0,Praat (F0),harmonicity,#11A3FF,3 dB roll-off
12.137387387387387,131.65608262206274,PraatF0,Praat (F0),harmonicity,#11A3FF,3 dB roll-off
12.137887887887889,131.65935210561344,PraatF0,Praat (F0),harmonicity,#11A3FF,3 dB roll-off
12.138388388388389,131.6625816317694,PraatF0,Praat (F0),harmonicity,#11A3FF,3 dB roll-off
12.13888888888889,131.66581494493818,PraatF0,Praat (F0),harmonicity,#11A3FF,3 dB roll-off
12.13938938938939,131.66904110202614,PraatF0,Praat (F0),harmonicity,#11A3FF,3 dB roll-off
12.13988988988989,131.67226259041453,PraatF0,Praat (F0),harmonicity,#11A3FF,3 dB roll-off
12.14039039039039,131.67547612535174,PraatF0,Praat (F0),harmonicity,#11A3FF,3 dB roll-off
12.14089089089089,131.6786832582503,PraatF0,Praat (F0),harmonicity,#11A3FF,3 dB roll-off
12.141391391391391,131.68188310369487,PraatF0,Praat (F0),harmonicity,#11A3FF,3 dB roll-off
12.141891891891891,131.68507724739567,PraatF0,Praat (F0),harmonicity,#11A3FF,3 dB roll-off
12.142392392392392,131.6882677305594,PraatF0,Praat (F0),harmonicity,#11A3FF,3 dB roll-off
12.142892892892894,131.69132947277006,PraatF0,Praat (F0),harmonicity,#11A3FF,3 dB roll-off
12.143393393393394,131.69404368611828,PraatF0,Praat (F0),harmonicity,#11A3FF,3 dB roll-off
12.143893893893894,131.6966872692063,PraatF0,Praat (F0),harmonicity,#11A3FF,3 dB roll-off
12.144394394394395,131.69928562049677,PraatF0,Praat (F0),harmonicity,#11A3FF,3 dB roll-off
12.144894894894895,131.70239472053657,PraatF0,Praat (F0),harmonicity,#11A3FF,3 dB roll-off
12.145395395395395,131.70555607849215,PraatF0,Praat (F0),harmonicity,#11A3FF,3 dB roll-off
12.145895895895896,131.7087233752676,PraatF0,Praat (F0),harmonicity,#11A3FF,3 dB roll-off
12.146396396396396,131.71188913177514,PraatF0,Praat (F0),harmonicity,#11A3FF,3 dB roll-off
12.146896896896896,131.71505933951372,PraatF0,Praat (F0),harmonicity,#11A3FF,3 dB roll-off
12.147397397397397,131.71822589844925,PraatF0,Praat (F0),harmonicity,#11A3FF,3 dB roll-off
12.147897897897899,131.72139407719789,PraatF0,Praat (F0),harmonicity,#11A3FF,3 dB roll-off
12.148398398398399,131.72456150907448,PraatF0,Praat (F0),harmonicity,#11A3FF,3 dB roll-off
12.1488988988989,131.72772982046814,PraatF0,Praat (F0),harmonicity,#11A3FF,3 dB roll-off
12.1493993993994,131.73091502109898,PraatF0,Praat (F0),harmonicity,#11A3FF,3 dB roll-off
12.1498998998999,131.73407233055462,PraatF0,Praat (F0),harmonicity,#11A3FF,3 dB roll-off
12.1504004004004,131.73724276547665,PraatF0,Praat (F0),harmonicity,#11A3FF,3 dB roll-off
12.1509009009009,131.74042324432895,PraatF0,Praat (F0),harmonicity,#11A3FF,3 dB roll-off
12.151401401401401,131.7435944827476,PraatF0,Praat (F0),harmonicity,#11A3FF,3 dB roll-off
12.151901901901901,131.7467662590509,PraatF0,Praat (F0),harmonicity,#11A3FF,3 dB roll-off
12.152402402402402,131.74994126840784,PraatF0,Praat (F0),harmonicity,#11A3FF,3 dB roll-off
12.152902902902904,131.75312811146063,PraatF0,Praat (F0),harmonicity,#11A3FF,3 dB roll-off
12.153403403403404,131.75630783484542,PraatF0,Praat (F0),harmonicity,#11A3FF,3 dB roll-off
12.153903903903904,131.7594907856004,PraatF0,Praat (F0),harmonicity,#11A3FF,3 dB roll-off
12.154404404404405,131.7626688243215,PraatF0,Praat (F0),harmonicity,#11A3FF,3 dB roll-off
12.154904904904905,131.7658567617898,PraatF0,Praat (F0),harmonicity,#11A3FF,3 dB roll-off
12.155405405405405,131.76903678626604,PraatF0,Praat (F0),harmonicity,#11A3FF,3 dB roll-off
12.155905905905906,131.7722229383774,PraatF0,Praat (F0),harmonicity,#11A3FF,3 dB roll-off
12.156406406406406,131.7754021685116,PraatF0,Praat (F0),harmonicity,#11A3FF,3 dB roll-off
12.156906906906906,131.7785896447724,PraatF0,Praat (F0),harmonicity,#11A3FF,3 dB roll-off
12.157407407407407,131.78177750909805,PraatF0,Praat (F0),harmonicity,#11A3FF,3 dB roll-off
12.157907907907909,131.78496590445351,PraatF0,Praat (F0),harmonicity,#11A3FF,3 dB roll-off
12.158408408408409,131.78815346223303,PraatF0,Praat (F0),harmonicity,#11A3FF,3 dB roll-off
12.15890890890891,131.79134557182107,PraatF0,Praat (F0),harmonicity,#11A3FF,3 dB roll-off
12.15940940940941,131.79441781760266,PraatF0,Praat (F0),harmonicity,#11A3FF,3 dB roll-off
12.15990990990991,131.79758903948374,PraatF0,Praat (F0),harmonicity,#11A3FF,3 dB roll-off
12.16041041041041,131.8007666598411,PraatF0,Praat (F0),harmonicity,#11A3FF,3 dB roll-off
12.16091091091091,131.80394527936932,PraatF0,Praat (F0),harmonicity,#11A3FF,3 dB roll-off
12.161411411411411,131.8071334384437,PraatF0,Praat (F0),harmonicity,#11A3FF,3 dB roll-off
12.161911911911911,131.81033694654906,PraatF0,Praat (F0),harmonicity,#11A3FF,3 dB roll-off
12.162412412412412,131.81354713903946,PraatF0,Praat (F0),harmonicity,#11A3FF,3 dB roll-off
12.162912912912914,131.8167699809636,PraatF0,Praat (F0),harmonicity,#11A3FF,3 dB roll-off
12.163413413413414,131.8199897702978,PraatF0,Praat (F0),harmonicity,#11A3FF,3 dB roll-off
12.163913913913914,131.8232122991267,PraatF0,Praat (F0),harmonicity,#11A3FF,3 dB roll-off
12.164414414414415,131.82643195866706,PraatF0,Praat (F0),harmonicity,#11A3FF,3 dB roll-off
12.164914914914915,131.8296660009836,PraatF0,Praat (F0),harmonicity,#11A3FF,3 dB roll-off
12.165415415415415,131.83291102164424,PraatF0,Praat (F0),harmonicity,#11A3FF,3 dB roll-off
12.165915915915916,131.8361194690147,PraatF0,Praat (F0),harmonicity,#11A3FF,3 dB roll-off
12.166416416416416,131.8393228609046,PraatF0,Praat (F0),harmonicity,#11A3FF,3 dB roll-off
12.166916916916916,131.84253217227587,PraatF0,Praat (F0),harmonicity,#11A3FF,3 dB roll-off
12.167417417417417,131.84573426520268,PraatF0,Praat (F0),harmonicity,#11A3FF,3 dB roll-off
12.167917917917919,131.84895150762804,PraatF0,Praat (F0),harmonicity,#11A3FF,3 dB roll-off
12.168418418418419,131.85215619618384,PraatF0,Praat (F0),harmonicity,#11A3FF,3 dB roll-off
12.16891891891892,131.8553657718134,PraatF0,Praat (F0),harmonicity,#11A3FF,3 dB roll-off
12.16941941941942,131.85857323655503,PraatF0,Praat (F0),harmonicity,#11A3FF,3 dB roll-off
12.16991991991992,131.86178781949218,PraatF0,Praat (F0),harmonicity,#11A3FF,3 dB roll-off
12.17042042042042,131.86499374120473,PraatF0,Praat (F0),harmonicity,#11A3FF,3 dB roll-off
12.17092092092092,131.86820889848832,PraatF0,Praat (F0),harmonicity,#11A3FF,3 dB roll-off
12.171421421421421,131.87142391150473,PraatF0,Praat (F0),harmonicity,#11A3FF,3 dB roll-off
12.171921921921921,131.87463148026615,PraatF0,Praat (F0),harmonicity,#11A3FF,3 dB roll-off
12.172422422422422,131.87784623063143,PraatF0,Praat (F0),harmonicity,#11A3FF,3 dB roll-off
12.172922922922924,131.88105366767974,PraatF0,Praat (F0),harmonicity,#11A3FF,3 dB roll-off
12.173423423423424,131.88429356979645,PraatF0,Praat (F0),harmonicity,#11A3FF,3 dB roll-off
12.173923923923924,131.8875221126301,PraatF0,Praat (F0),harmonicity,#11A3FF,3 dB roll-off
12.174424424424425,131.89074555551753,PraatF0,Praat (F0),harmonicity,#11A3FF,3 dB roll-off
12.174924924924925,131.89397619808767,PraatF0,Praat (F0),harmonicity,#11A3FF,3 dB roll-off
12.175425425425425,131.89720492336193,PraatF0,Praat (F0),harmonicity,#11A3FF,3 dB roll-off
12.175925925925926,131.9004332237223,PraatF0,Praat (F0),harmonicity,#11A3FF,3 dB roll-off
12.176426426426426,131.90366113442627,PraatF0,Praat (F0),harmonicity,#11A3FF,3 dB roll-off
12.176926926926926,131.90688904075753,PraatF0,Praat (F0),harmonicity,#11A3FF,3 dB roll-off
12.177427427427427,131.91011792834274,PraatF0,Praat (F0),harmonicity,#11A3FF,3 dB roll-off
12.177927927927929,131.9133524528629,PraatF0,Praat (F0),harmonicity,#11A3FF,3 dB roll-off
12.178428428428429,131.91657915207605,PraatF0,Praat (F0),harmonicity,#11A3FF,3 dB roll-off
12.17892892892893,131.91981694622183,PraatF0,Praat (F0),harmonicity,#11A3FF,3 dB roll-off
12.17942942942943,131.9230449737201,PraatF0,Praat (F0),harmonicity,#11A3FF,3 dB roll-off
12.17992992992993,131.92616709001697,PraatF0,Praat (F0),harmonicity,#11A3FF,3 dB roll-off
12.18043043043043,131.9291026772823,PraatF0,Praat (F0),harmonicity,#11A3FF,3 dB roll-off
12.18093093093093,131.93202811485637,PraatF0,Praat (F0),harmonicity,#11A3FF,3 dB roll-off
12.181431431431431,131.9349844544941,PraatF0,Praat (F0),harmonicity,#11A3FF,3 dB roll-off
12.181931931931931,131.93825687591882,PraatF0,Praat (F0),harmonicity,#11A3FF,3 dB roll-off
12.182432432432432,131.9414527056867,PraatF0,Praat (F0),harmonicity,#11A3FF,3 dB roll-off
12.182932932932934,131.94465377603535,PraatF0,Praat (F0),harmonicity,#11A3FF,3 dB roll-off
12.183433433433434,131.94785805082785,PraatF0,Praat (F0),harmonicity,#11A3FF,3 dB roll-off
12.183933933933934,131.95107872935566,PraatF0,Praat (F0),harmonicity,#11A3FF,3 dB roll-off
12.184434434434435,131.95429674535228,PraatF0,Praat (F0),harmonicity,#11A3FF,3 dB roll-off
12.184934934934935,131.95751993452396,PraatF0,Praat (F0),harmonicity,#11A3FF,3 dB roll-off
12.185435435435435,131.960747983289,PraatF0,Praat (F0),harmonicity,#11A3FF,3 dB roll-off
12.185935935935936,131.96398374082221,PraatF0,Praat (F0),harmonicity,#11A3FF,3 dB roll-off
12.186436436436436,131.96721953699623,PraatF0,Praat (F0),harmonicity,#11A3FF,3 dB roll-off
12.186936936936936,131.97046572304123,PraatF0,Praat (F0),harmonicity,#11A3FF,3 dB roll-off
12.187437437437438,131.97371199681004,PraatF0,Praat (F0),harmonicity,#11A3FF,3 dB roll-off
12.187937937937939,131.97696693335791,PraatF0,Praat (F0),harmonicity,#11A3FF,3 dB roll-off
12.188438438438439,131.98019045983668,PraatF0,Praat (F0),harmonicity,#11A3FF,3 dB roll-off
12.18893893893894,131.98340645977214,PraatF0,Praat (F0),harmonicity,#11A3FF,3 dB roll-off
12.18943943943944,131.9866239149021,PraatF0,Praat (F0),harmonicity,#11A3FF,3 dB roll-off
12.18993993993994,131.98984353856005,PraatF0,Praat (F0),harmonicity,#11A3FF,3 dB roll-off
12.19044044044044,131.99306406531886,PraatF0,Praat (F0),harmonicity,#11A3FF,3 dB roll-off
12.19094094094094,131.9962933247289,PraatF0,Praat (F0),harmonicity,#11A3FF,3 dB roll-off
12.191441441441441,131.99952040877272,PraatF0,Praat (F0),harmonicity,#11A3FF,3 dB roll-off
12.191941941941941,132.0027548537072,PraatF0,Praat (F0),harmonicity,#11A3FF,3 dB roll-off
12.192442442442442,132.00598602484143,PraatF0,Praat (F0),harmonicity,#11A3FF,3 dB roll-off
12.192942942942944,132.00922679348986,PraatF0,Praat (F0),harmonicity,#11A3FF,3 dB roll-off
12.193443443443444,132.01246569120136,PraatF0,Praat (F0),harmonicity,#11A3FF,3 dB roll-off
12.193943943943944,132.01571664876133,PraatF0,Praat (F0),harmonicity,#11A3FF,3 dB roll-off
12.194444444444445,132.01895115441815,PraatF0,Praat (F0),harmonicity,#11A3FF,3 dB roll-off
12.194944944944945,132.0222069534638,PraatF0,Praat (F0),harmonicity,#11A3FF,3 dB roll-off
12.195445445445445,132.02545540959989,PraatF0,Praat (F0),harmonicity,#11A3FF,3 dB roll-off
12.195945945945946,132.02875377449004,PraatF0,Praat (F0),harmonicity,#11A3FF,3 dB roll-off
12.196446446446446,132.0321508252598,PraatF0,Praat (F0),harmonicity,#11A3FF,3 dB roll-off
12.196946946946946,132.03557776583426,PraatF0,Praat (F0),harmonicity,#11A3FF,3 dB roll-off
12.197447447447448,132.0390132338493,PraatF0,Praat (F0),harmonicity,#11A3FF,3 dB roll-off
12.197947947947949,132.04244245979726,PraatF0,Praat (F0),harmonicity,#11A3FF,3 dB roll-off
12.198448448448449,132.04587905966739,PraatF0,Praat (F0),harmonicity,#11A3FF,3 dB roll-off
12.19894894894895,132.04933223946836,PraatF0,Praat (F0),harmonicity,#11A3FF,3 dB roll-off
12.19944944944945,132.05277823742904,PraatF0,Praat (F0),harmonicity,#11A3FF,3 dB roll-off
12.19994994994995,132.0562451029603,PraatF0,Praat (F0),harmonicity,#11A3FF,3 dB roll-off
12.20045045045045,132.05944995426125,PraatF0,Praat (F0),harmonicity,#11A3FF,3 dB roll-off
12.20095095095095,132.06266719161346,PraatF0,Praat (F0),harmonicity,#11A3FF,3 dB roll-off
12.201451451451451,132.06588198671,PraatF0,Praat (F0),harmonicity,#11A3FF,3 dB roll-off
12.201951951951951,132.06910094678523,PraatF0,Praat (F0),harmonicity,#11A3FF,3 dB roll-off
12.202452452452452,132.07231590206885,PraatF0,Praat (F0),harmonicity,#11A3FF,3 dB roll-off
12.202952952952954,132.07546430890943,PraatF0,Praat (F0),harmonicity,#11A3FF,3 dB roll-off
12.203453453453454,132.07861102351347,PraatF0,Praat (F0),harmonicity,#11A3FF,3 dB roll-off
12.203953953953954,132.08176669704568,PraatF0,Praat (F0),harmonicity,#11A3FF,3 dB roll-off
12.204454454454455,132.08502270109653,PraatF0,Praat (F0),harmonicity,#11A3FF,3 dB roll-off
12.204954954954955,132.08834991522568,PraatF0,Praat (F0),harmonicity,#11A3FF,3 dB roll-off
12.205455455455455,132.09167650250032,PraatF0,Praat (F0),harmonicity,#11A3FF,3 dB roll-off
12.205955955955956,132.0950086123517,PraatF0,Praat (F0),harmonicity,#11A3FF,3 dB roll-off
12.206456456456456,132.0983380807542,PraatF0,Praat (F0),harmonicity,#11A3FF,3 dB roll-off
12.206956956956956,132.10167534125367,PraatF0,Praat (F0),harmonicity,#11A3FF,3 dB roll-off
12.207457457457458,132.1050077462375,PraatF0,Praat (F0),harmonicity,#11A3FF,3 dB roll-off
12.207957957957959,132.10834180305397,PraatF0,Praat (F0),harmonicity,#11A3FF,3 dB roll-off
12.208458458458459,132.11168013868928,PraatF0,Praat (F0),harmonicity,#11A3FF,3 dB roll-off
12.20895895895896,132.1150138365731,PraatF0,Praat (F0),harmonicity,#11A3FF,3 dB roll-off
12.20945945945946,132.11835140879003,PraatF0,Praat (F0),harmonicity,#11A3FF,3 dB roll-off
12.20995995995996,132.1216838867912,PraatF0,Praat (F0),harmonicity,#11A3FF,3 dB roll-off
12.21046046046046,132.1250226247392,PraatF0,Praat (F0),harmonicity,#11A3FF,3 dB roll-off
12.21096096096096,132.12821937462326,PraatF0,Praat (F0),harmonicity,#11A3FF,3 dB roll-off
12.211461461461461,132.13142987904894,PraatF0,Praat (F0),harmonicity,#11A3FF,3 dB roll-off
12.211961961961961,132.13462886975296,PraatF0,Praat (F0),harmonicity,#11A3FF,3 dB roll-off
12.212462462462462,132.13783571355424,PraatF0,Praat (F0),harmonicity,#11A3FF,3 dB roll-off
12.212962962962964,132.14104215955498,PraatF0,Praat (F0),harmonicity,#11A3FF,3 dB roll-off
12.213463463463464,132.14424889785153,PraatF0,Praat (F0),harmonicity,#11A3FF,3 dB roll-off
12.213963963963964,132.14746600454936,PraatF0,Praat (F0),harmonicity,#11A3FF,3 dB roll-off
12.214464464464465,132.1506737502849,PraatF0,Praat (F0),harmonicity,#11A3FF,3 dB roll-off
12.214964964964965,132.15389454754342,PraatF0,Praat (F0),harmonicity,#11A3FF,3 dB roll-off
12.215465465465465,132.1571152087539,PraatF0,Praat (F0),harmonicity,#11A3FF,3 dB roll-off
12.215965965965966,132.16033927814118,PraatF0,Praat (F0),harmonicity,#11A3FF,3 dB roll-off
12.216466466466466,132.16356226715834,PraatF0,Praat (F0),harmonicity,#11A3FF,3 dB roll-off
12.216966966966966,132.16679288162499,PraatF0,Praat (F0),harmonicity,#11A3FF,3 dB roll-off
12.217467467467468,132.1700290754161,PraatF0,Praat (F0),harmonicity,#11A3FF,3 dB roll-off
12.217967967967969,132.17308943842235,PraatF0,Praat (F0),harmonicity,#11A3FF,3 dB roll-off
12.218468468468469,132.1764013700099,PraatF0,Praat (F0),harmonicity,#11A3FF,3 dB roll-off
12.21896896896897,132.1797140541259,PraatF0,Praat (F0),harmonicity,#11A3FF,3 dB roll-off
12.21946946946947,132.18307204415595,PraatF0,Praat (F0),harmonicity,#11A3FF,3 dB roll-off
12.21996996996997,132.18645625747524,PraatF0,Praat (F0),harmonicity,#11A3FF,3 dB roll-off
12.22047047047047,132.18984333415824,PraatF0,Praat (F0),harmonicity,#11A3FF,3 dB roll-off
12.22097097097097,132.19323023199013,PraatF0,Praat (F0),harmonicity,#11A3FF,3 dB roll-off
12.221471471471471,132.19662448786283,PraatF0,Praat (F0),harmonicity,#11A3FF,3 dB roll-off
12.221971971971971,132.2000181268174,PraatF0,Praat (F0),harmonicity,#11A3FF,3 dB roll-off
12.222472472472472,132.20341077281273,PraatF0,Praat (F0),harmonicity,#11A3FF,3 dB roll-off
12.222972972972974,132.20680837554187,PraatF0,Praat (F0),harmonicity,#11A3FF,3 dB roll-off
12.223473473473474,132.21020441923685,PraatF0,Praat (F0),harmonicity,#11A3FF,3 dB roll-off
12.223973973973974,132.2135995502137,PraatF0,Praat (F0),harmonicity,#11A3FF,3 dB roll-off
12.224474474474475,132.21699806317872,PraatF0,Praat (F0),harmonicity,#11A3FF,3 dB roll-off
12.224974974974975,132.22039569254167,PraatF0,Praat (F0),harmonicity,#11A3FF,3 dB roll-off
12.225475475475475,132.2237947728206,PraatF0,Praat (F0),harmonicity,#11A3FF,3 dB roll-off
12.225975975975976,132.2271946499281,PraatF0,Praat (F0),harmonicity,#11A3FF,3 dB roll-off
12.226476476476476,132.23059471676197,PraatF0,Praat (F0),harmonicity,#11A3FF,3 dB roll-off
12.226976976976976,132.23399851748735,PraatF0,Praat (F0),harmonicity,#11A3FF,3 dB roll-off
12.227477477477478,132.2373913841168,PraatF0,Praat (F0),harmonicity,#11A3FF,3 dB roll-off
12.227977977977979,132.24079210153076,PraatF0,Praat (F0),harmonicity,#11A3FF,3 dB roll-off
12.228478478478479,132.24418966367085,PraatF0,Praat (F0),harmonicity,#11A3FF,3 dB roll-off
12.22897897897898,132.247527074156,PraatF0,Praat (F0),harmonicity,#11A3FF,3 dB roll-off
12.22947947947948,132.25083147875432,PraatF0,Praat (F0),harmonicity,#11A3FF,3 dB roll-off
12.22997997997998,132.25413943378425,PraatF0,Praat (F0),harmonicity,#11A3FF,3 dB roll-off
12.23048048048048,132.25744023112662,PraatF0,Praat (F0),harmonicity,#11A3FF,3 dB roll-off
12.23098098098098,132.2607518865714,PraatF0,Praat (F0),harmonicity,#11A3FF,3 dB roll-off
12.231481481481481,132.26406073850225,PraatF0,Praat (F0),harmonicity,#11A3FF,3 dB roll-off
12.231981981981981,132.2673700646464,PraatF0,Praat (F0),harmonicity,#11A3FF,3 dB roll-off
12.232482482482482,132.27068656799372,PraatF0,Praat (F0),harmonicity,#11A3FF,3 dB roll-off
12.232982982982984,132.27399987899346,PraatF0,Praat (F0),harmonicity,#11A3FF,3 dB roll-off
12.233483483483484,132.27731857258598,PraatF0,Praat (F0),harmonicity,#11A3FF,3 dB roll-off
12.233983983983984,132.28064047953055,PraatF0,Praat (F0),harmonicity,#11A3FF,3 dB roll-off
12.234484484484485,132.28396382175615,PraatF0,Praat (F0),harmonicity,#11A3FF,3 dB roll-off
12.234984984984985,132.28743284695793,PraatF0,Praat (F0),harmonicity,#11A3FF,3 dB roll-off
12.235485485485485,132.29092958429607,PraatF0,Praat (F0),harmonicity,#11A3FF,3 dB roll-off
12.235985985985986,132.29442899795555,PraatF0,Praat (F0),harmonicity,#11A3FF,3 dB roll-off
12.236486486486486,132.29793165306592,PraatF0,Praat (F0),harmonicity,#11A3FF,3 dB roll-off
12.236986986986986,132.30143270398074,PraatF0,Praat (F0),harmonicity,#11A3FF,3 dB roll-off
12.237487487487488,132.30479850181268,PraatF0,Praat (F0),harmonicity,#11A3FF,3 dB roll-off
12.237987987987989,132.30815442197758,PraatF0,Praat (F0),harmonicity,#11A3FF,3 dB roll-off
12.238488488488489,132.3115122698747,PraatF0,Praat (F0),harmonicity,#11A3FF,3 dB roll-off
12.23898898898899,132.31486317309418,PraatF0,Praat (F0),harmonicity,#11A3FF,3 dB roll-off
12.23948948948949,132.31822433714234,PraatF0,Praat (F0),harmonicity,#11A3FF,3 dB roll-off
12.23998998998999,132.32158525681928,PraatF0,Praat (F0),harmonicity,#11A3FF,3 dB roll-off
12.24049049049049,132.3249466726062,PraatF0,Praat (F0),harmonicity,#11A3FF,3 dB roll-off
12.24099099099099,132.32831070780972,PraatF0,Praat (F0),harmonicity,#11A3FF,3 dB roll-off
12.241491491491491,132.3316816844669,PraatF0,Praat (F0),harmonicity,#11A3FF,3 dB roll-off
12.241991991991991,132.3350538674037,PraatF0,Praat (F0),harmonicity,#11A3FF,3 dB roll-off
12.242492492492492,132.33844817001898,PraatF0,Praat (F0),harmonicity,#11A3FF,3 dB roll-off
12.242992992992994,132.34181046467626,PraatF0,Praat (F0),harmonicity,#11A3FF,3 dB roll-off
12.243493493493494,132.34518642971221,PraatF0,Praat (F0),harmonicity,#11A3FF,3 dB roll-off
12.243993993993994,132.34856030361345,PraatF0,Praat (F0),harmonicity,#11A3FF,3 dB roll-off
12.244494494494495,132.3519354097707,PraatF0,Praat (F0),harmonicity,#11A3FF,3 dB roll-off
12.244994994994995,132.35531068552405,PraatF0,Praat (F0),harmonicity,#11A3FF,3 dB roll-off
12.245495495495495,132.35869473400754,PraatF0,Praat (F0),harmonicity,#11A3FF,3 dB roll-off
12.245995995995996,132.36206495474005,PraatF0,Praat (F0),harmonicity,#11A3FF,3 dB roll-off
12.246496496496496,132.36542791564005,PraatF0,Praat (F0),harmonicity,#11A3FF,3 dB roll-off
12.246996996996996,132.3688113901969,PraatF0,Praat (F0),harmonicity,#11A3FF,3 dB roll-off
12.247497497497498,132.37219887619187,PraatF0,Praat (F0),harmonicity,#11A3FF,3 dB roll-off
12.247997997997999,132.3755880368246,PraatF0,Praat (F0),harmonicity,#11A3FF,3 dB roll-off
12.248498498498499,132.37898669160725,PraatF0,Praat (F0),harmonicity,#11A3FF,3 dB roll-off
12.248998998999,132.38238319751656,PraatF0,Praat (F0),harmonicity,#11A3FF,3 dB roll-off
12.2494994994995,132.38577717575208,PraatF0,Praat (F0),harmonicity,#11A3FF,3 dB roll-off
12.25,132.38916938301722,PraatF0,Praat (F0),harmonicity,#11A3FF,3 dB roll-off
