interval,output,model_id,model_label,model_theory,model_colour,timbre_label
11.75,0.7311855812961088,Milne13,Milne (2013),harmonicity,#11A3FF,12 dB roll-off
11.7505005005005,0.7314671207764747,Milne13,Milne (2013),harmonicity,#11A3FF,12 dB roll-off
11.751001001001,0.7317526467412543,Milne13,Milne (2013),harmonicity,#11A3FF,12 dB roll-off
11.751501501501501,0.732042211823567,Milne13,Milne (2013),harmonicity,#11A3FF,12 dB roll-off
11.752002002002001,0.7323358689830921,Milne13,Milne (2013),harmonicity,#11A3FF,12 dB roll-off
11.752502502502503,0.7326336714918733,Milne13,Milne (2013),harmonicity,#11A3FF,12 dB roll-off
11.753003003003004,0.7329356729193858,Milne13,Milne (2013),harmonicity,#11A3FF,12 dB roll-off
11.753503503503504,0.7332419271168825,Milne13,Milne (2013),harmonicity,#11A3FF,12 dB roll-off
11.754004004004004,0.733552488200969,Milne13,Milne (2013),harmonicity,#11A3FF,12 dB roll-off
11.754504504504505,0.7338674105364155,Milne13,Milne (2013),harmonicity,#11A3FF,12 dB roll-off
11.755005005005005,0.7341867487181858,Milne13,Milne (2013),harmonicity,#11A3FF,12 dB roll-off
11.755505505505505,0.7345105575526764,Milne13,Milne (2013),harmonicity,#11A3FF,12 dB roll-off
11.756006006006006,0.7348388920381402,Milne13,Milne (2013),harmonicity,#11A3FF,12 dB roll-off
11.756506506506506,0.7351718073443022,Milne13,Milne (2013),harmonicity,#11A3FF,12 dB roll-off
11.757007007007006,0.7355093587911445,Milne13,Milne (2013),harmonicity,#11A3FF,12 dB roll-off
11.757507507507508,0.7358516018268465,Milne13,Milne (2013),harmonicity,#11A3FF,12 dB roll-off
11.758008008008009,0.7361985920048837,Milne13,Milne (2013),harmonicity,#11A3FF,12 dB roll-off
11.758508508508509,0.7365503849602743,Milne13,Milne (2013),harmonicity,#11A3FF,12 dB roll-off
11.75900900900901,0.7369070363849538,Milne13,Milne (2013),harmonicity,#11A3FF,12 dB roll-off
11.75950950950951,0.7372686020022823,Milne13,Milne (2013),harmonicity,#11A3FF,12 dB roll-off
11.76001001001001,0.7376351375406769,Milne13,Milne (2013),harmonicity,#11A3FF,12 dB roll-off
11.76051051051051,0.738006698706366,Milne13,Milne (2013),harmonicity,#11A3FF,12 dB roll-off
11.76101101101101,0.7383833411552553,Milne13,Milne (2013),harmonicity,#11A3FF,12 dB roll-off
11.761511511511511,0.7387651204639084,Milne13,Milne (2013),harmonicity,#11A3FF,12 dB roll-off
11.762012012012011,0.7391520920996426,Milne13,Milne (2013),harmonicity,#11A3FF,12 dB roll-off
11.762512512512513,0.7395443113897365,Milne13,Milne (2013),harmonicity,#11A3FF,12 dB roll-off
11.763013013013014,0.7399418334897497,Milne13,Milne (2013),harmonicity,#11A3FF,12 dB roll-off
11.763513513513514,0.7403447133509617,Milne13,Milne (2013),harmonicity,#11A3FF,12 dB roll-off
11.764014014014014,0.7407530056869334,Milne13,Milne (2013),harmonicity,#11A3FF,12 dB roll-off
11.764514514514515,0.7411667649391923,Milne13,Milne (2013),harmonicity,#11A3FF,12 dB roll-off
11.765015015015015,0.741586045242056,Milne13,Milne (2013),harmonicity,#11A3FF,12 dB roll-off
11.765515515515515,0.7420109003865963,Milne13,Milne (2013),harmonicity,#11A3FF,12 dB roll-off
11.766016016016016,0.742441383783765,Milne13,Milne (2013),harmonicity,#11A3FF,12 dB roll-off
11.766516516516516,0.7428775484266747,Milne13,Milne (2013),harmonicity,#11A3FF,12 dB roll-off
11.767017017017016,0.7433194468520745,Milne13,Milne (2013),harmonicity,#11A3FF,12 dB roll-off
11.767517517517518,0.743767131101013,Milne13,Milne (2013),harmonicity,#11A3FF,12 dB roll-off
11.768018018018019,0.7442206526787233,Milne13,Milne (2013),harmonicity,#11A3FF,12 dB roll-off
11.768518518518519,0.7446800625137401,Milne13,Milne (2013),harmonicity,#11A3FF,12 dB roll-off
11.76901901901902,0.7451454109162742,Milne13,Milne (2013),harmonicity,#11A3FF,12 dB roll-off
11.76951951951952,0.7456167475358711,Milne13,Milne (2013),harmonicity,#11A3FF,12 dB roll-off
11.77002002002002,0.7460941213183777,Milne13,Milne (2013),harmonicity,#11A3FF,12 dB roll-off
11.77052052052052,0.7465775804622368,Milne13,Milne (2013),harmonicity,#11A3FF,12 dB roll-off
11.77102102102102,0.7470671723741545,Milne13,Milne (2013),harmonicity,#11A3FF,12 dB roll-off
11.771521521521521,0.747562943624167,Milne13,Milne (2013),harmonicity,#11A3FF,12 dB roll-off
11.772022022022021,0.7480649399001323,Milne13,Milne (2013),harmonicity,#11A3FF,12 dB roll-off
11.772522522522523,0.7485732059616981,Milne13,Milne (2013),harmonicity,#11A3FF,12 dB roll-off
11.773023023023024,0.7490877855937685,Milne13,Milne (2013),harmonicity,#11A3FF,12 dB roll-off
11.773523523523524,0.749608721559537,Milne13,Milne (2013),harmonicity,#11A3FF,12 dB roll-off
11.774024024024024,0.7501360555530906,Milne13,Milne (2013),harmonicity,#11A3FF,12 dB roll-off
11.774524524524525,0.7506698281516629,Milne13,Milne (2013),harmonicity,#11A3FF,12 dB roll-off
11.775025025025025,0.7512100787675696,Milne13,Milne (2013),harmonicity,#11A3FF,12 dB roll-off
11.775525525525525,0.7517568455998817,Milne13,Milne (2013),harmonicity,#11A3FF,12 dB roll-off
11.776026026026026,0.7523101655858752,Milne13,Milne (2013),harmonicity,#11A3FF,12 dB roll-off
11.776526526526526,0.7528700743523308,Milne13,Milne (2013),harmonicity,#11A3FF,12 dB roll-off
11.777027027027026,0.7534366061667265,Milne13,Milne (2013),harmonicity,#11A3FF,12 dB roll-off
11.777527527527528,0.7540097938883791,Milne13,Milne (2013),harmonicity,#11A3FF,12 dB roll-off
11.778028028028029,0.754589668919605,Milne13,Milne (2013),harmonicity,#11A3FF,12 dB roll-off
11.778528528528529,0.7551762611569498,Milne13,Milne (2013),harmonicity,#11A3FF,12 dB roll-off
11.77902902902903,0.755769598942565,Milne13,Milne (2013),harmonicity,#11A3FF,12 dB roll-off
11.77952952952953,0.7563697090157742,Milne13,Milne (2013),harmonicity,#11A3FF,12 dB roll-off
11.78003003003003,0.7569766164649203,Milne13,Milne (2013),harmonicity,#11A3FF,12 dB roll-off
11.78053053053053,0.7575903446795484,Milne13,Milne (2013),harmonicity,#11A3FF,12 dB roll-off
11.78103103103103,0.7582109153029929,Milne13,Milne (2013),harmonicity,#11A3FF,12 dB roll-off
11.781531531531531,0.7588383481854445,Milne13,Milne (2013),harmonicity,#11A3FF,12 dB roll-off
11.782032032032031,0.7594726613375713,Milne13,Milne (2013),harmonicity,#11A3FF,12 dB roll-off
11.782532532532533,0.7601138708847595,Milne13,Milne (2013),harmonicity,#11A3FF,12 dB roll-off
11.783033033033034,0.7607619910220478,Milne13,Milne (2013),harmonicity,#11A3FF,12 dB roll-off
11.783533533533534,0.7614170339698506,Milne13,Milne (2013),harmonicity,#11A3FF,12 dB roll-off
11.784034034034034,0.7620790099305137,Milne13,Milne (2013),harmonicity,#11A3FF,12 dB roll-off
11.784534534534535,0.7627479270458009,Milne13,Milne (2013),harmonicity,#11A3FF,12 dB roll-off
11.785035035035035,0.7634237913553782,Milne13,Milne (2013),harmonicity,#11A3FF,12 dB roll-off
11.785535535535535,0.7641066067563826,Milne13,Milne (2013),harmonicity,#11A3FF,12 dB roll-off
11.786036036036036,0.7647963749641379,Milne13,Milne (2013),harmonicity,#11A3FF,12 dB roll-off
11.786536536536536,0.7654930954741025,Milne13,Milne (2013),harmonicity,#11A3FF,12 dB roll-off
11.787037037037036,0.7661967655251226,Milne13,Milne (2013),harmonicity,#11A3FF,12 dB roll-off
11.787537537537538,0.7669073800640781,Milne13,Milne (2013),harmonicity,#11A3FF,12 dB roll-off
11.788038038038039,0.7676249317119567,Milne13,Milne (2013),harmonicity,#11A3FF,12 dB roll-off
11.788538538538539,0.7683494107314978,Milne13,Milne (2013),harmonicity,#11A3FF,12 dB roll-off
11.78903903903904,0.7690808049964076,Milne13,Milne (2013),harmonicity,#11A3FF,12 dB roll-off
11.78953953953954,0.7698190999622568,Milne13,Milne (2013),harmonicity,#11A3FF,12 dB roll-off
11.79004004004004,0.7705642786391311,Milne13,Milne (2013),harmonicity,#11A3FF,12 dB roll-off
11.79054054054054,0.7713163215660822,Milne13,Milne (2013),harmonicity,#11A3FF,12 dB roll-off
11.79104104104104,0.7720752067874602,Milne13,Milne (2013),harmonicity,#11A3FF,12 dB roll-off
11.791541541541541,0.772840909831193,Milne13,Milne (2013),harmonicity,#11A3FF,12 dB roll-off
11.792042042042041,0.7736134036890578,Milne13,Milne (2013),harmonicity,#11A3FF,12 dB roll-off
11.792542542542543,0.7743926587990305,Milne13,Milne (2013),harmonicity,#11A3FF,12 dB roll-off
11.793043043043044,0.7751786430297349,Milne13,Milne (2013),harmonicity,#11A3FF,12 dB roll-off
11.793543543543544,0.7759713216670832,Milne13,Milne (2013),harmonicity,#11A3FF,12 dB roll-off
11.794044044044044,0.7767706574031266,Milne13,Milne (2013),harmonicity,#11A3FF,12 dB roll-off
11.794544544544545,0.7775766103271826,Milne13,Milne (2013),harmonicity,#11A3FF,12 dB roll-off
11.795045045045045,0.778389137919264,Milne13,Milne (2013),harmonicity,#11A3FF,12 dB roll-off
11.795545545545545,0.7792081950458788,Milne13,Milne (2013),harmonicity,#11A3FF,12 dB roll-off
11.796046046046046,0.7800337339582066,Milne13,Milne (2013),harmonicity,#11A3FF,12 dB roll-off
11.796546546546546,0.7808657042927039,Milne13,Milne (2013),harmonicity,#11A3FF,12 dB roll-off
11.797047047047046,0.7817040530741509,Milne13,Milne (2013),harmonicity,#11A3FF,12 dB roll-off
11.797547547547548,0.7825487247211911,Milne13,Milne (2013),harmonicity,#11A3FF,12 dB roll-off
11.798048048048049,0.7833996610543383,Milne13,Milne (2013),harmonicity,#11A3FF,12 dB roll-off
11.798548548548549,0.7842568013065239,Milne13,Milne (2013),harmonicity,#11A3FF,12 dB roll-off
11.79904904904905,0.7851200821361485,Milne13,Milne (2013),harmonicity,#11A3FF,12 dB roll-off
11.79954954954955,0.7859894376426517,Milne13,Milne (2013),harmonicity,#11A3FF,12 dB roll-off
11.80005005005005,0.7868647993846358,Milne13,Milne (2013),harmonicity,#11A3FF,12 dB roll-off
11.80055055055055,0.7877460964004995,Milne13,Milne (2013),harmonicity,#11A3FF,12 dB roll-off
11.80105105105105,0.7886332552315921,Milne13,Milne (2013),harmonicity,#11A3FF,12 dB roll-off
11.801551551551551,0.7895261999478792,Milne13,Milne (2013),harmonicity,#11A3FF,12 dB roll-off
11.802052052052051,0.7904248521760976,Milne13,Milne (2013),harmonicity,#11A3FF,12 dB roll-off
11.802552552552553,0.791329131130374,Milne13,Milne (2013),harmonicity,#11A3FF,12 dB roll-off
11.803053053053054,0.7922389536452775,Milne13,Milne (2013),harmonicity,#11A3FF,12 dB roll-off
11.803553553553554,0.7931542342113094,Milne13,Milne (2013),harmonicity,#11A3FF,12 dB roll-off
11.804054054054054,0.7940748850127342,Milne13,Milne (2013),harmonicity,#11A3FF,12 dB roll-off
11.804554554554555,0.7950008159677625,Milne13,Milne (2013),harmonicity,#11A3FF,12 dB roll-off
11.805055055055055,0.7959319347710151,Milne13,Milne (2013),harmonicity,#11A3FF,12 dB roll-off
11.805555555555555,0.796868146938228,Milne13,Milne (2013),harmonicity,#11A3FF,12 dB roll-off
11.806056056056056,0.7978093558531386,Milne13,Milne (2013),harmonicity,#11A3FF,12 dB roll-off
11.806556556556556,0.7987554628165026,Milne13,Milne (2013),harmonicity,#11A3FF,12 dB roll-off
11.807057057057056,0.7997063670971679,Milne13,Milne (2013),harmonicity,#11A3FF,12 dB roll-off
11.807557557557558,0.8006619659851569,Milne13,Milne (2013),harmonicity,#11A3FF,12 dB roll-off
11.808058058058059,0.8016221548466532,Milne13,Milne (2013),harmonicity,#11A3FF,12 dB roll-off
11.808558558558559,0.8025868271808819,Milne13,Milne (2013),harmonicity,#11A3FF,12 dB roll-off
11.80905905905906,0.8035558746787237,Milne13,Milne (2013),harmonicity,#11A3FF,12 dB roll-off
11.80955955955956,0.8045291872830493,Milne13,Milne (2013),harmonicity,#11A3FF,12 dB roll-off
11.81006006006006,0.8055066532506656,Milne13,Milne (2013),harmonicity,#11A3FF,12 dB roll-off
11.81056056056056,0.806488159215782,Milne13,Milne (2013),harmonicity,#11A3FF,12 dB roll-off
11.81106106106106,0.8074735902549132,Milne13,Milne (2013),harmonicity,#11A3FF,12 dB roll-off
11.811561561561561,0.8084628299531383,Milne13,Milne (2013),harmonicity,#11A3FF,12 dB roll-off
11.812062062062061,0.8094557604716054,Milne13,Milne (2013),harmonicity,#11A3FF,12 dB roll-off
11.812562562562563,0.8104522626161965,Milne13,Milne (2013),harmonicity,#11A3FF,12 dB roll-off
11.813063063063064,0.811452215907243,Milne13,Milne (2013),harmonicity,#11A3FF,12 dB roll-off
11.813563563563564,0.8124554986502275,Milne13,Milne (2013),harmonicity,#11A3FF,12 dB roll-off
11.814064064064064,0.8134619880073238,Milne13,Milne (2013),harmonicity,#11A3FF,12 dB roll-off
11.814564564564565,0.8144715600697113,Milne13,Milne (2013),harmonicity,#11A3FF,12 dB roll-off
11.815065065065065,0.8154840899305427,Milne13,Milne (2013),harmonicity,#11A3FF,12 dB roll-off
11.815565565565565,0.8164994517584779,Milne13,Milne (2013),harmonicity,#11A3FF,12 dB roll-off
11.816066066066066,0.8175175188716701,Milne13,Milne (2013),harmonicity,#11A3FF,12 dB roll-off
11.816566566566566,0.8185381638121058,Milne13,Milne (2013),harmonicity,#11A3FF,12 dB roll-off
11.817067067067066,0.8195612584202032,Milne13,Milne (2013),harmonicity,#11A3FF,12 dB roll-off
11.817567567567568,0.820586673909561,Milne13,Milne (2013),harmonicity,#11A3FF,12 dB roll-off
11.818068068068069,0.8216142809417409,Milne13,Milne (2013),harmonicity,#11A3FF,12 dB roll-off
11.818568568568569,0.822643949701043,Milne13,Milne (2013),harmonicity,#11A3FF,12 dB roll-off
11.81906906906907,0.8236755499691001,Milne13,Milne (2013),harmonicity,#11A3FF,12 dB roll-off
11.81956956956957,0.8247089511992397,Milne13,Milne (2013),harmonicity,#11A3FF,12 dB roll-off
11.82007007007007,0.825744022590513,Milne13,Milne (2013),harmonicity,#11A3FF,12 dB roll-off
11.82057057057057,0.8267806331612932,Milne13,Milne (2013),harmonicity,#11A3FF,12 dB roll-off
11.82107107107107,0.8278186518223458,Milne13,Milne (2013),harmonicity,#11A3FF,12 dB roll-off
11.821571571571571,0.8288579474493021,Milne13,Milne (2013),harmonicity,#11A3FF,12 dB roll-off
11.822072072072071,0.8298983889544178,Milne13,Milne (2013),harmonicity,#11A3FF,12 dB roll-off
11.822572572572573,0.8309398453575738,Milne13,Milne (2013),harmonicity,#11A3FF,12 dB roll-off
11.823073073073074,0.8319821858563863,Milne13,Milne (2013),harmonicity,#11A3FF,12 dB roll-off
11.823573573573574,0.8330252798954129,Milne13,Milne (2013),harmonicity,#11A3FF,12 dB roll-off
11.824074074074074,0.8340689972343184,Milne13,Milne (2013),harmonicity,#11A3FF,12 dB roll-off
11.824574574574575,0.835113208014956,Milne13,Milne (2013),harmonicity,#11A3FF,12 dB roll-off
11.825075075075075,0.8361577828273042,Milne13,Milne (2013),harmonicity,#11A3FF,12 dB roll-off
11.825575575575575,0.8372025927741722,Milne13,Milne (2013),harmonicity,#11A3FF,12 dB roll-off
11.826076076076076,0.8382475095346272,Milne13,Milne (2013),harmonicity,#11A3FF,12 dB roll-off
11.826576576576576,0.8392924054260754,Milne13,Milne (2013),harmonicity,#11A3FF,12 dB roll-off
11.827077077077076,0.8403371534649493,Milne13,Milne (2013),harmonicity,#11A3FF,12 dB roll-off
11.827577577577578,0.8413816274259479,Milne13,Milne (2013),harmonicity,#11A3FF,12 dB roll-off
11.828078078078079,0.8424257018997615,Milne13,Milne (2013),harmonicity,#11A3FF,12 dB roll-off
11.828578578578579,0.8434692523492884,Milne13,Milne (2013),harmonicity,#11A3FF,12 dB roll-off
11.82907907907908,0.8445121551642417,Milne13,Milne (2013),harmonicity,#11A3FF,12 dB roll-off
11.82957957957958,0.8455542877141414,Milne13,Milne (2013),harmonicity,#11A3FF,12 dB roll-off
11.83008008008008,0.8465955283996631,Milne13,Milne (2013),harmonicity,#11A3FF,12 dB roll-off
11.83058058058058,0.8476357567022986,Milne13,Milne (2013),harmonicity,#11A3FF,12 dB roll-off
11.83108108108108,0.848674853232305,Milne13,Milne (2013),harmonicity,#11A3FF,12 dB roll-off
11.831581581581581,0.8497126997749243,Milne13,Milne (2013),harmonicity,#11A3FF,12 dB roll-off
11.832082082082081,0.8507491793348554,Milne13,Milne (2013),harmonicity,#11A3FF,12 dB roll-off
11.832582582582583,0.8517841761789539,Milne13,Milne (2013),harmonicity,#11A3FF,12 dB roll-off
11.833083083083084,0.85281757587715,Milne13,Milne (2013),harmonicity,#11A3FF,12 dB roll-off
11.833583583583584,0.8538492653415941,Milne13,Milne (2013),harmonicity,#11A3FF,12 dB roll-off
11.834084084084084,0.8548791328639955,Milne13,Milne (2013),harmonicity,#11A3FF,12 dB roll-off
11.834584584584585,0.8559070681511579,Milne13,Milne (2013),harmonicity,#11A3FF,12 dB roll-off
11.835085085085085,0.8569329623587336,Milne13,Milne (2013),harmonicity,#11A3FF,12 dB roll-off
11.835585585585585,0.8579567081231807,Milne13,Milne (2013),harmonicity,#11A3FF,12 dB roll-off
11.836086086086086,0.8589781995919255,Milne13,Milne (2013),harmonicity,#11A3FF,12 dB roll-off
11.836586586586586,0.8599973324517564,Milne13,Milne (2013),harmonicity,#11A3FF,12 dB roll-off
11.837087087087086,0.8610140039554471,Milne13,Milne (2013),harmonicity,#11A3FF,12 dB roll-off
11.837587587587588,0.862028112946631,Milne13,Milne (2013),harmonicity,#11A3FF,12 dB roll-off
11.838088088088089,0.8630395598829251,Milne13,Milne (2013),harmonicity,#11A3FF,12 dB roll-off
11.838588588588589,0.864048246857369,Milne13,Milne (2013),harmonicity,#11A3FF,12 dB roll-off
11.83908908908909,0.8650540776181376,Milne13,Milne (2013),harmonicity,#11A3FF,12 dB roll-off
11.83958958958959,0.8660569575865941,Milne13,Milne (2013),harmonicity,#11A3FF,12 dB roll-off
11.84009009009009,0.8670567938736934,Milne13,Milne (2013),harmonicity,#11A3FF,12 dB roll-off
11.84059059059059,0.8680534952947687,Milne13,Milne (2013),harmonicity,#11A3FF,12 dB roll-off
11.84109109109109,0.8690469723827184,Milne13,Milne (2013),harmonicity,#11A3FF,12 dB roll-off
11.841591591591591,0.8700371373996421,Milne13,Milne (2013),harmonicity,#11A3FF,12 dB roll-off
11.842092092092091,0.8710239043469363,Milne13,Milne (2013),harmonicity,#11A3FF,12 dB roll-off
11.842592592592593,0.8720071889739035,Milne13,Milne (2013),harmonicity,#11A3FF,12 dB roll-off
11.843093093093094,0.8729869087848685,Milne13,Milne (2013),harmonicity,#11A3FF,12 dB roll-off
11.843593593593594,0.8739629830449278,Milne13,Milne (2013),harmonicity,#11A3FF,12 dB roll-off
11.844094094094094,0.874935332784243,Milne13,Milne (2013),harmonicity,#11A3FF,12 dB roll-off
11.844594594594595,0.8759038808010164,Milne13,Milne (2013),harmonicity,#11A3FF,12 dB roll-off
11.845095095095095,0.8768685516631384,Milne13,Milne (2013),harmonicity,#11A3FF,12 dB roll-off
11.845595595595595,0.8778292717085641,Milne13,Milne (2013),harmonicity,#11A3FF,12 dB roll-off
11.846096096096096,0.8787859690444418,Milne13,Milne (2013),harmonicity,#11A3FF,12 dB roll-off
11.846596596596596,0.8797385735450556,Milne13,Milne (2013),harmonicity,#11A3FF,12 dB roll-off
11.847097097097096,0.8806870168485953,Milne13,Milne (2013),harmonicity,#11A3FF,12 dB roll-off
11.847597597597598,0.8816312323528228,Milne13,Milne (2013),harmonicity,#11A3FF,12 dB roll-off
11.848098098098099,0.8825711552096348,Milne13,Milne (2013),harmonicity,#11A3FF,12 dB roll-off
11.848598598598599,0.8835067223186299,Milne13,Milne (2013),harmonicity,#11A3FF,12 dB roll-off
11.8490990990991,0.8844378723196366,Milne13,Milne (2013),harmonicity,#11A3FF,12 dB roll-off
11.8495995995996,0.8853645455843085,Milne13,Milne (2013),harmonicity,#11A3FF,12 dB roll-off
11.8501001001001,0.8862866842067978,Milne13,Milne (2013),harmonicity,#11A3FF,12 dB roll-off
11.8506006006006,0.8872042319935491,Milne13,Milne (2013),harmonicity,#11A3FF,12 dB roll-off
11.8511011011011,0.8881171344522614,Milne13,Milne (2013),harmonicity,#11A3FF,12 dB roll-off
11.851601601601601,0.8890253387800561,Milne13,Milne (2013),harmonicity,#11A3FF,12 dB roll-off
11.852102102102101,0.8899287938508801,Milne13,Milne (2013),harmonicity,#11A3FF,12 dB roll-off
11.852602602602603,0.8908274502021954,Milne13,Milne (2013),harmonicity,#11A3FF,12 dB roll-off
11.853103103103104,0.8917212600209824,Milne13,Milne (2013),harmonicity,#11A3FF,12 dB roll-off
11.853603603603604,0.8926101771291123,Milne13,Milne (2013),harmonicity,#11A3FF,12 dB roll-off
11.854104104104104,0.893494156968097,Milne13,Milne (2013),harmonicity,#11A3FF,12 dB roll-off
11.854604604604605,0.8943731565832838,Milne13,Milne (2013),harmonicity,#11A3FF,12 dB roll-off
11.855105105105105,0.8952471346075029,Milne13,Milne (2013),harmonicity,#11A3FF,12 dB roll-off
11.855605605605605,0.8961160512442257,Milne13,Milne (2013),harmonicity,#11A3FF,12 dB roll-off
11.856106106106106,0.8969798682502558,Milne13,Milne (2013),harmonicity,#11A3FF,12 dB roll-off
11.856606606606606,0.8978385489179834,Milne13,Milne (2013),harmonicity,#11A3FF,12 dB roll-off
11.857107107107106,0.8986920580572452,Milne13,Milne (2013),harmonicity,#11A3FF,12 dB roll-off
11.857607607607608,0.8995403619768226,Milne13,Milne (2013),harmonicity,#11A3FF,12 dB roll-off
11.858108108108109,0.9003834284655758,Milne13,Milne (2013),harmonicity,#11A3FF,12 dB roll-off
11.858608608608609,0.9012212267733194,Milne13,Milne (2013),harmonicity,#11A3FF,12 dB roll-off
11.85910910910911,0.9020537275913796,Milne13,Milne (2013),harmonicity,#11A3FF,12 dB roll-off
11.85960960960961,0.9028809030329173,Milne13,Milne (2013),harmonicity,#11A3FF,12 dB roll-off
11.86011011011011,0.9037027266130327,Milne13,Milne (2013),harmonicity,#11A3FF,12 dB roll-off
11.86061061061061,0.904519173228674,Milne13,Milne (2013),harmonicity,#11A3FF,12 dB roll-off
11.86111111111111,0.9053302191383669,Milne13,Milne (2013),harmonicity,#11A3FF,12 dB roll-off
11.861611611611611,0.9061358419418183,Milne13,Milne (2013),harmonicity,#11A3FF,12 dB roll-off
11.862112112112111,0.9069360205593818,Milne13,Milne (2013),harmonicity,#11A3FF,12 dB roll-off
11.862612612612613,0.9077307352114405,Milne13,Milne (2013),harmonicity,#11A3FF,12 dB roll-off
11.863113113113114,0.9085199673976944,Milne13,Milne (2013),harmonicity,#11A3FF,12 dB roll-off
11.863613613613614,0.9093036998764198,Milne13,Milne (2013),harmonicity,#11A3FF,12 dB roll-off
11.864114114114114,0.9100819166436784,Milne13,Milne (2013),harmonicity,#11A3FF,12 dB roll-off
11.864614614614615,0.9108546029125092,Milne13,Milne (2013),harmonicity,#11A3FF,12 dB roll-off
11.865115115115115,0.9116217450921348,Milne13,Milne (2013),harmonicity,#11A3FF,12 dB roll-off
11.865615615615615,0.9123833307671823,Milne13,Milne (2013),harmonicity,#11A3FF,12 dB roll-off
11.866116116116116,0.9131393486769459,Milne13,Milne (2013),harmonicity,#11A3FF,12 dB roll-off
11.866616616616616,0.9138897886947075,Milne13,Milne (2013),harmonicity,#11A3FF,12 dB roll-off
11.867117117117116,0.9146346418071182,Milne13,Milne (2013),harmonicity,#11A3FF,12 dB roll-off
11.867617617617618,0.9153739000936786,Milne13,Milne (2013),harmonicity,#11A3FF,12 dB roll-off
11.868118118118119,0.9161075567062915,Milne13,Milne (2013),harmonicity,#11A3FF,12 dB roll-off
11.868618618618619,0.9168356058489665,Milne13,Milne (2013),harmonicity,#11A3FF,12 dB roll-off
11.86911911911912,0.9175580427576103,Milne13,Milne (2013),harmonicity,#11A3FF,12 dB roll-off
11.86961961961962,0.9182748636799654,Milne13,Milne (2013),harmonicity,#11A3FF,12 dB roll-off
11.87012012012012,0.918986065855705,Milne13,Milne (2013),harmonicity,#11A3FF,12 dB roll-off
11.87062062062062,0.9196916474966632,Milne13,Milne (2013),harmonicity,#11A3FF,12 dB roll-off
11.87112112112112,0.9203916077672488,Milne13,Milne (2013),harmonicity,#11A3FF,12 dB roll-off
11.871621621621621,0.9210859467650212,Milne13,Milne (2013),harmonicity,#11A3FF,12 dB roll-off
11.872122122122121,0.9217746655014528,Milne13,Milne (2013),harmonicity,#11A3FF,12 dB roll-off
11.872622622622623,0.9224577658828866,Milne13,Milne (2013),harmonicity,#11A3FF,12 dB roll-off
11.873123123123124,0.9231352506916698,Milne13,Milne (2013),harmonicity,#11A3FF,12 dB roll-off
11.873623623623624,0.9238071235675205,Milne13,Milne (2013),harmonicity,#11A3FF,12 dB roll-off
11.874124124124124,0.9244733889890765,Milne13,Milne (2013),harmonicity,#11A3FF,12 dB roll-off
11.874624624624625,0.9251340522556765,Milne13,Milne (2013),harmonicity,#11A3FF,12 dB roll-off
11.875125125125125,0.9257891194693393,Milne13,Milne (2013),harmonicity,#11A3FF,12 dB roll-off
11.875625625625625,0.9264385975169905,Milne13,Milne (2013),harmonicity,#11A3FF,12 dB roll-off
11.876126126126126,0.9270824940528941,Milne13,Milne (2013),harmonicity,#11A3FF,12 dB roll-off
11.876626626626626,0.927720817481329,Milne13,Milne (2013),harmonicity,#11A3FF,12 dB roll-off
11.877127127127126,0.928353576939488,Milne13,Milne (2013),harmonicity,#11A3FF,12 dB roll-off
11.877627627627628,0.9289807822806193,Milne13,Milne (2013),harmonicity,#11A3FF,12 dB roll-off
11.878128128128129,0.9296024440573937,Milne13,Milne (2013),harmonicity,#11A3FF,12 dB roll-off
11.87862862862863,0.9302185735055285,Milne13,Milne (2013),harmonicity,#11A3FF,12 dB roll-off
11.87912912912913,0.930829182527639,Milne13,Milne (2013),harmonicity,#11A3FF,12 dB roll-off
11.87962962962963,0.9314342836773291,Milne13,Milne (2013),harmonicity,#11A3FF,12 dB roll-off
11.88013013013013,0.9320338901435289,Milne13,Milne (2013),harmonicity,#11A3FF,12 dB roll-off
11.88063063063063,0.9326280157350763,Milne13,Milne (2013),harmonicity,#11A3FF,12 dB roll-off
11.88113113113113,0.933216674865531,Milne13,Milne (2013),harmonicity,#11A3FF,12 dB roll-off
11.881631631631631,0.9337998825382439,Milne13,Milne (2013),harmonicity,#11A3FF,12 dB roll-off
11.882132132132131,0.9343776543316504,Milne13,Milne (2013),harmonicity,#11A3FF,12 dB roll-off
11.882632632632633,0.9349500063848217,Milne13,Milne (2013),harmonicity,#11A3FF,12 dB roll-off
11.883133133133134,0.9355169553832346,Milne13,Milne (2013),harmonicity,#11A3FF,12 dB roll-off
11.883633633633634,0.9360785185448034,Milne13,Milne (2013),harmonicity,#11A3FF,12 dB roll-off
11.884134134134134,0.9366347136061289,Milne13,Milne (2013),harmonicity,#11A3FF,12 dB roll-off
11.884634634634635,0.9371855588089864,Milne13,Milne (2013),harmonicity,#11A3FF,12 dB roll-off
11.885135135135135,0.9377310728870532,Milne13,Milne (2013),harmonicity,#11A3FF,12 dB roll-off
11.885635635635635,0.9382712750528539,Milne13,Milne (2013),harmonicity,#11A3FF,12 dB roll-off
11.886136136136136,0.9388061849849507,Milne13,Milne (2013),harmonicity,#11A3FF,12 dB roll-off
11.886636636636636,0.9393358228153461,Milne13,Milne (2013),harmonicity,#11A3FF,12 dB roll-off
11.887137137137136,0.9398602091171121,Milne13,Milne (2013),harmonicity,#11A3FF,12 dB roll-off
11.887637637637638,0.9403793648922472,Milne13,Milne (2013),harmonicity,#11A3FF,12 dB roll-off
11.888138138138139,0.9408933115597382,Milne13,Milne (2013),harmonicity,#11A3FF,12 dB roll-off
11.88863863863864,0.9414020709438563,Milne13,Milne (2013),harmonicity,#11A3FF,12 dB roll-off
11.88913913913914,0.9419056652626457,Milne13,Milne (2013),harmonicity,#11A3FF,12 dB roll-off
11.88963963963964,0.9424041171166351,Milne13,Milne (2013),harmonicity,#11A3FF,12 dB roll-off
11.89014014014014,0.9428974494777492,Milne13,Milne (2013),harmonicity,#11A3FF,12 dB roll-off
11.89064064064064,0.943385685678428,Milne13,Milne (2013),harmonicity,#11A3FF,12 dB roll-off
11.89114114114114,0.9438688494009413,Milne13,Milne (2013),harmonicity,#11A3FF,12 dB roll-off
11.891641641641641,0.944346964666903,Milne13,Milne (2013),harmonicity,#11A3FF,12 dB roll-off
11.892142142142141,0.9448200558269764,Milne13,Milne (2013),harmonicity,#11A3FF,12 dB roll-off
11.892642642642643,0.945288147550777,Milne13,Milne (2013),harmonicity,#11A3FF,12 dB roll-off
11.893143143143144,0.9457512648169455,Milne13,Milne (2013),harmonicity,#11A3FF,12 dB roll-off
11.893643643643644,0.9462094329034282,Milne13,Milne (2013),harmonicity,#11A3FF,12 dB roll-off
11.894144144144144,0.9466626773779152,Milne13,Milne (2013),harmonicity,#11A3FF,12 dB roll-off
11.894644644644645,0.9471110240884691,Milne13,Milne (2013),harmonicity,#11A3FF,12 dB roll-off
11.895145145145145,0.9475544991543203,Milne13,Milne (2013),harmonicity,#11A3FF,12 dB roll-off
11.895645645645645,0.9479931289568374,Milne13,Milne (2013),harmonicity,#11A3FF,12 dB roll-off
11.896146146146146,0.9484269401306554,Milne13,Milne (2013),harmonicity,#11A3FF,12 dB roll-off
11.896646646646646,0.948855959554979,Milne13,Milne (2013),harmonicity,#11A3FF,12 dB roll-off
11.897147147147146,0.9492802143450372,Milne13,Milne (2013),harmonicity,#11A3FF,12 dB roll-off
11.897647647647648,0.949699731843698,Milne13,Milne (2013),harmonicity,#11A3FF,12 dB roll-off
11.898148148148149,0.9501145396132302,Milne13,Milne (2013),harmonicity,#11A3FF,12 dB roll-off
11.89864864864865,0.9505246654272286,Milne13,Milne (2013),harmonicity,#11A3FF,12 dB roll-off
11.89914914914915,0.9509301372626732,Milne13,Milne (2013),harmonicity,#11A3FF,12 dB roll-off
11.89964964964965,0.9513309832921388,Milne13,Milne (2013),harmonicity,#11A3FF,12 dB roll-off
11.90015015015015,0.9517272318761368,Milne13,Milne (2013),harmonicity,#11A3FF,12 dB roll-off
11.90065065065065,0.9521189115556087,Milne13,Milne (2013),harmonicity,#11A3FF,12 dB roll-off
11.90115115115115,0.9525060510445408,Milne13,Milne (2013),harmonicity,#11A3FF,12 dB roll-off
11.901651651651651,0.9528886792227137,Milne13,Milne (2013),harmonicity,#11A3FF,12 dB roll-off
11.902152152152151,0.9532668251285871,Milne13,Milne (2013),harmonicity,#11A3FF,12 dB roll-off
11.902652652652653,0.9536405179522992,Milne13,Milne (2013),harmonicity,#11A3FF,12 dB roll-off
11.903153153153154,0.9540097870287934,Milne13,Milne (2013),harmonicity,#11A3FF,12 dB roll-off
11.903653653653654,0.9543746618310694,Milne13,Milne (2013),harmonicity,#11A3FF,12 dB roll-off
11.904154154154154,0.9547351719635462,Milne13,Milne (2013),harmonicity,#11A3FF,12 dB roll-off
11.904654654654655,0.9550913471555381,Milne13,Milne (2013),harmonicity,#11A3FF,12 dB roll-off
11.905155155155155,0.9554432172548463,Milne13,Milne (2013),harmonicity,#11A3FF,12 dB roll-off
11.905655655655655,0.9557908122214536,Milne13,Milne (2013),harmonicity,#11A3FF,12 dB roll-off
11.906156156156156,0.956134162121339,Milne13,Milne (2013),harmonicity,#11A3FF,12 dB roll-off
11.906656656656656,0.9564732971203787,Milne13,Milne (2013),harmonicity,#11A3FF,12 dB roll-off
11.907157157157156,0.9568082474783641,Milne13,Milne (2013),harmonicity,#11A3FF,12 dB roll-off
11.907657657657658,0.95713904354311,Milne13,Milne (2013),harmonicity,#11A3FF,12 dB roll-off
11.908158158158159,0.957465715744657,Milne13,Milne (2013),harmonicity,#11A3FF,12 dB roll-off
11.90865865865866,0.9577882945895869,Milne13,Milne (2013),harmonicity,#11A3FF,12 dB roll-off
11.90915915915916,0.9581068106554117,Milne13,Milne (2013),harmonicity,#11A3FF,12 dB roll-off
11.90965965965966,0.9584212945850612,Milne13,Milne (2013),harmonicity,#11A3FF,12 dB roll-off
11.91016016016016,0.9587317770814532,Milne13,Milne (2013),harmonicity,#11A3FF,12 dB roll-off
11.91066066066066,0.9590382889021669,Milne13,Milne (2013),harmonicity,#11A3FF,12 dB roll-off
11.91116116116116,0.9593408608541798,Milne13,Milne (2013),harmonicity,#11A3FF,12 dB roll-off
11.911661661661661,0.9596395237887024,Milne13,Milne (2013),harmonicity,#11A3FF,12 dB roll-off
11.912162162162161,0.9599343085960886,Milne13,Milne (2013),harmonicity,#11A3FF,12 dB roll-off
11.912662662662663,0.9602252462008263,Milne13,Milne (2013),harmonicity,#11A3FF,12 dB roll-off
11.913163163163164,0.9605123675565985,Milne13,Milne (2013),harmonicity,#11A3FF,12 dB roll-off
11.913663663663664,0.9607957036414445,Milne13,Milne (2013),harmonicity,#11A3FF,12 dB roll-off
11.914164164164164,0.9610752854529621,Milne13,Milne (2013),harmonicity,#11A3FF,12 dB roll-off
11.914664664664665,0.9613511440036089,Milne13,Milne (2013),harmonicity,#11A3FF,12 dB roll-off
11.915165165165165,0.9616233103160629,Milne13,Milne (2013),harmonicity,#11A3FF,12 dB roll-off
11.915665665665665,0.9618918154186581,Milne13,Milne (2013),harmonicity,#11A3FF,12 dB roll-off
11.916166166166166,0.9621566903408847,Milne13,Milne (2013),harmonicity,#11A3FF,12 dB roll-off
11.916666666666666,0.9624179661089604,Milne13,Milne (2013),harmonicity,#11A3FF,12 dB roll-off
11.917167167167166,0.9626756737414696,Milne13,Milne (2013),harmonicity,#11A3FF,12 dB roll-off
11.917667667667668,0.9629298442450632,Milne13,Milne (2013),harmonicity,#11A3FF,12 dB roll-off
11.918168168168169,0.9631805086102209,Milne13,Milne (2013),harmonicity,#11A3FF,12 dB roll-off
11.91866866866867,0.9634276978070856,Milne13,Milne (2013),harmonicity,#11A3FF,12 dB roll-off
11.91916916916917,0.9636714427813533,Milne13,Milne (2013),harmonicity,#11A3FF,12 dB roll-off
11.91966966966967,0.9639117744502187,Milne13,Milne (2013),harmonicity,#11A3FF,12 dB roll-off
11.92017017017017,0.964148723698393,Milne13,Milne (2013),harmonicity,#11A3FF,12 dB roll-off
11.92067067067067,0.9643823213741683,Milne13,Milne (2013),harmonicity,#11A3FF,12 dB roll-off
11.92117117117117,0.9646125982855478,Milne13,Milne (2013),harmonicity,#11A3FF,12 dB roll-off
11.921671671671671,0.964839585196431,Milne13,Milne (2013),harmonicity,#11A3FF,12 dB roll-off
11.922172172172171,0.9650633128228518,Milne13,Milne (2013),harmonicity,#11A3FF,12 dB roll-off
11.922672672672673,0.9652838118292809,Milne13,Milne (2013),harmonicity,#11A3FF,12 dB roll-off
11.923173173173174,0.9655011128249655,Milne13,Milne (2013),harmonicity,#11A3FF,12 dB roll-off
11.923673673673674,0.9657152463603502,Milne13,Milne (2013),harmonicity,#11A3FF,12 dB roll-off
11.924174174174174,0.9659262429235245,Milne13,Milne (2013),harmonicity,#11A3FF,12 dB roll-off
11.924674674674675,0.9661341329367392,Milne13,Milne (2013),harmonicity,#11A3FF,12 dB roll-off
11.925175175175175,0.9663389467529625,Milne13,Milne (2013),harmonicity,#11A3FF,12 dB roll-off
11.925675675675675,0.9665407146525057,Milne13,Milne (2013),harmonicity,#11A3FF,12 dB roll-off
11.926176176176176,0.9667394668396785,Milne13,Milne (2013),harmonicity,#11A3FF,12 dB roll-off
11.926676676676676,0.9669352334395134,Milne13,Milne (2013),harmonicity,#11A3FF,12 dB roll-off
11.927177177177176,0.9671280444945214,Milne13,Milne (2013),harmonicity,#11A3FF,12 dB roll-off
11.927677677677679,0.9673179299615183,Milne13,Milne (2013),harmonicity,#11A3FF,12 dB roll-off
11.928178178178179,0.9675049197084784,Milne13,Milne (2013),harmonicity,#11A3FF,12 dB roll-off
11.92867867867868,0.9676890435114536,Milne13,Milne (2013),harmonicity,#11A3FF,12 dB roll-off
11.92917917917918,0.9678703310515321,Milne13,Milne (2013),harmonicity,#11A3FF,12 dB roll-off
11.92967967967968,0.9680488119118418,Milne13,Milne (2013),harmonicity,#11A3FF,12 dB roll-off
11.93018018018018,0.9682245155746086,Milne13,Milne (2013),harmonicity,#11A3FF,12 dB roll-off
11.93068068068068,0.9683974714182607,Milne13,Milne (2013),harmonicity,#11A3FF,12 dB roll-off
11.93118118118118,0.9685677087145692,Milne13,Milne (2013),harmonicity,#11A3FF,12 dB roll-off
11.931681681681681,0.9687352566258443,Milne13,Milne (2013),harmonicity,#11A3FF,12 dB roll-off
11.932182182182181,0.9689001442021795,Milne13,Milne (2013),harmonicity,#11A3FF,12 dB roll-off
11.932682682682684,0.9690624003787272,Milne13,Milne (2013),harmonicity,#11A3FF,12 dB roll-off
11.933183183183184,0.9692220539730374,Milne13,Milne (2013),harmonicity,#11A3FF,12 dB roll-off
11.933683683683684,0.969379133682422,Milne13,Milne (2013),harmonicity,#11A3FF,12 dB roll-off
11.934184184184184,0.9695336680813823,Milne13,Milne (2013),harmonicity,#11A3FF,12 dB roll-off
11.934684684684685,0.9696856856190678,Milne13,Milne (2013),harmonicity,#11A3FF,12 dB roll-off
11.935185185185185,0.9698352146167785,Milne13,Milne (2013),harmonicity,#11A3FF,12 dB roll-off
11.935685685685685,0.9699822832655215,Milne13,Milne (2013),harmonicity,#11A3FF,12 dB roll-off
11.936186186186186,0.970126919623596,Milne13,Milne (2013),harmonicity,#11A3FF,12 dB roll-off
11.936686686686686,0.9702691516142296,Milne13,Milne (2013),harmonicity,#11A3FF,12 dB roll-off
11.937187187187186,0.9704090070232646,Milne13,Milne (2013),harmonicity,#11A3FF,12 dB roll-off
11.937687687687689,0.9705465134968643,Milne13,Milne (2013),harmonicity,#11A3FF,12 dB roll-off
11.938188188188189,0.9706816985392844,Milne13,Milne (2013),harmonicity,#11A3FF,12 dB roll-off
11.93868868868869,0.9708145895106718,Milne13,Milne (2013),harmonicity,#11A3FF,12 dB roll-off
11.93918918918919,0.9709452136249095,Milne13,Milne (2013),harmonicity,#11A3FF,12 dB roll-off
11.93968968968969,0.9710735979475053,Milne13,Milne (2013),harmonicity,#11A3FF,12 dB roll-off
11.94019019019019,0.9711997693935105,Milne13,Milne (2013),harmonicity,#11A3FF,12 dB roll-off
11.94069069069069,0.9713237547254914,Milne13,Milne (2013),harmonicity,#11A3FF,12 dB roll-off
11.94119119119119,0.9714455805515314,Milne13,Milne (2013),harmonicity,#11A3FF,12 dB roll-off
11.941691691691691,0.9715652733232819,Milne13,Milne (2013),harmonicity,#11A3FF,12 dB roll-off
11.942192192192191,0.9716828593340421,Milne13,Milne (2013),harmonicity,#11A3FF,12 dB roll-off
11.942692692692694,0.9717983647168842,Milne13,Milne (2013),harmonicity,#11A3FF,12 dB roll-off
11.943193193193194,0.9719118154428134,Milne13,Milne (2013),harmonicity,#11A3FF,12 dB roll-off
11.943693693693694,0.9720232373189698,Milne13,Milne (2013),harmonicity,#11A3FF,12 dB roll-off
11.944194194194194,0.9721326559868687,Milne13,Milne (2013),harmonicity,#11A3FF,12 dB roll-off
11.944694694694695,0.972240096920671,Milne13,Milne (2013),harmonicity,#11A3FF,12 dB roll-off
11.945195195195195,0.9723455854254954,Milne13,Milne (2013),harmonicity,#11A3FF,12 dB roll-off
11.945695695695695,0.972449146635769,Milne13,Milne (2013),harmonicity,#11A3FF,12 dB roll-off
11.946196196196196,0.9725508055136084,Milne13,Milne (2013),harmonicity,#11A3FF,12 dB roll-off
11.946696696696696,0.972650586847243,Milne13,Milne (2013),harmonicity,#11A3FF,12 dB roll-off
11.947197197197196,0.9727485152494657,Milne13,Milne (2013),harmonicity,#11A3FF,12 dB roll-off
11.947697697697699,0.9728446151561243,Milne13,Milne (2013),harmonicity,#11A3FF,12 dB roll-off
11.948198198198199,0.9729389108246455,Milne13,Milne (2013),harmonicity,#11A3FF,12 dB roll-off
11.9486986986987,0.9730314263325849,Milne13,Milne (2013),harmonicity,#11A3FF,12 dB roll-off
11.9491991991992,0.9731221855762258,Milne13,Milne (2013),harmonicity,#11A3FF,12 dB roll-off
11.9496996996997,0.973211212269193,Milne13,Milne (2013),harmonicity,#11A3FF,12 dB roll-off
11.9502002002002,0.9732985299411095,Milne13,Milne (2013),harmonicity,#11A3FF,12 dB roll-off
11.9507007007007,0.9733841619362804,Milne13,Milne (2013),harmonicity,#11A3FF,12 dB roll-off
11.9512012012012,0.9734681314124073,Milne13,Milne (2013),harmonicity,#11A3FF,12 dB roll-off
11.951701701701701,0.9735504613393351,Milne13,Milne (2013),harmonicity,#11A3FF,12 dB roll-off
11.952202202202201,0.9736311744978225,Milne13,Milne (2013),harmonicity,#11A3FF,12 dB roll-off
11.952702702702704,0.973710293478349,Milne13,Milne (2013),harmonicity,#11A3FF,12 dB roll-off
11.953203203203204,0.9737878406799403,Milne13,Milne (2013),harmonicity,#11A3FF,12 dB roll-off
11.953703703703704,0.9738638383090332,Milne13,Milne (2013),harmonicity,#11A3FF,12 dB roll-off
11.954204204204204,0.9739383083783526,Milne13,Milne (2013),harmonicity,#11A3FF,12 dB roll-off
11.954704704704705,0.9740112727058235,Milne13,Milne (2013),harmonicity,#11A3FF,12 dB roll-off
11.955205205205205,0.9740827529135103,Milne13,Milne (2013),harmonicity,#11A3FF,12 dB roll-off
11.955705705705705,0.9741527704265683,Milne13,Milne (2013),harmonicity,#11A3FF,12 dB roll-off
11.956206206206206,0.9742213464722344,Milne13,Milne (2013),harmonicity,#11A3FF,12 dB roll-off
11.956706706706706,0.9742885020788272,Milne13,Milne (2013),harmonicity,#11A3FF,12 dB roll-off
11.957207207207206,0.9743542580747746,Milne13,Milne (2013),harmonicity,#11A3FF,12 dB roll-off
11.957707707707709,0.9744186350876652,Milne13,Milne (2013),harmonicity,#11A3FF,12 dB roll-off
11.958208208208209,0.9744816535433137,Milne13,Milne (2013),harmonicity,#11A3FF,12 dB roll-off
11.95870870870871,0.9745433336648508,Milne13,Milne (2013),harmonicity,#11A3FF,12 dB roll-off
11.95920920920921,0.974603695471828,Milne13,Milne (2013),harmonicity,#11A3FF,12 dB roll-off
11.95970970970971,0.9746627587793448,Milne13,Milne (2013),harmonicity,#11A3FF,12 dB roll-off
11.96021021021021,0.9747205431971885,Milne13,Milne (2013),harmonicity,#11A3FF,12 dB roll-off
11.96071071071071,0.9747770681289919,Milne13,Milne (2013),harmonicity,#11A3FF,12 dB roll-off
11.96121121121121,0.9748323527714026,Milne13,Milne (2013),harmonicity,#11A3FF,12 dB roll-off
11.961711711711711,0.9748864161132758,Milne13,Milne (2013),harmonicity,#11A3FF,12 dB roll-off
11.962212212212211,0.9749392769348686,Milne13,Milne (2013),harmonicity,#11A3FF,12 dB roll-off
11.962712712712714,0.974990953807058,Milne13,Milne (2013),harmonicity,#11A3FF,12 dB roll-off
11.963213213213214,0.975041465090561,Milne13,Milne (2013),harmonicity,#11A3FF,12 dB roll-off
11.963713713713714,0.97509082893517,Milne13,Milne (2013),harmonicity,#11A3FF,12 dB roll-off
11.964214214214214,0.9751390632790041,Milne13,Milne (2013),harmonicity,#11A3FF,12 dB roll-off
11.964714714714715,0.9751861858477583,Milne13,Milne (2013),harmonicity,#11A3FF,12 dB roll-off
11.965215215215215,0.9752322141539642,Milne13,Milne (2013),harmonicity,#11A3FF,12 dB roll-off
11.965715715715715,0.9752771654962645,Milne13,Milne (2013),harmonicity,#11A3FF,12 dB roll-off
11.966216216216216,0.9753210569586892,Milne13,Milne (2013),harmonicity,#11A3FF,12 dB roll-off
11.966716716716716,0.9753639054099341,Milne13,Milne (2013),harmonicity,#11A3FF,12 dB roll-off
11.967217217217216,0.9754057275026511,Milne13,Milne (2013),harmonicity,#11A3FF,12 dB roll-off
11.967717717717719,0.9754465396727393,Milne13,Milne (2013),harmonicity,#11A3FF,12 dB roll-off
11.968218218218219,0.9754863581386384,Milne13,Milne (2013),harmonicity,#11A3FF,12 dB roll-off
11.96871871871872,0.975525198900625,Milne13,Milne (2013),harmonicity,#11A3FF,12 dB roll-off
11.96921921921922,0.9755630777401145,Milne13,Milne (2013),harmonicity,#11A3FF,12 dB roll-off
11.96971971971972,0.9756000102189601,Milne13,Milne (2013),harmonicity,#11A3FF,12 dB roll-off
11.97022022022022,0.9756360116787509,Milne13,Milne (2013),harmonicity,#11A3FF,12 dB roll-off
11.97072072072072,0.9756710972401131,Milne13,Milne (2013),harmonicity,#11A3FF,12 dB roll-off
11.97122122122122,0.9757052818020107,Milne13,Milne (2013),harmonicity,#11A3FF,12 dB roll-off
11.971721721721721,0.9757385800410379,Milne13,Milne (2013),harmonicity,#11A3FF,12 dB roll-off
11.972222222222221,0.9757710064107225,Milne13,Milne (2013),harmonicity,#11A3FF,12 dB roll-off
11.972722722722724,0.9758025751408081,Milne13,Milne (2013),harmonicity,#11A3FF,12 dB roll-off
11.973223223223224,0.975833300236552,Milne13,Milne (2013),harmonicity,#11A3FF,12 dB roll-off
11.973723723723724,0.9758631954780014,Milne13,Milne (2013),harmonicity,#11A3FF,12 dB roll-off
11.974224224224224,0.9758922744192832,Milne13,Milne (2013),harmonicity,#11A3FF,12 dB roll-off
11.974724724724725,0.9759205503878735,Milne13,Milne (2013),harmonicity,#11A3FF,12 dB roll-off
11.975225225225225,0.9759480364838672,Milne13,Milne (2013),harmonicity,#11A3FF,12 dB roll-off
11.975725725725725,0.9759747455792476,Milne13,Milne (2013),harmonicity,#11A3FF,12 dB roll-off
11.976226226226226,0.9760006903171429,Milne13,Milne (2013),harmonicity,#11A3FF,12 dB roll-off
11.976726726726726,0.9760258831110795,Milne13,Milne (2013),harmonicity,#11A3FF,12 dB roll-off
11.977227227227226,0.9760503361442249,Milne13,Milne (2013),harmonicity,#11A3FF,12 dB roll-off
11.977727727727729,0.9760740613686332,Milne13,Milne (2013),harmonicity,#11A3FF,12 dB roll-off
11.978228228228229,0.9760970705044687,Milne13,Milne (2013),harmonicity,#11A3FF,12 dB roll-off
11.97872872872873,0.976119375039243,Milne13,Milne (2013),harmonicity,#11A3FF,12 dB roll-off
11.97922922922923,0.9761409862270239,Milne13,Milne (2013),harmonicity,#11A3FF,12 dB roll-off
11.97972972972973,0.9761619150876513,Milne13,Milne (2013),harmonicity,#11A3FF,12 dB roll-off
11.98023023023023,0.976182172405939,Milne13,Milne (2013),harmonicity,#11A3FF,12 dB roll-off
11.98073073073073,0.9762017687308742,Milne13,Milne (2013),harmonicity,#11A3FF,12 dB roll-off
11.98123123123123,0.9762207143748053,Milne13,Milne (2013),harmonicity,#11A3FF,12 dB roll-off
11.981731731731731,0.9762390194126273,Milne13,Milne (2013),harmonicity,#11A3FF,12 dB roll-off
11.982232232232231,0.9762566936809536,Milne13,Milne (2013),harmonicity,#11A3FF,12 dB roll-off
11.982732732732734,0.976273746777294,Milne13,Milne (2013),harmonicity,#11A3FF,12 dB roll-off
11.983233233233234,0.9762901880592104,Milne13,Milne (2013),harmonicity,#11A3FF,12 dB roll-off
11.983733733733734,0.9763060266434821,Milne13,Milne (2013),harmonicity,#11A3FF,12 dB roll-off
11.984234234234235,0.9763212714052538,Milne13,Milne (2013),harmonicity,#11A3FF,12 dB roll-off
11.984734734734735,0.976335930977187,Milne13,Milne (2013),harmonicity,#11A3FF,12 dB roll-off
11.985235235235235,0.976350013748597,Milne13,Milne (2013),harmonicity,#11A3FF,12 dB roll-off
11.985735735735735,0.9763635278645992,Milne13,Milne (2013),harmonicity,#11A3FF,12 dB roll-off
11.986236236236236,0.9763764812252412,Milne13,Milne (2013),harmonicity,#11A3FF,12 dB roll-off
11.986736736736736,0.9763888814846363,Milne13,Milne (2013),harmonicity,#11A3FF,12 dB roll-off
11.987237237237236,0.9764007360500927,Milne13,Milne (2013),harmonicity,#11A3FF,12 dB roll-off
11.987737737737739,0.9764120520812448,Milne13,Milne (2013),harmonicity,#11A3FF,12 dB roll-off
11.988238238238239,0.9764228364891767,Milne13,Milne (2013),harmonicity,#11A3FF,12 dB roll-off
11.98873873873874,0.9764330959355558,Milne13,Milne (2013),harmonicity,#11A3FF,12 dB roll-off
11.98923923923924,0.9764428368317594,Milne13,Milne (2013),harmonicity,#11A3FF,12 dB roll-off
11.98973973973974,0.976452065338003,Milne13,Milne (2013),harmonicity,#11A3FF,12 dB roll-off
11.99024024024024,0.9764607873624718,Milne13,Milne (2013),harmonicity,#11A3FF,12 dB roll-off
11.99074074074074,0.9764690085604589,Milne13,Milne (2013),harmonicity,#11A3FF,12 dB roll-off
11.99124124124124,0.976476734333504,Milne13,Milne (2013),harmonicity,#11A3FF,12 dB roll-off
11.991741741741741,0.9764839698285394,Milne13,Milne (2013),harmonicity,#11A3FF,12 dB roll-off
11.992242242242241,0.9764907199370374,Milne13,Milne (2013),harmonicity,#11A3FF,12 dB roll-off
11.992742742742744,0.9764969892941732,Milne13,Milne (2013),harmonicity,#11A3FF,12 dB roll-off
11.993243243243244,0.9765027822779837,Milne13,Milne (2013),harmonicity,#11A3FF,12 dB roll-off
11.993743743743744,0.9765081030085508,Milne13,Milne (2013),harmonicity,#11A3FF,12 dB roll-off
11.994244244244245,0.9765129553471802,Milne13,Milne (2013),harmonicity,#11A3FF,12 dB roll-off
11.994744744744745,0.976517342895603,Milne13,Milne (2013),harmonicity,#11A3FF,12 dB roll-off
11.995245245245245,0.9765212689951764,Milne13,Milne (2013),harmonicity,#11A3FF,12 dB roll-off
11.995745745745745,0.976524736726117,Milne13,Milne (2013),harmonicity,#11A3FF,12 dB roll-off
11.996246246246246,0.9765277489067258,Milne13,Milne (2013),harmonicity,#11A3FF,12 dB roll-off
11.996746746746746,0.9765303080926502,Milne13,Milne (2013),harmonicity,#11A3FF,12 dB roll-off
11.997247247247246,0.9765324165761448,Milne13,Milne (2013),harmonicity,#11A3FF,12 dB roll-off
11.997747747747749,0.9765340763853655,Milne13,Milne (2013),harmonicity,#11A3FF,12 dB roll-off
11.998248248248249,0.9765352892836674,Milne13,Milne (2013),harmonicity,#11A3FF,12 dB roll-off
11.99874874874875,0.9765360567689375,Milne13,Milne (2013),harmonicity,#11A3FF,12 dB roll-off
11.99924924924925,0.9765363800729382,Milne13,Milne (2013),harmonicity,#11A3FF,12 dB roll-off
11.99974974974975,0.9765362601606742,Milne13,Milne (2013),harmonicity,#11A3FF,12 dB roll-off
12.00025025025025,0.9765356977297882,Milne13,Milne (2013),harmonicity,#11A3FF,12 dB roll-off
12.00075075075075,0.9765346932099765,Milne13,Milne (2013),harmonicity,#11A3FF,12 dB roll-off
12.00125125125125,0.976533246762431,Milne13,Milne (2013),harmonicity,#11A3FF,12 dB roll-off
12.001751751751751,0.9765313582793046,Milne13,Milne (2013),harmonicity,#11A3FF,12 dB roll-off
12.002252252252251,0.9765290273832097,Milne13,Milne (2013),harmonicity,#11A3FF,12 dB roll-off
12.002752752752754,0.9765262534267427,Milne13,Milne (2013),harmonicity,#11A3FF,12 dB roll-off
12.003253253253254,0.9765230354920332,Milne13,Milne (2013),harmonicity,#11A3FF,12 dB roll-off
12.003753753753754,0.9765193723903326,Milne13,Milne (2013),harmonicity,#11A3FF,12 dB roll-off
12.004254254254255,0.9765152626616244,Milne13,Milne (2013),harmonicity,#11A3FF,12 dB roll-off
12.004754754754755,0.9765107045742749,Milne13,Milne (2013),harmonicity,#11A3FF,12 dB roll-off
12.005255255255255,0.9765056961247045,Milne13,Milne (2013),harmonicity,#11A3FF,12 dB roll-off
12.005755755755755,0.9765002350371121,Milne13,Milne (2013),harmonicity,#11A3FF,12 dB roll-off
12.006256256256256,0.9764943187632115,Milne13,Milne (2013),harmonicity,#11A3FF,12 dB roll-off
12.006756756756756,0.9764879444820177,Milne13,Milne (2013),harmonicity,#11A3FF,12 dB roll-off
12.007257257257256,0.976481109099664,Milne13,Milne (2013),harmonicity,#11A3FF,12 dB roll-off
12.007757757757759,0.9764738092492591,Milne13,Milne (2013),harmonicity,#11A3FF,12 dB roll-off
12.008258258258259,0.976466041290768,Milne13,Milne (2013),harmonicity,#11A3FF,12 dB roll-off
12.00875875875876,0.976457801310952,Milne13,Milne (2013),harmonicity,#11A3FF,12 dB roll-off
12.00925925925926,0.9764490851233258,Milne13,Milne (2013),harmonicity,#11A3FF,12 dB roll-off
12.00975975975976,0.9764398882681666,Milne13,Milne (2013),harmonicity,#11A3FF,12 dB roll-off
12.01026026026026,0.9764302060125507,Milne13,Milne (2013),harmonicity,#11A3FF,12 dB roll-off
12.01076076076076,0.9764200333504389,Milne13,Milne (2013),harmonicity,#11A3FF,12 dB roll-off
12.01126126126126,0.9764093650027988,Milne13,Milne (2013),harmonicity,#11A3FF,12 dB roll-off
12.011761761761761,0.9763981954177607,Milne13,Milne (2013),harmonicity,#11A3FF,12 dB roll-off
12.012262262262261,0.9763865187708173,Milne13,Milne (2013),harmonicity,#11A3FF,12 dB roll-off
12.012762762762764,0.9763743289650632,Milne13,Milne (2013),harmonicity,#11A3FF,12 dB roll-off
12.013263263263264,0.9763616196314822,Milne13,Milne (2013),harmonicity,#11A3FF,12 dB roll-off
12.013763763763764,0.9763483841292487,Milne13,Milne (2013),harmonicity,#11A3FF,12 dB roll-off
12.014264264264265,0.9763346155461018,Milne13,Milne (2013),harmonicity,#11A3FF,12 dB roll-off
12.014764764764765,0.9763203066987364,Milne13,Milne (2013),harmonicity,#11A3FF,12 dB roll-off
12.015265265265265,0.9763054501332422,Milne13,Milne (2013),harmonicity,#11A3FF,12 dB roll-off
12.015765765765765,0.9762900381255775,Milne13,Milne (2013),harmonicity,#11A3FF,12 dB roll-off
12.016266266266266,0.9762740626820888,Milne13,Milne (2013),harmonicity,#11A3FF,12 dB roll-off
12.016766766766766,0.976257515540065,Milne13,Milne (2013),harmonicity,#11A3FF,12 dB roll-off
12.017267267267266,0.9762403881683276,Milne13,Milne (2013),harmonicity,#11A3FF,12 dB roll-off
12.017767767767769,0.9762226717678648,Milne13,Milne (2013),harmonicity,#11A3FF,12 dB roll-off
12.018268268268269,0.9762043572724965,Milne13,Milne (2013),harmonicity,#11A3FF,12 dB roll-off
12.01876876876877,0.9761854353495859,Milne13,Milne (2013),harmonicity,#11A3FF,12 dB roll-off
12.01926926926927,0.976165896400777,Milne13,Milne (2013),harmonicity,#11A3FF,12 dB roll-off
12.01976976976977,0.976145730562774,Milne13,Milne (2013),harmonicity,#11A3FF,12 dB roll-off
12.02027027027027,0.9761249277081536,Milne13,Milne (2013),harmonicity,#11A3FF,12 dB roll-off
12.02077077077077,0.9761034774462172,Milne13,Milne (2013),harmonicity,#11A3FF,12 dB roll-off
12.02127127127127,0.9760813691238712,Milne13,Milne (2013),harmonicity,#11A3FF,12 dB roll-off
12.021771771771771,0.9760585918265434,Milne13,Milne (2013),harmonicity,#11A3FF,12 dB roll-off
12.022272272272271,0.9760351343791323,Milne13,Milne (2013),harmonicity,#11A3FF,12 dB roll-off
12.022772772772774,0.9760109853469867,Milne13,Milne (2013),harmonicity,#11A3FF,12 dB roll-off
12.023273273273274,0.9759861330369198,Milne13,Milne (2013),harmonicity,#11A3FF,12 dB roll-off
12.023773773773774,0.975960565498249,Milne13,Milne (2013),harmonicity,#11A3FF,12 dB roll-off
12.024274274274275,0.9759342705238682,Milne13,Milne (2013),harmonicity,#11A3FF,12 dB roll-off
12.024774774774775,0.9759072356513507,Milne13,Milne (2013),harmonicity,#11A3FF,12 dB roll-off
12.025275275275275,0.9758794481640706,Milne13,Milne (2013),harmonicity,#11A3FF,12 dB roll-off
12.025775775775776,0.9758508950923643,Milne13,Milne (2013),harmonicity,#11A3FF,12 dB roll-off
12.026276276276276,0.9758215632147087,Milne13,Milne (2013),harmonicity,#11A3FF,12 dB roll-off
12.026776776776776,0.9757914390589234,Milne13,Milne (2013),harmonicity,#11A3FF,12 dB roll-off
12.027277277277276,0.9757605089034073,Milne13,Milne (2013),harmonicity,#11A3FF,12 dB roll-off
12.027777777777779,0.9757287587783829,Milne13,Milne (2013),harmonicity,#11A3FF,12 dB roll-off
12.028278278278279,0.9756961744671794,Milne13,Milne (2013),harmonicity,#11A3FF,12 dB roll-off
12.02877877877878,0.9756627415075246,Milne13,Milne (2013),harmonicity,#11A3FF,12 dB roll-off
12.02927927927928,0.9756284451928602,Milne13,Milne (2013),harmonicity,#11A3FF,12 dB roll-off
12.02977977977978,0.9755932705736832,Milne13,Milne (2013),harmonicity,#11A3FF,12 dB roll-off
12.03028028028028,0.9755572024588927,Milne13,Milne (2013),harmonicity,#11A3FF,12 dB roll-off
12.03078078078078,0.9755202254171682,Milne13,Milne (2013),harmonicity,#11A3FF,12 dB roll-off
12.03128128128128,0.9754823237783543,Milne13,Milne (2013),harmonicity,#11A3FF,12 dB roll-off
12.031781781781781,0.9754434816348666,Milne13,Milne (2013),harmonicity,#11A3FF,12 dB roll-off
12.032282282282281,0.9754036828431106,Milne13,Milne (2013),harmonicity,#11A3FF,12 dB roll-off
12.032782782782784,0.9753629110249147,Milne13,Milne (2013),harmonicity,#11A3FF,12 dB roll-off
12.033283283283284,0.975321149568978,Milne13,Milne (2013),harmonicity,#11A3FF,12 dB roll-off
12.033783783783784,0.9752783816323259,Milne13,Milne (2013),harmonicity,#11A3FF,12 dB roll-off
12.034284284284285,0.9752345901417848,Milne13,Milne (2013),harmonicity,#11A3FF,12 dB roll-off
12.034784784784785,0.9751897577954604,Milne13,Milne (2013),harmonicity,#11A3FF,12 dB roll-off
12.035285285285285,0.9751438670642296,Milne13,Milne (2013),harmonicity,#11A3FF,12 dB roll-off
12.035785785785786,0.9750969001932408,Milne13,Milne (2013),harmonicity,#11A3FF,12 dB roll-off
12.036286286286286,0.9750488392034271,Milne13,Milne (2013),harmonicity,#11A3FF,12 dB roll-off
12.036786786786786,0.97499966589302,Milne13,Milne (2013),harmonicity,#11A3FF,12 dB roll-off
12.037287287287286,0.9749493618390751,Milne13,Milne (2013),harmonicity,#11A3FF,12 dB roll-off
12.037787787787789,0.9748979083990068,Milne13,Milne (2013),harmonicity,#11A3FF,12 dB roll-off
12.038288288288289,0.9748452867121258,Milne13,Milne (2013),harmonicity,#11A3FF,12 dB roll-off
12.03878878878879,0.974791477701183,Milne13,Milne (2013),harmonicity,#11A3FF,12 dB roll-off
12.03928928928929,0.9747364620739231,Milne13,Milne (2013),harmonicity,#11A3FF,12 dB roll-off
12.03978978978979,0.9746802203246373,Milne13,Milne (2013),harmonicity,#11A3FF,12 dB roll-off
12.04029029029029,0.9746227327357212,Milne13,Milne (2013),harmonicity,#11A3FF,12 dB roll-off
12.04079079079079,0.9745639793792469,Milne13,Milne (2013),harmonicity,#11A3FF,12 dB roll-off
12.04129129129129,0.9745039401185238,Milne13,Milne (2013),harmonicity,#11A3FF,12 dB roll-off
12.041791791791791,0.9744425946096794,Milne13,Milne (2013),harmonicity,#11A3FF,12 dB roll-off
12.042292292292291,0.9743799223032282,Milne13,Milne (2013),harmonicity,#11A3FF,12 dB roll-off
12.042792792792794,0.9743159024456586,Milne13,Milne (2013),harmonicity,#11A3FF,12 dB roll-off
12.043293293293294,0.9742505140810143,Milne13,Milne (2013),harmonicity,#11A3FF,12 dB roll-off
12.043793793793794,0.9741837360524798,Milne13,Milne (2013),harmonicity,#11A3FF,12 dB roll-off
12.044294294294295,0.9741155470039772,Milne13,Milne (2013),harmonicity,#11A3FF,12 dB roll-off
12.044794794794795,0.974045925381755,Milne13,Milne (2013),harmonicity,#11A3FF,12 dB roll-off
12.045295295295295,0.9739748494359878,Milne13,Milne (2013),harmonicity,#11A3FF,12 dB roll-off
12.045795795795796,0.9739022972223796,Milne13,Milne (2013),harmonicity,#11A3FF,12 dB roll-off
12.046296296296296,0.973828246603769,Milne13,Milne (2013),harmonicity,#11A3FF,12 dB roll-off
12.046796796796796,0.9737526752517369,Milne13,Milne (2013),harmonicity,#11A3FF,12 dB roll-off
12.047297297297296,0.9736755606482268,Milne13,Milne (2013),harmonicity,#11A3FF,12 dB roll-off
12.047797797797799,0.9735968800871568,Milne13,Milne (2013),harmonicity,#11A3FF,12 dB roll-off
12.048298298298299,0.9735166106760472,Milne13,Milne (2013),harmonicity,#11A3FF,12 dB roll-off
12.0487987987988,0.9734347293376487,Milne13,Milne (2013),harmonicity,#11A3FF,12 dB roll-off
12.0492992992993,0.9733512128115801,Milne13,Milne (2013),harmonicity,#11A3FF,12 dB roll-off
12.0497997997998,0.9732660376559672,Milne13,Milne (2013),harmonicity,#11A3FF,12 dB roll-off
12.0503003003003,0.973179180249088,Milne13,Milne (2013),harmonicity,#11A3FF,12 dB roll-off
12.0508008008008,0.9730906167910358,Milne13,Milne (2013),harmonicity,#11A3FF,12 dB roll-off
12.0513013013013,0.9730003233053763,Milne13,Milne (2013),harmonicity,#11A3FF,12 dB roll-off
12.051801801801801,0.9729082756408185,Milne13,Milne (2013),harmonicity,#11A3FF,12 dB roll-off
12.052302302302301,0.9728144494728989,Milne13,Milne (2013),harmonicity,#11A3FF,12 dB roll-off
12.052802802802804,0.9727188203056683,Milne13,Milne (2013),harmonicity,#11A3FF,12 dB roll-off
12.053303303303304,0.9726213634733917,Milne13,Milne (2013),harmonicity,#11A3FF,12 dB roll-off
12.053803803803804,0.9725220541422649,Milne13,Milne (2013),harmonicity,#11A3FF,12 dB roll-off
12.054304304304305,0.9724208673121321,Milne13,Milne (2013),harmonicity,#11A3FF,12 dB roll-off
12.054804804804805,0.9723177778182208,Milne13,Milne (2013),harmonicity,#11A3FF,12 dB roll-off
12.055305305305305,0.9722127603328942,Milne13,Milne (2013),harmonicity,#11A3FF,12 dB roll-off
12.055805805805806,0.9721057893674115,Milne13,Milne (2013),harmonicity,#11A3FF,12 dB roll-off
12.056306306306306,0.971996839273706,Milne13,Milne (2013),harmonicity,#11A3FF,12 dB roll-off
12.056806806806806,0.9718858842461742,Milne13,Milne (2013),harmonicity,#11A3FF,12 dB roll-off
12.057307307307306,0.9717728983234917,Milne13,Milne (2013),harmonicity,#11A3FF,12 dB roll-off
12.057807807807809,0.9716578553904384,Milne13,Milne (2013),harmonicity,#11A3FF,12 dB roll-off
12.058308308308309,0.9715407291797364,Milne13,Milne (2013),harmonicity,#11A3FF,12 dB roll-off
12.05880880880881,0.971421493273924,Milne13,Milne (2013),harmonicity,#11A3FF,12 dB roll-off
12.05930930930931,0.9713001211072346,Milne13,Milne (2013),harmonicity,#11A3FF,12 dB roll-off
12.05980980980981,0.9711765859675001,Milne13,Milne (2013),harmonicity,#11A3FF,12 dB roll-off
12.06031031031031,0.9710508609980801,Milne13,Milne (2013),harmonicity,#11A3FF,12 dB roll-off
12.06081081081081,0.9709229191998101,Milne13,Milne (2013),harmonicity,#11A3FF,12 dB roll-off
12.06131131131131,0.9707927334329753,Milne13,Milne (2013),harmonicity,#11A3FF,12 dB roll-off
12.061811811811811,0.9706602764193064,Milne13,Milne (2013),harmonicity,#11A3FF,12 dB roll-off
12.062312312312311,0.9705255207440012,Milne13,Milne (2013),harmonicity,#11A3FF,12 dB roll-off
12.062812812812814,0.970388438857778,Milne13,Milne (2013),harmonicity,#11A3FF,12 dB roll-off
12.063313313313314,0.9702490030789473,Milne13,Milne (2013),harmonicity,#11A3FF,12 dB roll-off
12.063813813813814,0.970107185595519,Milne13,Milne (2013),harmonicity,#11A3FF,12 dB roll-off
12.064314314314315,0.9699629584673344,Milne13,Milne (2013),harmonicity,#11A3FF,12 dB roll-off
12.064814814814815,0.9698162936282296,Milne13,Milne (2013),harmonicity,#11A3FF,12 dB roll-off
12.065315315315315,0.9696671628882333,Milne13,Milne (2013),harmonicity,#11A3FF,12 dB roll-off
12.065815815815816,0.9695155379357884,Milne13,Milne (2013),harmonicity,#11A3FF,12 dB roll-off
12.066316316316316,0.9693613903400149,Milne13,Milne (2013),harmonicity,#11A3FF,12 dB roll-off
12.066816816816816,0.9692046915530007,Milne13,Milne (2013),harmonicity,#11A3FF,12 dB roll-off
12.067317317317316,0.9690454129121295,Milne13,Milne (2013),harmonicity,#11A3FF,12 dB roll-off
12.067817817817819,0.9688835256424434,Milne13,Milne (2013),harmonicity,#11A3FF,12 dB roll-off
12.068318318318319,0.9687190008590431,Milne13,Milne (2013),harmonicity,#11A3FF,12 dB roll-off
12.06881881881882,0.9685518095695235,Milne13,Milne (2013),harmonicity,#11A3FF,12 dB roll-off
12.06931931931932,0.9683819226764477,Milne13,Milne (2013),harmonicity,#11A3FF,12 dB roll-off
12.06981981981982,0.9682093109798625,Milne13,Milne (2013),harmonicity,#11A3FF,12 dB roll-off
12.07032032032032,0.9680339451798486,Milne13,Milne (2013),harmonicity,#11A3FF,12 dB roll-off
12.07082082082082,0.9678557958791172,Milne13,Milne (2013),harmonicity,#11A3FF,12 dB roll-off
12.07132132132132,0.9676748335856475,Milne13,Milne (2013),harmonicity,#11A3FF,12 dB roll-off
12.071821821821821,0.9674910287153579,Milne13,Milne (2013),harmonicity,#11A3FF,12 dB roll-off
12.072322322322321,0.9673043515948345,Milne13,Milne (2013),harmonicity,#11A3FF,12 dB roll-off
12.072822822822824,0.967114772464093,Milne13,Milne (2013),harmonicity,#11A3FF,12 dB roll-off
12.073323323323324,0.96692226147939,Milne13,Milne (2013),harmonicity,#11A3FF,12 dB roll-off
12.073823823823824,0.9667267887160793,Milne13,Milne (2013),harmonicity,#11A3FF,12 dB roll-off
12.074324324324325,0.9665283241715142,Milne13,Milne (2013),harmonicity,#11A3FF,12 dB roll-off
12.074824824824825,0.9663268377679997,Milne13,Milne (2013),harmonicity,#11A3FF,12 dB roll-off
12.075325325325325,0.9661222993557872,Milne13,Milne (2013),harmonicity,#11A3FF,12 dB roll-off
12.075825825825826,0.9659146787161278,Milne13,Milne (2013),harmonicity,#11A3FF,12 dB roll-off
12.076326326326326,0.9657039455643656,Milne13,Milne (2013),harmonicity,#11A3FF,12 dB roll-off
12.076826826826826,0.9654900695530886,Milne13,Milne (2013),harmonicity,#11A3FF,12 dB roll-off
12.077327327327327,0.9652730202753296,Milne13,Milne (2013),harmonicity,#11A3FF,12 dB roll-off
12.077827827827829,0.9650527672678167,Milne13,Milne (2013),harmonicity,#11A3FF,12 dB roll-off
12.078328328328329,0.9648292800142872,Milne13,Milne (2013),harmonicity,#11A3FF,12 dB roll-off
12.07882882882883,0.9646025279488374,Milne13,Milne (2013),harmonicity,#11A3FF,12 dB roll-off
12.07932932932933,0.9643724804593471,Milne13,Milne (2013),harmonicity,#11A3FF,12 dB roll-off
12.07982982982983,0.9641391068909506,Milne13,Milne (2013),harmonicity,#11A3FF,12 dB roll-off
12.08033033033033,0.9639023765495647,Milne13,Milne (2013),harmonicity,#11A3FF,12 dB roll-off
12.08083083083083,0.9636622587054772,Milne13,Milne (2013),harmonicity,#11A3FF,12 dB roll-off
12.08133133133133,0.9634187225969948,Milne13,Milne (2013),harmonicity,#11A3FF,12 dB roll-off
12.081831831831831,0.9631717374341461,Milne13,Milne (2013),harmonicity,#11A3FF,12 dB roll-off
12.082332332332332,0.9629212724024554,Milne13,Milne (2013),harmonicity,#11A3FF,12 dB roll-off
12.082832832832834,0.9626672966667651,Milne13,Milne (2013),harmonicity,#11A3FF,12 dB roll-off
12.083333333333334,0.962409779375136,Milne13,Milne (2013),harmonicity,#11A3FF,12 dB roll-off
12.083833833833834,0.9621486896627992,Milne13,Milne (2013),harmonicity,#11A3FF,12 dB roll-off
12.084334334334335,0.9618839966561802,Milne13,Milne (2013),harmonicity,#11A3FF,12 dB roll-off
12.084834834834835,0.9616156694769915,Milne13,Milne (2013),harmonicity,#11A3FF,12 dB roll-off
12.085335335335335,0.9613436772463827,Milne13,Milne (2013),harmonicity,#11A3FF,12 dB roll-off
12.085835835835836,0.9610679890891708,Milne13,Milne (2013),harmonicity,#11A3FF,12 dB roll-off
12.086336336336336,0.9607885741381337,Milne13,Milne (2013),harmonicity,#11A3FF,12 dB roll-off
12.086836836836836,0.9605054015383795,Milne13,Milne (2013),harmonicity,#11A3FF,12 dB roll-off
12.087337337337337,0.9602184404517856,Milne13,Milne (2013),harmonicity,#11A3FF,12 dB roll-off
12.087837837837839,0.9599276600615135,Milne13,Milne (2013),harmonicity,#11A3FF,12 dB roll-off
12.088338338338339,0.9596330295765957,Milne13,Milne (2013),harmonicity,#11A3FF,12 dB roll-off
12.08883883883884,0.959334518236608,Milne13,Milne (2013),harmonicity,#11A3FF,12 dB roll-off
12.08933933933934,0.9590320953164118,Milne13,Milne (2013),harmonicity,#11A3FF,12 dB roll-off
12.08983983983984,0.9587257301309806,Milne13,Milne (2013),harmonicity,#11A3FF,12 dB roll-off
12.09034034034034,0.9584153920403103,Milne13,Milne (2013),harmonicity,#11A3FF,12 dB roll-off
12.09084084084084,0.9581010504544065,Milne13,Milne (2013),harmonicity,#11A3FF,12 dB roll-off
12.09134134134134,0.9577826748383631,Milne13,Milne (2013),harmonicity,#11A3FF,12 dB roll-off
12.091841841841841,0.9574602347175284,Milne13,Milne (2013),harmonicity,#11A3FF,12 dB roll-off
12.092342342342342,0.9571336996827545,Milne13,Milne (2013),harmonicity,#11A3FF,12 dB roll-off
12.092842842842844,0.9568030393957446,Milne13,Milne (2013),harmonicity,#11A3FF,12 dB roll-off
12.093343343343344,0.9564682235944874,Milne13,Milne (2013),harmonicity,#11A3FF,12 dB roll-off
12.093843843843844,0.9561292220987893,Milne13,Milne (2013),harmonicity,#11A3FF,12 dB roll-off
12.094344344344345,0.9557860048159033,Milne13,Milne (2013),harmonicity,#11A3FF,12 dB roll-off
12.094844844844845,0.9554385417462573,Milne13,Milne (2013),harmonicity,#11A3FF,12 dB roll-off
12.095345345345345,0.9550868029892811,Milne13,Milne (2013),harmonicity,#11A3FF,12 dB roll-off
12.095845845845846,0.9547307587493471,Milne13,Milne (2013),harmonicity,#11A3FF,12 dB roll-off
12.096346346346346,0.954370379341798,Milne13,Milne (2013),harmonicity,#11A3FF,12 dB roll-off
12.096846846846846,0.9540056351991051,Milne13,Milne (2013),harmonicity,#11A3FF,12 dB roll-off
12.097347347347347,0.9536364968771196,Milne13,Milne (2013),harmonicity,#11A3FF,12 dB roll-off
12.097847847847849,0.9532629350614501,Milne13,Milne (2013),harmonicity,#11A3FF,12 dB roll-off
12.098348348348349,0.9528849205739509,Milne13,Milne (2013),harmonicity,#11A3FF,12 dB roll-off
12.09884884884885,0.952502424379326,Milne13,Milne (2013),harmonicity,#11A3FF,12 dB roll-off
12.09934934934935,0.9521154175918618,Milne13,Milne (2013),harmonicity,#11A3FF,12 dB roll-off
12.09984984984985,0.9517238714822807,Milne13,Milne (2013),harmonicity,#11A3FF,12 dB roll-off
12.10035035035035,0.9513277574847201,Milne13,Milne (2013),harmonicity,#11A3FF,12 dB roll-off
12.10085085085085,0.9509270472038449,Milne13,Milne (2013),harmonicity,#11A3FF,12 dB roll-off
12.10135135135135,0.9505217124220948,Milne13,Milne (2013),harmonicity,#11A3FF,12 dB roll-off
12.101851851851851,0.9501117251070607,Milne13,Milne (2013),harmonicity,#11A3FF,12 dB roll-off
12.102352352352352,0.9496970574190068,Milne13,Milne (2013),harmonicity,#11A3FF,12 dB roll-off
12.102852852852854,0.9492776817185358,Milne13,Milne (2013),harmonicity,#11A3FF,12 dB roll-off
12.103353353353354,0.9488535705743999,Milne13,Milne (2013),harmonicity,#11A3FF,12 dB roll-off
12.103853853853854,0.9484246967714484,Milne13,Milne (2013),harmonicity,#11A3FF,12 dB roll-off
12.104354354354355,0.9479910333187505,Milne13,Milne (2013),harmonicity,#11A3FF,12 dB roll-off
12.104854854854855,0.947552553457852,Milne13,Milne (2013),harmonicity,#11A3FF,12 dB roll-off
12.105355355355355,0.9471092306712051,Milne13,Milne (2013),harmonicity,#11A3FF,12 dB roll-off
12.105855855855856,0.9466610386907558,Milne13,Milne (2013),harmonicity,#11A3FF,12 dB roll-off
12.106356356356356,0.9462079515066955,Milne13,Milne (2013),harmonicity,#11A3FF,12 dB roll-off
12.106856856856856,0.9457499433763854,Milne13,Milne (2013),harmonicity,#11A3FF,12 dB roll-off
12.107357357357357,0.9452869888334511,Milne13,Milne (2013),harmonicity,#11A3FF,12 dB roll-off
12.107857857857859,0.9448190626970512,Milne13,Milne (2013),harmonicity,#11A3FF,12 dB roll-off
12.108358358358359,0.9443461400813418,Milne13,Milne (2013),harmonicity,#11A3FF,12 dB roll-off
12.10885885885886,0.9438681964050941,Milne13,Milne (2013),harmonicity,#11A3FF,12 dB roll-off
12.10935935935936,0.9433852074015293,Milne13,Milne (2013),harmonicity,#11A3FF,12 dB roll-off
12.10985985985986,0.9428971491283267,Milne13,Milne (2013),harmonicity,#11A3FF,12 dB roll-off
12.11036036036036,0.9424039979778296,Milne13,Milne (2013),harmonicity,#11A3FF,12 dB roll-off
12.11086086086086,0.9419057306874491,Milne13,Milne (2013),harmonicity,#11A3FF,12 dB roll-off
12.11136136136136,0.9414023243502675,Milne13,Milne (2013),harmonicity,#11A3FF,12 dB roll-off
12.111861861861861,0.9408937564258512,Milne13,Milne (2013),harmonicity,#11A3FF,12 dB roll-off
12.112362362362362,0.9403800047512593,Milne13,Milne (2013),harmonicity,#11A3FF,12 dB roll-off
12.112862862862864,0.9398610475522721,Milne13,Milne (2013),harmonicity,#11A3FF,12 dB roll-off
12.113363363363364,0.9393368634548418,Milne13,Milne (2013),harmonicity,#11A3FF,12 dB roll-off
12.113863863863864,0.9388074314967326,Milne13,Milne (2013),harmonicity,#11A3FF,12 dB roll-off
12.114364364364365,0.9382727311394098,Milne13,Milne (2013),harmonicity,#11A3FF,12 dB roll-off
12.114864864864865,0.9377327422801365,Milne13,Milne (2013),harmonicity,#11A3FF,12 dB roll-off
12.115365365365365,0.9371874452643003,Milne13,Milne (2013),harmonicity,#11A3FF,12 dB roll-off
12.115865865865866,0.9366368208979711,Milne13,Milne (2013),harmonicity,#11A3FF,12 dB roll-off
12.116366366366366,0.9360808504606829,Milne13,Milne (2013),harmonicity,#11A3FF,12 dB roll-off
12.116866866866866,0.935519515718459,Milne13,Milne (2013),harmonicity,#11A3FF,12 dB roll-off
12.117367367367367,0.9349527989370632,Milne13,Milne (2013),harmonicity,#11A3FF,12 dB roll-off
12.117867867867869,0.9343806828954965,Milne13,Milne (2013),harmonicity,#11A3FF,12 dB roll-off
12.118368368368369,0.933803150899738,Milne13,Milne (2013),harmonicity,#11A3FF,12 dB roll-off
12.11886886886887,0.9332201867967086,Milne13,Milne (2013),harmonicity,#11A3FF,12 dB roll-off
12.11936936936937,0.9326317749885034,Milne13,Milne (2013),harmonicity,#11A3FF,12 dB roll-off
12.11986986986987,0.9320379004468484,Milne13,Milne (2013),harmonicity,#11A3FF,12 dB roll-off
12.12037037037037,0.9314385487278166,Milne13,Milne (2013),harmonicity,#11A3FF,12 dB roll-off
12.12087087087087,0.930833705986786,Milne13,Milne (2013),harmonicity,#11A3FF,12 dB roll-off
12.121371371371371,0.9302233589936448,Milne13,Milne (2013),harmonicity,#11A3FF,12 dB roll-off
12.121871871871871,0.9296074951482421,Milne13,Milne (2013),harmonicity,#11A3FF,12 dB roll-off
12.122372372372372,0.9289861024960964,Milne13,Milne (2013),harmonicity,#11A3FF,12 dB roll-off
12.122872872872874,0.9283591697443342,Milne13,Milne (2013),harmonicity,#11A3FF,12 dB roll-off
12.123373373373374,0.9277266862779081,Milne13,Milne (2013),harmonicity,#11A3FF,12 dB roll-off
12.123873873873874,0.9270886421760146,Milne13,Milne (2013),harmonicity,#11A3FF,12 dB roll-off
12.124374374374375,0.9264450282287953,Milne13,Milne (2013),harmonicity,#11A3FF,12 dB roll-off
12.124874874874875,0.9257958359542678,Milne13,Milne (2013),harmonicity,#11A3FF,12 dB roll-off
12.125375375375375,0.9251410576154966,Milne13,Milne (2013),harmonicity,#11A3FF,12 dB roll-off
12.125875875875876,0.9244806862380028,Milne13,Milne (2013),harmonicity,#11A3FF,12 dB roll-off
12.126376376376376,0.9238147156274147,Milne13,Milne (2013),harmonicity,#11A3FF,12 dB roll-off
12.126876876876876,0.9231431403873444,Milne13,Milne (2013),harmonicity,#11A3FF,12 dB roll-off
12.127377377377377,0.9224659559374969,Milne13,Milne (2013),harmonicity,#11A3FF,12 dB roll-off
12.127877877877879,0.921783158532,Milne13,Milne (2013),harmonicity,#11A3FF,12 dB roll-off
12.128378378378379,0.9210947452779666,Milne13,Milne (2013),harmonicity,#11A3FF,12 dB roll-off
12.12887887887888,0.920400714154244,Milne13,Milne (2013),harmonicity,#11A3FF,12 dB roll-off
12.12937937937938,0.9197010640304005,Milne13,Milne (2013),harmonicity,#11A3FF,12 dB roll-off
12.12987987987988,0.9189957946858979,Milne13,Milne (2013),harmonicity,#11A3FF,12 dB roll-off
12.13038038038038,0.9182849068294598,Milne13,Milne (2013),harmonicity,#11A3FF,12 dB roll-off
12.13088088088088,0.9175684021186348,Milne13,Milne (2013),harmonicity,#11A3FF,12 dB roll-off
12.131381381381381,0.9168462831795268,Milne13,Milne (2013),harmonicity,#11A3FF,12 dB roll-off
12.131881881881881,0.9161185536267035,Milne13,Milne (2013),harmonicity,#11A3FF,12 dB roll-off
12.132382382382382,0.9153852180832627,Milne13,Milne (2013),harmonicity,#11A3FF,12 dB roll-off
12.132882882882884,0.9146462822010445,Milne13,Milne (2013),harmonicity,#11A3FF,12 dB roll-off
12.133383383383384,0.9139017526809993,Milne13,Milne (2013),harmonicity,#11A3FF,12 dB roll-off
12.133883883883884,0.9131516372936519,Milne13,Milne (2013),harmonicity,#11A3FF,12 dB roll-off
12.134384384384385,0.9123959448997107,Milne13,Milne (2013),harmonicity,#11A3FF,12 dB roll-off
12.134884884884885,0.9116346854707632,Milne13,Milne (2013),harmonicity,#11A3FF,12 dB roll-off
12.135385385385385,0.9108678701100599,Milne13,Milne (2013),harmonicity,#11A3FF,12 dB roll-off
12.135885885885886,0.9100955110733773,Milne13,Milne (2013),harmonicity,#11A3FF,12 dB roll-off
12.136386386386386,0.9093176217899337,Milne13,Milne (2013),harmonicity,#11A3FF,12 dB roll-off
12.136886886886886,0.9085342168833449,Milne13,Milne (2013),harmonicity,#11A3FF,12 dB roll-off
12.137387387387387,0.9077453121926081,Milne13,Milne (2013),harmonicity,#11A3FF,12 dB roll-off
12.137887887887889,0.9069509247930871,Milne13,Milne (2013),harmonicity,#11A3FF,12 dB roll-off
12.138388388388389,0.9061510730174923,Milne13,Milne (2013),harmonicity,#11A3FF,12 dB roll-off
12.13888888888889,0.9053457764768168,Milne13,Milne (2013),harmonicity,#11A3FF,12 dB roll-off
12.13938938938939,0.904535056081226,Milne13,Milne (2013),harmonicity,#11A3FF,12 dB roll-off
12.13988988988989,0.9037189340608719,Milne13,Milne (2013),harmonicity,#11A3FF,12 dB roll-off
12.14039039039039,0.9028974339866126,Milne13,Milne (2013),harmonicity,#11A3FF,12 dB roll-off
12.14089089089089,0.9020705807906051,Milne13,Milne (2013),harmonicity,#11A3FF,12 dB roll-off
12.141391391391391,0.901238400786758,Milne13,Milne (2013),harmonicity,#11A3FF,12 dB roll-off
12.141891891891891,0.9004009216910154,Milne13,Milne (2013),harmonicity,#11A3FF,12 dB roll-off
12.142392392392392,0.8995581726414408,Milne13,Milne (2013),harmonicity,#11A3FF,12 dB roll-off
12.142892892892894,0.8987101842180811,Milne13,Milne (2013),harmonicity,#11A3FF,12 dB roll-off
12.143393393393394,0.8978569884625899,Milne13,Milne (2013),harmonicity,#11A3FF,12 dB roll-off
12.143893893893894,0.8969986188975491,Milne13,Milne (2013),harmonicity,#11A3FF,12 dB roll-off
12.144394394394395,0.8961351105455024,Milne13,Milne (2013),harmonicity,#11A3FF,12 dB roll-off
12.144894894894895,0.8952664999476498,Milne13,Milne (2013),harmonicity,#11A3FF,12 dB roll-off
12.145395395395395,0.8943928251821553,Milne13,Milne (2013),harmonicity,#11A3FF,12 dB roll-off
12.145895895895896,0.8935141258820736,Milne13,Milne (2013),harmonicity,#11A3FF,12 dB roll-off
12.146396396396396,0.8926304432528295,Milne13,Milne (2013),harmonicity,#11A3FF,12 dB roll-off
12.146896896896896,0.8917418200892316,Milne13,Milne (2013),harmonicity,#11A3FF,12 dB roll-off
12.147397397397397,0.8908483007919845,Milne13,Milne (2013),harmonicity,#11A3FF,12 dB roll-off
12.147897897897899,0.8899499313836613,Milne13,Milne (2013),harmonicity,#11A3FF,12 dB roll-off
12.148398398398399,0.8890467595241119,Milne13,Milne (2013),harmonicity,#11A3FF,12 dB roll-off
12.1488988988989,0.8881388345252392,Milne13,Milne (2013),harmonicity,#11A3FF,12 dB roll-off
12.1493993993994,0.8872262073651526,Milne13,Milne (2013),harmonicity,#11A3FF,12 dB roll-off
12.1498998998999,0.8863089307016215,Milne13,Milne (2013),harmonicity,#11A3FF,12 dB roll-off
12.1504004004004,0.8853870588848105,Milne13,Milne (2013),harmonicity,#11A3FF,12 dB roll-off
12.1509009009009,0.8844606479692491,Milne13,Milne (2013),harmonicity,#11A3FF,12 dB roll-off
12.151401401401401,0.8835297557250061,Milne13,Milne (2013),harmonicity,#11A3FF,12 dB roll-off
12.151901901901901,0.8825944416480148,Milne13,Milne (2013),harmonicity,#11A3FF,12 dB roll-off
12.152402402402402,0.8816547669695216,Milne13,Milne (2013),harmonicity,#11A3FF,12 dB roll-off
12.152902902902904,0.880710794664608,Milne13,Milne (2013),harmonicity,#11A3FF,12 dB roll-off
12.153403403403404,0.879762589459775,Milne13,Milne (2013),harmonicity,#11A3FF,12 dB roll-off
12.153903903903904,0.8788102178394771,Milne13,Milne (2013),harmonicity,#11A3FF,12 dB roll-off
12.154404404404405,0.8778537480516584,Milne13,Milne (2013),harmonicity,#11A3FF,12 dB roll-off
12.154904904904905,0.8768932501121842,Milne13,Milne (2013),harmonicity,#11A3FF,12 dB roll-off
12.155405405405405,0.8759287958081508,Milne13,Milne (2013),harmonicity,#11A3FF,12 dB roll-off
12.155905905905906,0.8749604587000328,Milne13,Milne (2013),harmonicity,#11A3FF,12 dB roll-off
12.156406406406406,0.8739883141226251,Milne13,Milne (2013),harmonicity,#11A3FF,12 dB roll-off
12.156906906906906,0.8730124391847389,Milne13,Milne (2013),harmonicity,#11A3FF,12 dB roll-off
12.157407407407407,0.8720329127676153,Milne13,Milne (2013),harmonicity,#11A3FF,12 dB roll-off
12.157907907907909,0.8710498155220183,Milne13,Milne (2013),harmonicity,#11A3FF,12 dB roll-off
12.158408408408409,0.8700632298639701,Milne13,Milne (2013),harmonicity,#11A3FF,12 dB roll-off
12.15890890890891,0.8690732399690756,Milne13,Milne (2013),harmonicity,#11A3FF,12 dB roll-off
12.15940940940941,0.8680799317654311,Milne13,Milne (2013),harmonicity,#11A3FF,12 dB roll-off
12.15990990990991,0.867083392925053,Milne13,Milne (2013),harmonicity,#11A3FF,12 dB roll-off
12.16041041041041,0.8660837128538103,Milne13,Milne (2013),harmonicity,#11A3FF,12 dB roll-off
12.16091091091091,0.8650809826798133,Milne13,Milne (2013),harmonicity,#11A3FF,12 dB roll-off
12.161411411411411,0.8640752952402431,Milne13,Milne (2013),harmonicity,#11A3FF,12 dB roll-off
12.161911911911911,0.8630667450665777,Milne13,Milne (2013),harmonicity,#11A3FF,12 dB roll-off
12.162412412412412,0.862055428368196,Milne13,Milne (2013),harmonicity,#11A3FF,12 dB roll-off
12.162912912912914,0.8610414430143212,Milne13,Milne (2013),harmonicity,#11A3FF,12 dB roll-off
12.163413413413414,0.8600248885143117,Milne13,Milne (2013),harmonicity,#11A3FF,12 dB roll-off
12.163913913913914,0.8590058659962024,Milne13,Milne (2013),harmonicity,#11A3FF,12 dB roll-off
12.164414414414415,0.8579844781835757,Milne13,Milne (2013),harmonicity,#11A3FF,12 dB roll-off
12.164914914914915,0.8569608293706631,Milne13,Milne (2013),harmonicity,#11A3FF,12 dB roll-off
12.165415415415415,0.8559350253956968,Milne13,Milne (2013),harmonicity,#11A3FF,12 dB roll-off
12.165915915915916,0.8549071736124917,Milne13,Milne (2013),harmonicity,#11A3FF,12 dB roll-off
12.166416416416416,0.8538773828602416,Milne13,Milne (2013),harmonicity,#11A3FF,12 dB roll-off
12.166916916916916,0.8528457634315272,Milne13,Milne (2013),harmonicity,#11A3FF,12 dB roll-off
12.167417417417417,0.8518124270385267,Milne13,Milne (2013),harmonicity,#11A3FF,12 dB roll-off
12.167917917917919,0.8507774867774203,Milne13,Milne (2013),harmonicity,#11A3FF,12 dB roll-off
12.168418418418419,0.8497410570910143,Milne13,Milne (2013),harmonicity,#11A3FF,12 dB roll-off
12.16891891891892,0.8487032537295275,Milne13,Milne (2013),harmonicity,#11A3FF,12 dB roll-off
12.16941941941942,0.8476641937096269,Milne13,Milne (2013),harmonicity,#11A3FF,12 dB roll-off
12.16991991991992,0.8466239952716612,Milne13,Milne (2013),harmonicity,#11A3FF,12 dB roll-off
12.17042042042042,0.8455827778351216,Milne13,Milne (2013),harmonicity,#11A3FF,12 dB roll-off
12.17092092092092,0.8445406619523614,Milne13,Milne (2013),harmonicity,#11A3FF,12 dB roll-off
12.171421421421421,0.8434977692605664,Milne13,Milne (2013),harmonicity,#11A3FF,12 dB roll-off
12.171921921921921,0.842454222432025,Milne13,Milne (2013),harmonicity,#11A3FF,12 dB roll-off
12.172422422422422,0.8414101451227038,Milne13,Milne (2013),harmonicity,#11A3FF,12 dB roll-off
12.172922922922924,0.8403656619191725,Milne13,Milne (2013),harmonicity,#11A3FF,12 dB roll-off
12.173423423423424,0.8393208982839165,Milne13,Milne (2013),harmonicity,#11A3FF,12 dB roll-off
12.173923923923924,0.838275980499038,Milne13,Milne (2013),harmonicity,#11A3FF,12 dB roll-off
12.174424424424425,0.8372310356084395,Milne13,Milne (2013),harmonicity,#11A3FF,12 dB roll-off
12.174924924924925,0.8361861913584998,Milne13,Milne (2013),harmonicity,#11A3FF,12 dB roll-off
12.175425425425425,0.835141576137295,Milne13,Milne (2013),harmonicity,#11A3FF,12 dB roll-off
12.175925925925926,0.8340973189124261,Milne13,Milne (2013),harmonicity,#11A3FF,12 dB roll-off
12.176426426426426,0.8330535491674973,Milne13,Milne (2013),harmonicity,#11A3FF,12 dB roll-off
12.176926926926926,0.8320103968373143,Milne13,Milne (2013),harmonicity,#11A3FF,12 dB roll-off
12.177427427427427,0.8309679922418565,Milne13,Milne (2013),harmonicity,#11A3FF,12 dB roll-off
12.177927927927929,0.8299264660190929,Milne13,Milne (2013),harmonicity,#11A3FF,12 dB roll-off
12.178428428428429,0.8288859490567184,Milne13,Milne (2013),harmonicity,#11A3FF,12 dB roll-off
12.17892892892893,0.8278465724228539,Milne13,Milne (2013),harmonicity,#11A3FF,12 dB roll-off
12.17942942942943,0.8268084672958271,Milne13,Milne (2013),harmonicity,#11A3FF,12 dB roll-off
12.17992992992993,0.8257717648930823,Milne13,Milne (2013),harmonicity,#11A3FF,12 dB roll-off
12.18043043043043,0.8247365963993094,Milne13,Milne (2013),harmonicity,#11A3FF,12 dB roll-off
12.18093093093093,0.8237030928938777,Milne13,Milne (2013),harmonicity,#11A3FF,12 dB roll-off
12.181431431431431,0.8226713852776577,Milne13,Milne (2013),harmonicity,#11A3FF,12 dB roll-off
12.181931931931931,0.8216416041993236,Milne13,Milne (2013),harmonicity,#11A3FF,12 dB roll-off
12.182432432432432,0.8206138799812237,Milne13,Milne (2013),harmonicity,#11A3FF,12 dB roll-off
12.182932932932934,0.8195883425449116,Milne13,Milne (2013),harmonicity,#11A3FF,12 dB roll-off
12.183433433433434,0.8185651213364495,Milne13,Milne (2013),harmonicity,#11A3FF,12 dB roll-off
12.183933933933934,0.8175443452515392,Milne13,Milne (2013),harmonicity,#11A3FF,12 dB roll-off
12.184434434434435,0.8165261425606286,Milne13,Milne (2013),harmonicity,#11A3FF,12 dB roll-off
12.184934934934935,0.8155106408340631,Milne13,Milne (2013),harmonicity,#11A3FF,12 dB roll-off
12.185435435435435,0.8144979668673915,Milne13,Milne (2013),harmonicity,#11A3FF,12 dB roll-off
12.185935935935936,0.8134882466069195,Milne13,Milne (2013),harmonicity,#11A3FF,12 dB roll-off
12.186436436436436,0.812481605075625,Milne13,Milne (2013),harmonicity,#11A3FF,12 dB roll-off
12.186936936936936,0.8114781662995283,Milne13,Milne (2013),harmonicity,#11A3FF,12 dB roll-off
12.187437437437438,0.8104780532346189,Milne13,Milne (2013),harmonicity,#11A3FF,12 dB roll-off
12.187937937937939,0.809481387694457,Milne13,Milne (2013),harmonicity,#11A3FF,12 dB roll-off
12.188438438438439,0.808488290278512,Milne13,Milne (2013),harmonicity,#11A3FF,12 dB roll-off
12.18893893893894,0.8074988803013874,Milne13,Milne (2013),harmonicity,#11A3FF,12 dB roll-off
12.18943943943944,0.8065132757230027,Milne13,Milne (2013),harmonicity,#11A3FF,12 dB roll-off
12.18993993993994,0.8055315930798298,Milne13,Milne (2013),harmonicity,#11A3FF,12 dB roll-off
12.19044044044044,0.8045539474172964,Milne13,Milne (2013),harmonicity,#11A3FF,12 dB roll-off
12.19094094094094,0.8035804522234405,Milne13,Milne (2013),harmonicity,#11A3FF,12 dB roll-off
12.191441441441441,0.8026112193639114,Milne13,Milne (2013),harmonicity,#11A3FF,12 dB roll-off
12.191941941941941,0.801646359018412,Milne13,Milne (2013),harmonicity,#11A3FF,12 dB roll-off
12.192442442442442,0.8006859796186657,Milne13,Milne (2013),harmonicity,#11A3FF,12 dB roll-off
12.192942942942944,0.7997301877879986,Milne13,Milne (2013),harmonicity,#11A3FF,12 dB roll-off
12.193443443443444,0.7987790882826333,Milne13,Milne (2013),harmonicity,#11A3FF,12 dB roll-off
12.193943943943944,0.7978327839347247,Milne13,Milne (2013),harmonicity,#11A3FF,12 dB roll-off
12.194444444444445,0.7968913755972914,Milne13,Milne (2013),harmonicity,#11A3FF,12 dB roll-off
12.194944944944945,0.7959549620910515,Milne13,Milne (2013),harmonicity,#11A3FF,12 dB roll-off
12.195445445445445,0.7950236401532664,Milne13,Milne (2013),harmonicity,#11A3FF,12 dB roll-off
12.195945945945946,0.7940975043886469,Milne13,Milne (2013),harmonicity,#11A3FF,12 dB roll-off
12.196446446446446,0.793176647222389,Milne13,Milne (2013),harmonicity,#11A3FF,12 dB roll-off
12.196946946946946,0.79226115885539,Milne13,Milne (2013),harmonicity,#11A3FF,12 dB roll-off
12.197447447447448,0.7913511272217101,Milne13,Milne (2013),harmonicity,#11A3FF,12 dB roll-off
12.197947947947949,0.7904466379483309,Milne13,Milne (2013),harmonicity,#11A3FF,12 dB roll-off
12.198448448448449,0.7895477743172222,Milne13,Milne (2013),harmonicity,#11A3FF,12 dB roll-off
12.19894894894895,0.7886546172298136,Milne13,Milne (2013),harmonicity,#11A3FF,12 dB roll-off
12.19944944944945,0.7877672451738607,Milne13,Milne (2013),harmonicity,#11A3FF,12 dB roll-off
12.19994994994995,0.7868857341927615,Milne13,Milne (2013),harmonicity,#11A3FF,12 dB roll-off
12.20045045045045,0.7860101578573356,Milne13,Milne (2013),harmonicity,#11A3FF,12 dB roll-off
12.20095095095095,0.7851405872401013,Milne13,Milne (2013),harmonicity,#11A3FF,12 dB roll-off
12.201451451451451,0.784277090892057,Milne13,Milne (2013),harmonicity,#11A3FF,12 dB roll-off
12.201951951951951,0.7834197348219857,Milne13,Milne (2013),harmonicity,#11A3FF,12 dB roll-off
12.202452452452452,0.7825685824782868,Milne13,Milne (2013),harmonicity,#11A3FF,12 dB roll-off
12.202952952952954,0.7817236947333355,Milne13,Milne (2013),harmonicity,#11A3FF,12 dB roll-off
12.203453453453454,0.78088512987039,Milne13,Milne (2013),harmonicity,#11A3FF,12 dB roll-off
12.203953953953954,0.7800529435729887,Milne13,Milne (2013),harmonicity,#11A3FF,12 dB roll-off
12.204454454454455,0.7792271889168907,Milne13,Milne (2013),harmonicity,#11A3FF,12 dB roll-off
12.204954954954955,0.7784079163644975,Milne13,Milne (2013),harmonicity,#11A3FF,12 dB roll-off
12.205455455455455,0.7775951737617559,Milne13,Milne (2013),harmonicity,#11A3FF,12 dB roll-off
12.205955955955956,0.7767890063375086,Milne13,Milne (2013),harmonicity,#11A3FF,12 dB roll-off
12.206456456456456,0.775989456705279,Milne13,Milne (2013),harmonicity,#11A3FF,12 dB roll-off
12.206956956956956,0.7751965648674347,Milne13,Milne (2013),harmonicity,#11A3FF,12 dB roll-off
12.207457457457458,0.7744103682217158,Milne13,Milne (2013),harmonicity,#11A3FF,12 dB roll-off
12.207957957957959,0.7736309015700831,Milne13,Milne (2013),harmonicity,#11A3FF,12 dB roll-off
12.208458458458459,0.7728581971298173,Milne13,Milne (2013),harmonicity,#11A3FF,12 dB roll-off
12.20895895895896,0.7720922845468672,Milne13,Milne (2013),harmonicity,#11A3FF,12 dB roll-off
12.20945945945946,0.7713331909113567,Milne13,Milne (2013),harmonicity,#11A3FF,12 dB roll-off
12.20995995995996,0.7705809407752211,Milne13,Milne (2013),harmonicity,#11A3FF,12 dB roll-off
12.21046046046046,0.7698355561719015,Milne13,Milne (2013),harmonicity,#11A3FF,12 dB roll-off
12.21096096096096,0.7690970566380507,Milne13,Milne (2013),harmonicity,#11A3FF,12 dB roll-off
12.211461461461461,0.7683654592371766,Milne13,Milne (2013),harmonicity,#11A3FF,12 dB roll-off
12.211961961961961,0.7676407785851717,Milne13,Milne (2013),harmonicity,#11A3FF,12 dB roll-off
12.212462462462462,0.7669230268776509,Milne13,Milne (2013),harmonicity,#11A3FF,12 dB roll-off
12.212962962962964,0.7662122139190368,Milne13,Milne (2013),harmonicity,#11A3FF,12 dB roll-off
12.213463463463464,0.765508347153333,Milne13,Milne (2013),harmonicity,#11A3FF,12 dB roll-off
12.213963963963964,0.7648114316964721,Milne13,Milne (2013),harmonicity,#11A3FF,12 dB roll-off
12.214464464464465,0.7641214703702316,Milne13,Milne (2013),harmonicity,#11A3FF,12 dB roll-off
12.214964964964965,0.7634384637375812,Milne13,Milne (2013),harmonicity,#11A3FF,12 dB roll-off
12.215465465465465,0.76276241013943,Milne13,Milne (2013),harmonicity,#11A3FF,12 dB roll-off
12.215965965965966,0.7620933057326735,Milne13,Milne (2013),harmonicity,#11A3FF,12 dB roll-off
12.216466466466466,0.7614311445294761,Milne13,Milne (2013),harmonicity,#11A3FF,12 dB roll-off
12.216966966966966,0.760775918437708,Milne13,Milne (2013),harmonicity,#11A3FF,12 dB roll-off
12.217467467467468,0.7601276173024615,Milne13,Milne (2013),harmonicity,#11A3FF,12 dB roll-off
12.217967967967969,0.759486228948577,Milne13,Milne (2013),harmonicity,#11A3FF,12 dB roll-off
12.218468468468469,0.7588517392240769,Milne13,Milne (2013),harmonicity,#11A3FF,12 dB roll-off
12.21896896896897,0.7582241320444731,Milne13,Milne (2013),harmonicity,#11A3FF,12 dB roll-off
12.21946946946947,0.7576033894378302,Milne13,Milne (2013),harmonicity,#11A3FF,12 dB roll-off
12.21996996996997,0.7569894915905403,Milne13,Milne (2013),harmonicity,#11A3FF,12 dB roll-off
12.22047047047047,0.756382416893716,Milne13,Milne (2013),harmonicity,#11A3FF,12 dB roll-off
12.22097097097097,0.7557821419901406,Milne13,Milne (2013),harmonicity,#11A3FF,12 dB roll-off
12.221471471471471,0.7551886418216941,Milne13,Milne (2013),harmonicity,#11A3FF,12 dB roll-off
12.221971971971971,0.7546018896771929,Milne13,Milne (2013),harmonicity,#11A3FF,12 dB roll-off
12.222472472472472,0.754021857240562,Milne13,Milne (2013),harmonicity,#11A3FF,12 dB roll-off
12.222972972972974,0.7534485146392871,Milne13,Milne (2013),harmonicity,#11A3FF,12 dB roll-off
12.223473473473474,0.7528818304930676,Milne13,Milne (2013),harmonicity,#11A3FF,12 dB roll-off
12.223973973973974,0.7523217719626023,Milne13,Milne (2013),harmonicity,#11A3FF,12 dB roll-off
12.224474474474475,0.7517683047984617,Milne13,Milne (2013),harmonicity,#11A3FF,12 dB roll-off
12.224974974974975,0.7512213933899683,Milne13,Milne (2013),harmonicity,#11A3FF,12 dB roll-off
12.225475475475475,0.7506810008140333,Milne13,Milne (2013),harmonicity,#11A3FF,12 dB roll-off
12.225975975975976,0.7501470888838889,Milne13,Milne (2013),harmonicity,#11A3FF,12 dB roll-off
12.226476476476476,0.7496196181976638,Milne13,Milne (2013),harmonicity,#11A3FF,12 dB roll-off
12.226976976976976,0.7490985481867432,Milne13,Milne (2013),harmonicity,#11A3FF,12 dB roll-off
12.227477477477478,0.7485838371638617,Milne13,Milne (2013),harmonicity,#11A3FF,12 dB roll-off
12.227977977977979,0.7480754423708975,Milne13,Milne (2013),harmonicity,#11A3FF,12 dB roll-off
12.228478478478479,0.7475733200262757,Milne13,Milne (2013),harmonicity,#11A3FF,12 dB roll-off
12.22897897897898,0.747077425371992,Milne13,Milne (2013),harmonicity,#11A3FF,12 dB roll-off
12.22947947947948,0.7465877127201714,Milne13,Milne (2013),harmonicity,#11A3FF,12 dB roll-off
12.22997997997998,0.7461041354991416,Milne13,Milne (2013),harmonicity,#11A3FF,12 dB roll-off
12.23048048048048,0.7456266462989698,Milne13,Milne (2013),harmonicity,#11A3FF,12 dB roll-off
12.23098098098098,0.7451551969164392,Milne13,Milne (2013),harmonicity,#11A3FF,12 dB roll-off
12.231481481481481,0.7446897383994199,Milne13,Milne (2013),harmonicity,#11A3FF,12 dB roll-off
12.231981981981981,0.7442302210906063,Milne13,Milne (2013),harmonicity,#11A3FF,12 dB roll-off
12.232482482482482,0.7437765946705913,Milne13,Milne (2013),harmonicity,#11A3FF,12 dB roll-off
12.232982982982984,0.7433288082002468,Milne13,Milne (2013),harmonicity,#11A3FF,12 dB roll-off
12.233483483483484,0.7428868101623927,Milne13,Milne (2013),harmonicity,#11A3FF,12 dB roll-off
12.233983983983984,0.7424505485027088,Milne13,Milne (2013),harmonicity,#11A3FF,12 dB roll-off
12.234484484484485,0.7420199706698981,Milne13,Milne (2013),harmonicity,#11A3FF,12 dB roll-off
12.234984984984985,0.7415950236550581,Milne13,Milne (2013),harmonicity,#11A3FF,12 dB roll-off
12.235485485485485,0.7411756540302489,Milne13,Milne (2013),harmonicity,#11A3FF,12 dB roll-off
12.235985985985986,0.7407618079862478,Milne13,Milne (2013),harmonicity,#11A3FF,12 dB roll-off
12.236486486486486,0.7403534313694664,Milne13,Milne (2013),harmonicity,#11A3FF,12 dB roll-off
12.236986986986986,0.7399504697180248,Milne13,Milne (2013),harmonicity,#11A3FF,12 dB roll-off
12.237487487487488,0.7395528682969681,Milne13,Milne (2013),harmonicity,#11A3FF,12 dB roll-off
12.237987987987989,0.7391605721326229,Milne13,Milne (2013),harmonicity,#11A3FF,12 dB roll-off
12.238488488488489,0.7387735260460692,Milne13,Milne (2013),harmonicity,#11A3FF,12 dB roll-off
12.23898898898899,0.7383916746857466,Milne13,Milne (2013),harmonicity,#11A3FF,12 dB roll-off
12.23948948948949,0.738014962559171,Milne13,Milne (2013),harmonicity,#11A3FF,12 dB roll-off
12.23998998998999,0.7376433340637655,Milne13,Milne (2013),harmonicity,#11A3FF,12 dB roll-off
12.24049049049049,0.7372767335168043,Milne13,Milne (2013),harmonicity,#11A3FF,12 dB roll-off
12.24099099099099,0.7369151051844709,Milne13,Milne (2013),harmonicity,#11A3FF,12 dB roll-off
12.241491491491491,0.7365583933100259,Milne13,Milne (2013),harmonicity,#11A3FF,12 dB roll-off
12.241991991991991,0.7362065421410943,Milne13,Milne (2013),harmonicity,#11A3FF,12 dB roll-off
12.242492492492492,0.7358594959560688,Milne13,Milne (2013),harmonicity,#11A3FF,12 dB roll-off
12.242992992992994,0.7355171990896393,Milne13,Milne (2013),harmonicity,#11A3FF,12 dB roll-off
12.243493493493494,0.7351795959574512,Milne13,Milne (2013),harmonicity,#11A3FF,12 dB roll-off
12.243993993993994,0.7348466310798963,Milne13,Milne (2013),harmonicity,#11A3FF,12 dB roll-off
12.244494494494495,0.7345182491050544,Milne13,Milne (2013),harmonicity,#11A3FF,12 dB roll-off
12.244994994994995,0.7341943948307793,Milne13,Milne (2013),harmonicity,#11A3FF,12 dB roll-off
12.245495495495495,0.733875013225951,Milne13,Milne (2013),harmonicity,#11A3FF,12 dB roll-off
12.245995995995996,0.7335600494508963,Milne13,Milne (2013),harmonicity,#11A3FF,12 dB roll-off
12.246496496496496,0.7332494488769934,Milne13,Milne (2013),harmonicity,#11A3FF,12 dB roll-off
12.246996996996996,0.732943157105467,Milne13,Milne (2013),harmonicity,#11A3FF,12 dB roll-off
12.247497497497498,0.7326411199853916,Milne13,Milne (2013),harmonicity,#11A3FF,12 dB roll-off
12.247997997997999,0.7323432836309113,Milne13,Milne (2013),harmonicity,#11A3FF,12 dB roll-off
12.248498498498499,0.7320495944376878,Milne13,Milne (2013),harmonicity,#11A3FF,12 dB roll-off
12.248998998999,0.7317599990985975,Milne13,Milne (2013),harmonicity,#11A3FF,12 dB roll-off
12.2494994994995,0.7314744446186809,Milne13,Milne (2013),harmonicity,#11A3FF,12 dB roll-off
12.25,0.7311928783293712,Milne13,Milne (2013),harmonicity,#11A3FF,12 dB roll-off
