interval,output,model_id,model_label,model_theory,model_colour,timbre_label
0,-0.14453372005818652,Vass01,Vassilakis (2001),interference,#B50000,Compressed
0.015015015015015015,-0.6031450979829155,Vass01,Vassilakis (2001),interference,#B50000,Compressed
0.03003003003003003,-0.6979532237101247,Vass01,Vassilakis (2001),interference,#B50000,Compressed
0.04504504504504504,-0.7879280938497959,Vass01,Vassilakis (2001),interference,#B50000,Compressed
0.06006006006006006,-0.8732693608446032,Vass01,Vassilakis (2001),interference,#B50000,Compressed
0.07507507507507508,-0.9541693667823374,Vass01,Vassilakis (2001),interference,#B50000,Compressed
0.09009009009009009,-1.0308133969539863,Vass01,Vassilakis (2001),interference,#B50000,Compressed
0.10510510510510511,-1.103379924831871,Vass01,Vassilakis (2001),interference,#B50000,Compressed
0.12012012012012012,-1.1720408487426444,Vass01,Vassilakis (2001),interference,#B50000,Compressed
0.13513513513513514,-1.2369617205000913,Vass01,Vassilakis (2001),interference,#B50000,Compressed
0.15015015015015015,-1.2983019662544275,Vass01,Vassilakis (2001),interference,#B50000,Compressed
0.16516516516516516,-1.3562150998067888,Vass01,Vassilakis (2001),interference,#B50000,Compressed
0.18018018018018017,-1.4108489286288097,Vass01,Vassilakis (2001),interference,#B50000,Compressed
0.19519519519519518,-1.4623461227072239,Vass01,Vassilakis (2001),interference,#B50000,Compressed
0.21021021021021022,-1.5108429034444968,Vass01,Vassilakis (2001),interference,#B50000,Compressed
0.22522522522522523,-1.5564715206451514,Vass01,Vassilakis (2001),interference,#B50000,Compressed
0.24024024024024024,-1.5993591796193845,Vass01,Vassilakis (2001),interference,#B50000,Compressed
0.2552552552552553,-1.639627668542887,Vass01,Vassilakis (2001),interference,#B50000,Compressed
0.2702702702702703,-1.67739424452373,Vass01,Vassilakis (2001),interference,#B50000,Compressed
0.2852852852852853,-1.7127722708495219,Vass01,Vassilakis (2001),interference,#B50000,Compressed
0.3003003003003003,-1.7458705188951957,Vass01,Vassilakis (2001),interference,#B50000,Compressed
0.3153153153153153,-1.7767936155583335,Vass01,Vassilakis (2001),interference,#B50000,Compressed
0.3303303303303303,-1.805642187927862,Vass01,Vassilakis (2001),interference,#B50000,Compressed
0.34534534534534533,-1.83251300282998,Vass01,Vassilakis (2001),interference,#B50000,Compressed
0.36036036036036034,-1.8574991014114008,Vass01,Vassilakis (2001),interference,#B50000,Compressed
0.37537537537537535,-1.8806899289139434,Vass01,Vassilakis (2001),interference,#B50000,Compressed
0.39039039039039036,-1.9021714597894765,Vass01,Vassilakis (2001),interference,#B50000,Compressed
0.40540540540540543,-1.9220263182989505,Vass01,Vassilakis (2001),interference,#B50000,Compressed
0.42042042042042044,-1.9403338947339943,Vass01,Vassilakis (2001),interference,#B50000,Compressed
0.43543543543543545,-1.9571705659826444,Vass01,Vassilakis (2001),interference,#B50000,Compressed
0.45045045045045046,-1.9726093595862966,Vass01,Vassilakis (2001),interference,#B50000,Compressed
0.46546546546546547,-1.9867208421596567,Vass01,Vassilakis (2001),interference,#B50000,Compressed
0.4804804804804805,-1.9995724744675871,Vass01,Vassilakis (2001),interference,#B50000,Compressed
0.4954954954954955,-2.0112288938689833,Vass01,Vassilakis (2001),interference,#B50000,Compressed
0.5105105105105106,-2.0217526066200877,Vass01,Vassilakis (2001),interference,#B50000,Compressed
0.5255255255255256,-2.0312029618717866,Vass01,Vassilakis (2001),interference,#B50000,Compressed
0.5405405405405406,-2.0396373392142446,Vass01,Vassilakis (2001),interference,#B50000,Compressed
0.5555555555555556,-2.047110593390246,Vass01,Vassilakis (2001),interference,#B50000,Compressed
0.5705705705705706,-2.0536752937775313,Vass01,Vassilakis (2001),interference,#B50000,Compressed
0.5855855855855856,-2.0593818002902236,Vass01,Vassilakis (2001),interference,#B50000,Compressed
0.6006006006006006,-2.0642783362173587,Vass01,Vassilakis (2001),interference,#B50000,Compressed
0.6156156156156156,-2.068411058082303,Vass01,Vassilakis (2001),interference,#B50000,Compressed
0.6306306306306306,-2.0718241226033514,Vass01,Vassilakis (2001),interference,#B50000,Compressed
0.6456456456456456,-2.0745597508322713,Vass01,Vassilakis (2001),interference,#B50000,Compressed
0.6606606606606606,-2.076658289544309,Vass01,Vassilakis (2001),interference,#B50000,Compressed
0.6756756756756757,-2.078158269949717,Vass01,Vassilakis (2001),interference,#B50000,Compressed
0.6906906906906907,-2.079096290489198,Vass01,Vassilakis (2001),interference,#B50000,Compressed
0.7057057057057057,-2.0795077611630255,Vass01,Vassilakis (2001),interference,#B50000,Compressed
0.7207207207207207,-2.0794259100846544,Vass01,Vassilakis (2001),interference,#B50000,Compressed
0.7357357357357357,-2.0788825632661245,Vass01,Vassilakis (2001),interference,#B50000,Compressed
0.7507507507507507,-2.077907956795773,Vass01,Vassilakis (2001),interference,#B50000,Compressed
0.7657657657657657,-2.0765308194614356,Vass01,Vassilakis (2001),interference,#B50000,Compressed
0.7807807807807807,-2.0747784057029715,Vass01,Vassilakis (2001),interference,#B50000,Compressed
0.7957957957957957,-2.0726765350475427,Vass01,Vassilakis (2001),interference,#B50000,Compressed
0.8108108108108109,-2.07024962935972,Vass01,Vassilakis (2001),interference,#B50000,Compressed
0.8258258258258259,-2.067520747946819,Vass01,Vassilakis (2001),interference,#B50000,Compressed
0.8408408408408409,-2.0645116205571976,Vass01,Vassilakis (2001),interference,#B50000,Compressed
0.8558558558558559,-2.061242678306398,Vass01,Vassilakis (2001),interference,#B50000,Compressed
0.8708708708708709,-2.0577330825635536,Vass01,Vassilakis (2001),interference,#B50000,Compressed
0.8858858858858859,-2.0540007518276426,Vass01,Vassilakis (2001),interference,#B50000,Compressed
0.9009009009009009,-2.0500623866206777,Vass01,Vassilakis (2001),interference,#B50000,Compressed
0.9159159159159159,-2.0459334924223134,Vass01,Vassilakis (2001),interference,#B50000,Compressed
0.9309309309309309,-2.0416284006676846,Vass01,Vassilakis (2001),interference,#B50000,Compressed
0.9459459459459459,-2.0371602878278,Vass01,Vassilakis (2001),interference,#B50000,Compressed
0.960960960960961,-2.032541192589274,Vass01,Vassilakis (2001),interference,#B50000,Compressed
0.975975975975976,-2.0277820311475088,Vass01,Vassilakis (2001),interference,#B50000,Compressed
0.990990990990991,-2.0228926106250396,Vass01,Vassilakis (2001),interference,#B50000,Compressed
1.006006006006006,-2.017881609345784,Vass01,Vassilakis (2001),interference,#B50000,Compressed
1.021021021021021,-2.0127567091934573,Vass01,Vassilakis (2001),interference,#B50000,Compressed
1.0360360360360361,-2.0075244229037335,Vass01,Vassilakis (2001),interference,#B50000,Compressed
1.0510510510510511,-2.0021902182364877,Vass01,Vassilakis (2001),interference,#B50000,Compressed
1.0660660660660661,-1.9967584930758417,Vass01,Vassilakis (2001),interference,#B50000,Compressed
1.0810810810810811,-1.9912325777007782,Vass01,Vassilakis (2001),interference,#B50000,Compressed
1.0960960960960962,-1.9856147351906572,Vass01,Vassilakis (2001),interference,#B50000,Compressed
1.1111111111111112,-1.979906159956732,Vass01,Vassilakis (2001),interference,#B50000,Compressed
1.1261261261261262,-1.9741069743879742,Vass01,Vassilakis (2001),interference,#B50000,Compressed
1.1411411411411412,-1.9682162235968828,Vass01,Vassilakis (2001),interference,#B50000,Compressed
1.1561561561561562,-1.9622318682482827,Vass01,Vassilakis (2001),interference,#B50000,Compressed
1.1711711711711712,-1.9561507754512442,Vass01,Vassilakis (2001),interference,#B50000,Compressed
1.1861861861861862,-1.9499687076915804,Vass01,Vassilakis (2001),interference,#B50000,Compressed
1.2012012012012012,-1.9436803188670473,Vass01,Vassilakis (2001),interference,#B50000,Compressed
1.2162162162162162,-1.9372791036286263,Vass01,Vassilakis (2001),interference,#B50000,Compressed
1.2312312312312312,-1.9307574284104427,Vass01,Vassilakis (2001),interference,#B50000,Compressed
1.2462462462462462,-1.924106495967711,Vass01,Vassilakis (2001),interference,#B50000,Compressed
1.2612612612612613,-1.917316238505764,Vass01,Vassilakis (2001),interference,#B50000,Compressed
1.2762762762762763,-1.9103755748288458,Vass01,Vassilakis (2001),interference,#B50000,Compressed
1.2912912912912913,-1.9032719898389003,Vass01,Vassilakis (2001),interference,#B50000,Compressed
1.3063063063063063,-1.8959917657067296,Vass01,Vassilakis (2001),interference,#B50000,Compressed
1.3213213213213213,-1.8885198870247304,Vass01,Vassilakis (2001),interference,#B50000,Compressed
1.3363363363363363,-1.8808400082519432,Vass01,Vassilakis (2001),interference,#B50000,Compressed
1.3513513513513513,-1.872934418751645,Vass01,Vassilakis (2001),interference,#B50000,Compressed
1.3663663663663663,-1.8647840053608138,Vass01,Vassilakis (2001),interference,#B50000,Compressed
1.3813813813813813,-1.8563682124272007,Vass01,Vassilakis (2001),interference,#B50000,Compressed
1.3963963963963963,-1.8476649992459357,Vass01,Vassilakis (2001),interference,#B50000,Compressed
1.4114114114114114,-1.8386507948237123,Vass01,Vassilakis (2001),interference,#B50000,Compressed
1.4264264264264264,-1.8293004498946113,Vass01,Vassilakis (2001),interference,#B50000,Compressed
1.4414414414414414,-1.8195871161246229,Vass01,Vassilakis (2001),interference,#B50000,Compressed
1.4564564564564564,-1.809482420478967,Vass01,Vassilakis (2001),interference,#B50000,Compressed
1.4714714714714714,-1.79895618827041,Vass01,Vassilakis (2001),interference,#B50000,Compressed
1.4864864864864864,-1.7879763140992124,Vass01,Vassilakis (2001),interference,#B50000,Compressed
1.5015015015015014,-1.7765090493003424,Vass01,Vassilakis (2001),interference,#B50000,Compressed
1.5165165165165164,-1.7645185550301667,Vass01,Vassilakis (2001),interference,#B50000,Compressed
1.5315315315315314,-1.7519670362878619,Vass01,Vassilakis (2001),interference,#B50000,Compressed
1.5465465465465464,-1.7388146319269266,Vass01,Vassilakis (2001),interference,#B50000,Compressed
1.5615615615615615,-1.7250193323305307,Vass01,Vassilakis (2001),interference,#B50000,Compressed
1.5765765765765765,-1.7105368987995326,Vass01,Vassilakis (2001),interference,#B50000,Compressed
1.5915915915915915,-1.6953207790562115,Vass01,Vassilakis (2001),interference,#B50000,Compressed
1.6066066066066067,-1.6793220187293088,Vass01,Vassilakis (2001),interference,#B50000,Compressed
1.6216216216216217,-1.6624891686796666,Vass01,Vassilakis (2001),interference,#B50000,Compressed
1.6366366366366367,-1.644768188019837,Vass01,Vassilakis (2001),interference,#B50000,Compressed
1.6516516516516517,-1.626102342674556,Vass01,Vassilakis (2001),interference,#B50000,Compressed
1.6666666666666667,-1.6064320993221546,Vass01,Vassilakis (2001),interference,#B50000,Compressed
1.6816816816816818,-1.585695014550464,Vass01,Vassilakis (2001),interference,#B50000,Compressed
1.6966966966966968,-1.5757963941884292,Vass01,Vassilakis (2001),interference,#B50000,Compressed
1.7117117117117118,-1.5762982763726212,Vass01,Vassilakis (2001),interference,#B50000,Compressed
1.7267267267267268,-1.575646536539012,Vass01,Vassilakis (2001),interference,#B50000,Compressed
1.7417417417417418,-1.5738413050961644,Vass01,Vassilakis (2001),interference,#B50000,Compressed
1.7567567567567568,-1.5708796015785669,Vass01,Vassilakis (2001),interference,#B50000,Compressed
1.7717717717717718,-1.566755343911549,Vass01,Vassilakis (2001),interference,#B50000,Compressed
1.7867867867867868,-1.5614593350275872,Vass01,Vassilakis (2001),interference,#B50000,Compressed
1.8018018018018018,-1.5549792444933728,Vass01,Vassilakis (2001),interference,#B50000,Compressed
1.8168168168168168,-1.547299585112956,Vass01,Vassilakis (2001),interference,#B50000,Compressed
1.8318318318318318,-1.5384016844661121,Vass01,Vassilakis (2001),interference,#B50000,Compressed
1.8468468468468469,-1.5282636513336445,Vass01,Vassilakis (2001),interference,#B50000,Compressed
1.8618618618618619,-1.5168603369544384,Vass01,Vassilakis (2001),interference,#B50000,Compressed
1.8768768768768769,-1.5041632910520968,Vass01,Vassilakis (2001),interference,#B50000,Compressed
1.8918918918918919,-1.4957559937279146,Vass01,Vassilakis (2001),interference,#B50000,Compressed
1.906906906906907,-1.5032655694996813,Vass01,Vassilakis (2001),interference,#B50000,Compressed
1.921921921921922,-1.5094675614256288,Vass01,Vassilakis (2001),interference,#B50000,Compressed
1.936936936936937,-1.514388759563662,Vass01,Vassilakis (2001),interference,#B50000,Compressed
1.951951951951952,-1.5180527222633862,Vass01,Vassilakis (2001),interference,#B50000,Compressed
1.966966966966967,-1.5204798155078278,Vass01,Vassilakis (2001),interference,#B50000,Compressed
1.981981981981982,-1.5216872473735572,Vass01,Vassilakis (2001),interference,#B50000,Compressed
1.996996996996997,-1.521689097651185,Vass01,Vassilakis (2001),interference,#B50000,Compressed
2.012012012012012,-1.5204964275153774,Vass01,Vassilakis (2001),interference,#B50000,Compressed
2.027027027027027,-1.5181169449873502,Vass01,Vassilakis (2001),interference,#B50000,Compressed
2.042042042042042,-1.5145555757340927,Vass01,Vassilakis (2001),interference,#B50000,Compressed
2.057057057057057,-1.5098140868960237,Vass01,Vassilakis (2001),interference,#B50000,Compressed
2.0720720720720722,-1.5038911938735717,Vass01,Vassilakis (2001),interference,#B50000,Compressed
2.0870870870870872,-1.4967825614453838,Vass01,Vassilakis (2001),interference,#B50000,Compressed
2.1021021021021022,-1.4884808001678216,Vass01,Vassilakis (2001),interference,#B50000,Compressed
2.1171171171171173,-1.4789754580485832,Vass01,Vassilakis (2001),interference,#B50000,Compressed
2.1321321321321323,-1.4682530074805789,Vass01,Vassilakis (2001),interference,#B50000,Compressed
2.1471471471471473,-1.4658155778725235,Vass01,Vassilakis (2001),interference,#B50000,Compressed
2.1621621621621623,-1.4747077843955398,Vass01,Vassilakis (2001),interference,#B50000,Compressed
2.1771771771771773,-1.4824185515858255,Vass01,Vassilakis (2001),interference,#B50000,Compressed
2.1921921921921923,-1.488983889452965,Vass01,Vassilakis (2001),interference,#B50000,Compressed
2.2072072072072073,-1.4944375129625342,Vass01,Vassilakis (2001),interference,#B50000,Compressed
2.2222222222222223,-1.4988085646805858,Vass01,Vassilakis (2001),interference,#B50000,Compressed
2.2372372372372373,-1.5021249668594139,Vass01,Vassilakis (2001),interference,#B50000,Compressed
2.2522522522522523,-1.5044120299558512,Vass01,Vassilakis (2001),interference,#B50000,Compressed
2.2672672672672673,-1.5056917372462666,Vass01,Vassilakis (2001),interference,#B50000,Compressed
2.2822822822822824,-1.5059836095074355,Vass01,Vassilakis (2001),interference,#B50000,Compressed
2.2972972972972974,-1.5053045908924063,Vass01,Vassilakis (2001),interference,#B50000,Compressed
2.3123123123123124,-1.5036690592566295,Vass01,Vassilakis (2001),interference,#B50000,Compressed
2.3273273273273274,-1.501088853776978,Vass01,Vassilakis (2001),interference,#B50000,Compressed
2.3423423423423424,-1.497573298765234,Vass01,Vassilakis (2001),interference,#B50000,Compressed
2.3573573573573574,-1.4931292237066747,Vass01,Vassilakis (2001),interference,#B50000,Compressed
2.3723723723723724,-1.487760979549575,Vass01,Vassilakis (2001),interference,#B50000,Compressed
2.3873873873873874,-1.481470451267158,Vass01,Vassilakis (2001),interference,#B50000,Compressed
2.4024024024024024,-1.474257066708298,Vass01,Vassilakis (2001),interference,#B50000,Compressed
2.4174174174174174,-1.4661178017490306,Vass01,Vassilakis (2001),interference,#B50000,Compressed
2.4324324324324325,-1.4570472209194398,Vass01,Vassilakis (2001),interference,#B50000,Compressed
2.4474474474474475,-1.4470373135437955,Vass01,Vassilakis (2001),interference,#B50000,Compressed
2.4624624624624625,-1.436077782986068,Vass01,Vassilakis (2001),interference,#B50000,Compressed
2.4774774774774775,-1.4329384803048613,Vass01,Vassilakis (2001),interference,#B50000,Compressed
2.4924924924924925,-1.4411496950306808,Vass01,Vassilakis (2001),interference,#B50000,Compressed
2.5075075075075075,-1.4484485125649504,Vass01,Vassilakis (2001),interference,#B50000,Compressed
2.5225225225225225,-1.4548690234896713,Vass01,Vassilakis (2001),interference,#B50000,Compressed
2.5375375375375375,-1.4604429185918313,Vass01,Vassilakis (2001),interference,#B50000,Compressed
2.5525525525525525,-1.4651997335481735,Vass01,Vassilakis (2001),interference,#B50000,Compressed
2.5675675675675675,-1.4691668472305264,Vass01,Vassilakis (2001),interference,#B50000,Compressed
2.5825825825825826,-1.4723695255235751,Vass01,Vassilakis (2001),interference,#B50000,Compressed
2.5975975975975976,-1.474830962096875,Vass01,Vassilakis (2001),interference,#B50000,Compressed
2.6126126126126126,-1.476572316179411,Vass01,Vassilakis (2001),interference,#B50000,Compressed
2.6276276276276276,-1.4776127473811107,Vass01,Vassilakis (2001),interference,#B50000,Compressed
2.6426426426426426,-1.4779694476025318,Vass01,Vassilakis (2001),interference,#B50000,Compressed
2.6576576576576576,-1.477657670070149,Vass01,Vassilakis (2001),interference,#B50000,Compressed
2.6726726726726726,-1.476690755531291,Vass01,Vassilakis (2001),interference,#B50000,Compressed
2.6876876876876876,-1.4750801556394135,Vass01,Vassilakis (2001),interference,#B50000,Compressed
2.7027027027027026,-1.472835387534679,Vass01,Vassilakis (2001),interference,#B50000,Compressed
2.7177177177177176,-1.4699640318879648,Vass01,Vassilakis (2001),interference,#B50000,Compressed
2.7327327327327327,-1.4664724678461634,Vass01,Vassilakis (2001),interference,#B50000,Compressed
2.7477477477477477,-1.46236450395592,Vass01,Vassilakis (2001),interference,#B50000,Compressed
2.7627627627627627,-1.4576424005161635,Vass01,Vassilakis (2001),interference,#B50000,Compressed
2.7777777777777777,-1.4523066113239316,Vass01,Vassilakis (2001),interference,#B50000,Compressed
2.7927927927927927,-1.446355787963719,Vass01,Vassilakis (2001),interference,#B50000,Compressed
2.8078078078078077,-1.4397867814103267,Vass01,Vassilakis (2001),interference,#B50000,Compressed
2.8228228228228227,-1.4325946409454648,Vass01,Vassilakis (2001),interference,#B50000,Compressed
2.8378378378378377,-1.4247726103849958,Vass01,Vassilakis (2001),interference,#B50000,Compressed
2.8528528528528527,-1.4163121216106356,Vass01,Vassilakis (2001),interference,#B50000,Compressed
2.8678678678678677,-1.4072027853960298,Vass01,Vassilakis (2001),interference,#B50000,Compressed
2.8828828828828827,-1.397432379514266,Vass01,Vassilakis (2001),interference,#B50000,Compressed
2.8978978978978978,-1.3869868341101013,Vass01,Vassilakis (2001),interference,#B50000,Compressed
2.9129129129129128,-1.375850214316723,Vass01,Vassilakis (2001),interference,#B50000,Compressed
2.9279279279279278,-1.3707336640481906,Vass01,Vassilakis (2001),interference,#B50000,Compressed
2.942942942942943,-1.3780231997323307,Vass01,Vassilakis (2001),interference,#B50000,Compressed
2.957957957957958,-1.384630463528538,Vass01,Vassilakis (2001),interference,#B50000,Compressed
2.972972972972973,-1.3905776706953885,Vass01,Vassilakis (2001),interference,#B50000,Compressed
2.987987987987988,-1.3958852743372512,Vass01,Vassilakis (2001),interference,#B50000,Compressed
3.003003003003003,-1.4005719068155278,Vass01,Vassilakis (2001),interference,#B50000,Compressed
3.018018018018018,-1.4046547372530769,Vass01,Vassilakis (2001),interference,#B50000,Compressed
3.033033033033033,-1.4081489864357182,Vass01,Vassilakis (2001),interference,#B50000,Compressed
3.048048048048048,-1.4110682823885157,Vass01,Vassilakis (2001),interference,#B50000,Compressed
3.063063063063063,-1.4134245904545428,Vass01,Vassilakis (2001),interference,#B50000,Compressed
3.078078078078078,-1.4152282258478863,Vass01,Vassilakis (2001),interference,#B50000,Compressed
3.093093093093093,-1.4164878637757796,Vass01,Vassilakis (2001),interference,#B50000,Compressed
3.108108108108108,-1.4172105471308214,Vass01,Vassilakis (2001),interference,#B50000,Compressed
3.123123123123123,-1.417401691750959,Vass01,Vassilakis (2001),interference,#B50000,Compressed
3.138138138138138,-1.4170650892421923,Vass01,Vassilakis (2001),interference,#B50000,Compressed
3.153153153153153,-1.416202907355465,Vass01,Vassilakis (2001),interference,#B50000,Compressed
3.168168168168168,-1.4148156879063178,Vass01,Vassilakis (2001),interference,#B50000,Compressed
3.183183183183183,-1.4129023422226459,Vass01,Vassilakis (2001),interference,#B50000,Compressed
3.198198198198198,-1.4104601463552355,Vass01,Vassilakis (2001),interference,#B50000,Compressed
3.2132132132132134,-1.4074847224260454,Vass01,Vassilakis (2001),interference,#B50000,Compressed
3.2282282282282284,-1.4039700354203803,Vass01,Vassilakis (2001),interference,#B50000,Compressed
3.2432432432432434,-1.3999083875120755,Vass01,Vassilakis (2001),interference,#B50000,Compressed
3.2582582582582584,-1.3952904266541946,Vass01,Vassilakis (2001),interference,#B50000,Compressed
3.2732732732732734,-1.3901049474827376,Vass01,Vassilakis (2001),interference,#B50000,Compressed
3.2882882882882885,-1.3843391564430712,Vass01,Vassilakis (2001),interference,#B50000,Compressed
3.3033033033033035,-1.3779784530023536,Vass01,Vassilakis (2001),interference,#B50000,Compressed
3.3183183183183185,-1.3710064498890837,Vass01,Vassilakis (2001),interference,#B50000,Compressed
3.3333333333333335,-1.3634049422858017,Vass01,Vassilakis (2001),interference,#B50000,Compressed
3.3483483483483485,-1.355153874165793,Vass01,Vassilakis (2001),interference,#B50000,Compressed
3.3633633633633635,-1.3462313017170635,Vass01,Vassilakis (2001),interference,#B50000,Compressed
3.3783783783783785,-1.3366133537929732,Vass01,Vassilakis (2001),interference,#B50000,Compressed
3.3933933933933935,-1.3262741893245487,Vass01,Vassilakis (2001),interference,#B50000,Compressed
3.4084084084084085,-1.315185951625637,Vass01,Vassilakis (2001),interference,#B50000,Compressed
3.4234234234234235,-1.3033187195176639,Vass01,Vassilakis (2001),interference,#B50000,Compressed
3.4384384384384385,-1.2906400254688644,Vass01,Vassilakis (2001),interference,#B50000,Compressed
3.4534534534534536,-1.2771164902562908,Vass01,Vassilakis (2001),interference,#B50000,Compressed
3.4684684684684686,-1.2627108632654567,Vass01,Vassilakis (2001),interference,#B50000,Compressed
3.4834834834834836,-1.2473851939617737,Vass01,Vassilakis (2001),interference,#B50000,Compressed
3.4984984984984986,-1.2310980182445384,Vass01,Vassilakis (2001),interference,#B50000,Compressed
3.5135135135135136,-1.2138057601873617,Vass01,Vassilakis (2001),interference,#B50000,Compressed
3.5285285285285286,-1.1954624848326636,Vass01,Vassilakis (2001),interference,#B50000,Compressed
3.5435435435435436,-1.17601954046739,Vass01,Vassilakis (2001),interference,#B50000,Compressed
3.5585585585585586,-1.1554256590805663,Vass01,Vassilakis (2001),interference,#B50000,Compressed
3.5735735735735736,-1.1336268250779753,Vass01,Vassilakis (2001),interference,#B50000,Compressed
3.5885885885885886,-1.1405692208919258,Vass01,Vassilakis (2001),interference,#B50000,Compressed
3.6036036036036037,-1.156050257089119,Vass01,Vassilakis (2001),interference,#B50000,Compressed
3.6186186186186187,-1.1703437571743913,Vass01,Vassilakis (2001),interference,#B50000,Compressed
3.6336336336336337,-1.1834894797166422,Vass01,Vassilakis (2001),interference,#B50000,Compressed
3.6486486486486487,-1.1955245764321294,Vass01,Vassilakis (2001),interference,#B50000,Compressed
3.6636636636636637,-1.2064836435629056,Vass01,Vassilakis (2001),interference,#B50000,Compressed
3.6786786786786787,-1.21639876956639,Vass01,Vassilakis (2001),interference,#B50000,Compressed
3.6936936936936937,-1.2252995243971652,Vass01,Vassilakis (2001),interference,#B50000,Compressed
3.7087087087087087,-1.233213219118694,Vass01,Vassilakis (2001),interference,#B50000,Compressed
3.7237237237237237,-1.2401645948771465,Vass01,Vassilakis (2001),interference,#B50000,Compressed
3.7387387387387387,-1.2461761508699098,Vass01,Vassilakis (2001),interference,#B50000,Compressed
3.7537537537537538,-1.2512680083769463,Vass01,Vassilakis (2001),interference,#B50000,Compressed
3.7687687687687688,-1.2554580098944281,Vass01,Vassilakis (2001),interference,#B50000,Compressed
3.7837837837837838,-1.2587617243857228,Vass01,Vassilakis (2001),interference,#B50000,Compressed
3.798798798798799,-1.261192466917667,Vass01,Vassilakis (2001),interference,#B50000,Compressed
3.813813813813814,-1.2627613149058747,Vass01,Vassilakis (2001),interference,#B50000,Compressed
3.828828828828829,-1.2634771209799958,Vass01,Vassilakis (2001),interference,#B50000,Compressed
3.843843843843844,-1.263346522475702,Vass01,Vassilakis (2001),interference,#B50000,Compressed
3.858858858858859,-1.2623739475555118,Vass01,Vassilakis (2001),interference,#B50000,Compressed
3.873873873873874,-1.2605616179563712,Vass01,Vassilakis (2001),interference,#B50000,Compressed
3.888888888888889,-1.2579095483572829,Vass01,Vassilakis (2001),interference,#B50000,Compressed
3.903903903903904,-1.2544155423560013,Vass01,Vassilakis (2001),interference,#B50000,Compressed
3.918918918918919,-1.250075185039098,Vass01,Vassilakis (2001),interference,#B50000,Compressed
3.933933933933934,-1.244881832125439,Vass01,Vassilakis (2001),interference,#B50000,Compressed
3.948948948948949,-1.2388265956582616,Vass01,Vassilakis (2001),interference,#B50000,Compressed
3.963963963963964,-1.2318983262166423,Vass01,Vassilakis (2001),interference,#B50000,Compressed
3.978978978978979,-1.2240835916124067,Vass01,Vassilakis (2001),interference,#B50000,Compressed
3.993993993993994,-1.2153666520336992,Vass01,Vassilakis (2001),interference,#B50000,Compressed
4.009009009009009,-1.2057294192194308,Vass01,Vassilakis (2001),interference,#B50000,Compressed
4.024024024024024,-1.1951514743888263,Vass01,Vassilakis (2001),interference,#B50000,Compressed
4.039039039039039,-1.1975969061360858,Vass01,Vassilakis (2001),interference,#B50000,Compressed
4.054054054054054,-1.2057766271716666,Vass01,Vassilakis (2001),interference,#B50000,Compressed
4.069069069069069,-1.2130495127666454,Vass01,Vassilakis (2001),interference,#B50000,Compressed
4.084084084084084,-1.2194477120469005,Vass01,Vassilakis (2001),interference,#B50000,Compressed
4.099099099099099,-1.2250011690187579,Vass01,Vassilakis (2001),interference,#B50000,Compressed
4.114114114114114,-1.229737672843116,Vass01,Vassilakis (2001),interference,#B50000,Compressed
4.129129129129129,-1.2336829049435478,Vass01,Vassilakis (2001),interference,#B50000,Compressed
4.1441441441441444,-1.23686048300781,Vass01,Vassilakis (2001),interference,#B50000,Compressed
4.1591591591591595,-1.2392920019388596,Vass01,Vassilakis (2001),interference,#B50000,Compressed
4.1741741741741745,-1.2409970718071164,Vass01,Vassilakis (2001),interference,#B50000,Compressed
4.1891891891891895,-1.2419933528524463,Vass01,Vassilakis (2001),interference,#B50000,Compressed
4.2042042042042045,-1.2422969163363318,Vass01,Vassilakis (2001),interference,#B50000,Compressed
4.2192192192192195,-1.2419209365703179,Vass01,Vassilakis (2001),interference,#B50000,Compressed
4.2342342342342345,-1.2408776577257539,Vass01,Vassilakis (2001),interference,#B50000,Compressed
4.2492492492492495,-1.2391774227460617,Vass01,Vassilakis (2001),interference,#B50000,Compressed
4.2642642642642645,-1.2368283318572284,Vass01,Vassilakis (2001),interference,#B50000,Compressed
4.2792792792792795,-1.2338372009298249,Vass01,Vassilakis (2001),interference,#B50000,Compressed
4.2942942942942945,-1.2302086469984101,Vass01,Vassilakis (2001),interference,#B50000,Compressed
4.3093093093093096,-1.225945650675964,Vass01,Vassilakis (2001),interference,#B50000,Compressed
4.324324324324325,-1.2210494311858808,Vass01,Vassilakis (2001),interference,#B50000,Compressed
4.33933933933934,-1.2155194537299834,Vass01,Vassilakis (2001),interference,#B50000,Compressed
4.354354354354355,-1.209353434203525,Vass01,Vassilakis (2001),interference,#B50000,Compressed
4.36936936936937,-1.2025473412636547,Vass01,Vassilakis (2001),interference,#B50000,Compressed
4.384384384384385,-1.1950953957542176,Vass01,Vassilakis (2001),interference,#B50000,Compressed
4.3993993993994,-1.1869900674866403,Vass01,Vassilakis (2001),interference,#B50000,Compressed
4.414414414414415,-1.1782220693730805,Vass01,Vassilakis (2001),interference,#B50000,Compressed
4.42942942942943,-1.1687803489046,Vass01,Vassilakis (2001),interference,#B50000,Compressed
4.444444444444445,-1.1586519747959776,Vass01,Vassilakis (2001),interference,#B50000,Compressed
4.45945945945946,-1.147822497818633,Vass01,Vassilakis (2001),interference,#B50000,Compressed
4.474474474474475,-1.1362754563308064,Vass01,Vassilakis (2001),interference,#B50000,Compressed
4.48948948948949,-1.1239925999129179,Vass01,Vassilakis (2001),interference,#B50000,Compressed
4.504504504504505,-1.1109537263346478,Vass01,Vassilakis (2001),interference,#B50000,Compressed
4.51951951951952,-1.0971369573398095,Vass01,Vassilakis (2001),interference,#B50000,Compressed
4.534534534534535,-1.0825183869782793,Vass01,Vassilakis (2001),interference,#B50000,Compressed
4.54954954954955,-1.0670722088860918,Vass01,Vassilakis (2001),interference,#B50000,Compressed
4.564564564564565,-1.0507706522139224,Vass01,Vassilakis (2001),interference,#B50000,Compressed
4.57957957957958,-1.0335839453958118,Vass01,Vassilakis (2001),interference,#B50000,Compressed
4.594594594594595,-1.0154802769519968,Vass01,Vassilakis (2001),interference,#B50000,Compressed
4.60960960960961,-0.9964257532755895,Vass01,Vassilakis (2001),interference,#B50000,Compressed
4.624624624624625,-1.0066854231601023,Vass01,Vassilakis (2001),interference,#B50000,Compressed
4.63963963963964,-1.0214354074359988,Vass01,Vassilakis (2001),interference,#B50000,Compressed
4.654654654654655,-1.0352831349655551,Vass01,Vassilakis (2001),interference,#B50000,Compressed
4.66966966966967,-1.0482678765742548,Vass01,Vassilakis (2001),interference,#B50000,Compressed
4.684684684684685,-1.060427041303907,Vass01,Vassilakis (2001),interference,#B50000,Compressed
4.6996996996997,-1.0717961749171472,Vass01,Vassilakis (2001),interference,#B50000,Compressed
4.714714714714715,-1.0824092229841298,Vass01,Vassilakis (2001),interference,#B50000,Compressed
4.72972972972973,-1.0922982325897297,Vass01,Vassilakis (2001),interference,#B50000,Compressed
4.744744744744745,-1.1014936548184946,Vass01,Vassilakis (2001),interference,#B50000,Compressed
4.75975975975976,-1.1100242974711556,Vass01,Vassilakis (2001),interference,#B50000,Compressed
4.774774774774775,-1.117917373208992,Vass01,Vassilakis (2001),interference,#B50000,Compressed
4.78978978978979,-1.1251985359899026,Vass01,Vassilakis (2001),interference,#B50000,Compressed
4.804804804804805,-1.1318919153280182,Vass01,Vassilakis (2001),interference,#B50000,Compressed
4.81981981981982,-1.138020148412755,Vass01,Vassilakis (2001),interference,#B50000,Compressed
4.834834834834835,-1.143604410120194,Vass01,Vassilakis (2001),interference,#B50000,Compressed
4.84984984984985,-1.1486644409473126,Vass01,Vassilakis (2001),interference,#B50000,Compressed
4.864864864864865,-1.1532185728972058,Vass01,Vassilakis (2001),interference,#B50000,Compressed
4.87987987987988,-1.1572837533406946,Vass01,Vassilakis (2001),interference,#B50000,Compressed
4.894894894894895,-1.160875566877396,Vass01,Vassilakis (2001),interference,#B50000,Compressed
4.90990990990991,-1.1640082552169486,Vass01,Vassilakis (2001),interference,#B50000,Compressed
4.924924924924925,-1.1666947350983596,Vass01,Vassilakis (2001),interference,#B50000,Compressed
4.93993993993994,-1.168946614263378,Vass01,Vassilakis (2001),interference,#B50000,Compressed
4.954954954954955,-1.1707742054970824,Vass01,Vassilakis (2001),interference,#B50000,Compressed
4.96996996996997,-1.1721865387465071,Vass01,Vassilakis (2001),interference,#B50000,Compressed
4.984984984984985,-1.173191371325917,Vass01,Vassilakis (2001),interference,#B50000,Compressed
5,-1.1737951962145692,Vass01,Vassilakis (2001),interference,#B50000,Compressed
5.015015015015015,-1.1740032541799803,Vass01,Vassilakis (2001),interference,#B50000,Compressed
5.03003003003003,-1.1738195154527522,Vass01,Vassilakis (2001),interference,#B50000,Compressed
5.045045045045045,-1.1732467163850484,Vass01,Vassilakis (2001),interference,#B50000,Compressed
5.06006006006006,-1.1722863375205324,Vass01,Vassilakis (2001),interference,#B50000,Compressed
5.075075075075075,-1.170938607986165,Vass01,Vassilakis (2001),interference,#B50000,Compressed
5.09009009009009,-1.1692025023355317,Vass01,Vassilakis (2001),interference,#B50000,Compressed
5.105105105105105,-1.1670757354585108,Vass01,Vassilakis (2001),interference,#B50000,Compressed
5.12012012012012,-1.164554755543414,Vass01,Vassilakis (2001),interference,#B50000,Compressed
5.135135135135135,-1.1616347350754406,Vass01,Vassilakis (2001),interference,#B50000,Compressed
5.15015015015015,-1.1583095598525028,Vass01,Vassilakis (2001),interference,#B50000,Compressed
5.165165165165165,-1.1545718159968907,Vass01,Vassilakis (2001),interference,#B50000,Compressed
5.18018018018018,-1.1504127749386979,Vass01,Vassilakis (2001),interference,#B50000,Compressed
5.195195195195195,-1.1458223174189948,Vass01,Vassilakis (2001),interference,#B50000,Compressed
5.21021021021021,-1.1407891450980885,Vass01,Vassilakis (2001),interference,#B50000,Compressed
5.225225225225225,-1.1353004201342516,Vass01,Vassilakis (2001),interference,#B50000,Compressed
5.24024024024024,-1.1293419809477938,Vass01,Vassilakis (2001),interference,#B50000,Compressed
5.255255255255255,-1.122898200493707,Vass01,Vassilakis (2001),interference,#B50000,Compressed
5.27027027027027,-1.1159520236046567,Vass01,Vassilakis (2001),interference,#B50000,Compressed
5.285285285285285,-1.1084849370581162,Vass01,Vassilakis (2001),interference,#B50000,Compressed
5.3003003003003,-1.1004769005434993,Vass01,Vassilakis (2001),interference,#B50000,Compressed
5.315315315315315,-1.0919063272709866,Vass01,Vassilakis (2001),interference,#B50000,Compressed
5.33033033033033,-1.0827500467234068,Vass01,Vassilakis (2001),interference,#B50000,Compressed
5.345345345345345,-1.0729832649242255,Vass01,Vassilakis (2001),interference,#B50000,Compressed
5.36036036036036,-1.0625795221612053,Vass01,Vassilakis (2001),interference,#B50000,Compressed
5.375375375375375,-1.0515106481021443,Vass01,Vassilakis (2001),interference,#B50000,Compressed
5.39039039039039,-1.0397467142352594,Vass01,Vassilakis (2001),interference,#B50000,Compressed
5.405405405405405,-1.0410978927036139,Vass01,Vassilakis (2001),interference,#B50000,Compressed
5.42042042042042,-1.0462044010066478,Vass01,Vassilakis (2001),interference,#B50000,Compressed
5.435435435435435,-1.050603348016421,Vass01,Vassilakis (2001),interference,#B50000,Compressed
5.45045045045045,-1.054304589406355,Vass01,Vassilakis (2001),interference,#B50000,Compressed
5.465465465465465,-1.0573161494983228,Vass01,Vassilakis (2001),interference,#B50000,Compressed
5.48048048048048,-1.0596442839209541,Vass01,Vassilakis (2001),interference,#B50000,Compressed
5.495495495495495,-1.0612934562200402,Vass01,Vassilakis (2001),interference,#B50000,Compressed
5.51051051051051,-1.0622664350924003,Vass01,Vassilakis (2001),interference,#B50000,Compressed
5.525525525525525,-1.0625642323745985,Vass01,Vassilakis (2001),interference,#B50000,Compressed
5.54054054054054,-1.0621860389646995,Vass01,Vassilakis (2001),interference,#B50000,Compressed
5.555555555555555,-1.0611292764892926,Vass01,Vassilakis (2001),interference,#B50000,Compressed
5.57057057057057,-1.0593895687673587,Vass01,Vassilakis (2001),interference,#B50000,Compressed
5.585585585585585,-1.0569607260265352,Vass01,Vassilakis (2001),interference,#B50000,Compressed
5.6006006006006,-1.0538347263005003,Vass01,Vassilakis (2001),interference,#B50000,Compressed
5.615615615615615,-1.0500016939656396,Vass01,Vassilakis (2001),interference,#B50000,Compressed
5.63063063063063,-1.0454498753717871,Vass01,Vassilakis (2001),interference,#B50000,Compressed
5.645645645645645,-1.0401656115174231,Vass01,Vassilakis (2001),interference,#B50000,Compressed
5.66066066066066,-1.0341333077158184,Vass01,Vassilakis (2001),interference,#B50000,Compressed
5.675675675675675,-1.0273354001945654,Vass01,Vassilakis (2001),interference,#B50000,Compressed
5.6906906906906904,-1.0197522691290266,Vass01,Vassilakis (2001),interference,#B50000,Compressed
5.7057057057057055,-1.0113624006873336,Vass01,Vassilakis (2001),interference,#B50000,Compressed
5.7207207207207205,-1.0057410565435672,Vass01,Vassilakis (2001),interference,#B50000,Compressed
5.7357357357357355,-1.0150729631169357,Vass01,Vassilakis (2001),interference,#B50000,Compressed
5.7507507507507505,-1.0235987470123384,Vass01,Vassilakis (2001),interference,#B50000,Compressed
5.7657657657657655,-1.0313501993237832,Vass01,Vassilakis (2001),interference,#B50000,Compressed
5.7807807807807805,-1.0383571510933183,Vass01,Vassilakis (2001),interference,#B50000,Compressed
5.7957957957957955,-1.0446475237841029,Vass01,Vassilakis (2001),interference,#B50000,Compressed
5.8108108108108105,-1.0502473769008869,Vass01,Vassilakis (2001),interference,#B50000,Compressed
5.8258258258258255,-1.055180952819201,Vass01,Vassilakis (2001),interference,#B50000,Compressed
5.8408408408408405,-1.059470718881287,Vass01,Vassilakis (2001),interference,#B50000,Compressed
5.8558558558558556,-1.0631374068134265,Vass01,Vassilakis (2001),interference,#B50000,Compressed
5.870870870870871,-1.0662000495156851,Vass01,Vassilakis (2001),interference,#B50000,Compressed
5.885885885885886,-1.0686760152721304,Vass01,Vassilakis (2001),interference,#B50000,Compressed
5.900900900900901,-1.0705810394260367,Vass01,Vassilakis (2001),interference,#B50000,Compressed
5.915915915915916,-1.0719292535614569,Vass01,Vassilakis (2001),interference,#B50000,Compressed
5.930930930930931,-1.0727332122294688,Vass01,Vassilakis (2001),interference,#B50000,Compressed
5.945945945945946,-1.073003917254115,Vass01,Vassilakis (2001),interference,#B50000,Compressed
5.960960960960961,-1.0727508396500116,Vass01,Vassilakis (2001),interference,#B50000,Compressed
5.975975975975976,-1.0719819391805956,Vass01,Vassilakis (2001),interference,#B50000,Compressed
5.990990990990991,-1.0707036815828284,Vass01,Vassilakis (2001),interference,#B50000,Compressed
6.006006006006006,-1.0689210623684504,Vass01,Vassilakis (2001),interference,#B50000,Compressed
6.021021021021021,-1.0666375839158824,Vass01,Vassilakis (2001),interference,#B50000,Compressed
6.036036036036036,-1.0638553190901432,Vass01,Vassilakis (2001),interference,#B50000,Compressed
6.051051051051051,-1.0605748838365332,Vass01,Vassilakis (2001),interference,#B50000,Compressed
6.066066066066066,-1.0567954518904372,Vass01,Vassilakis (2001),interference,#B50000,Compressed
6.081081081081081,-1.0525147583768029,Vass01,Vassilakis (2001),interference,#B50000,Compressed
6.096096096096096,-1.0477291011738021,Vass01,Vassilakis (2001),interference,#B50000,Compressed
6.111111111111111,-1.0424333400428343,Vass01,Vassilakis (2001),interference,#B50000,Compressed
6.126126126126126,-1.0366208935240695,Vass01,Vassilakis (2001),interference,#B50000,Compressed
6.141141141141141,-1.030283733593849,Vass01,Vassilakis (2001),interference,#B50000,Compressed
6.156156156156156,-1.023412378077271,Vass01,Vassilakis (2001),interference,#B50000,Compressed
6.171171171171171,-1.0159958808062683,Vass01,Vassilakis (2001),interference,#B50000,Compressed
6.186186186186186,-1.0080218195106243,Vass01,Vassilakis (2001),interference,#B50000,Compressed
6.201201201201201,-0.9994762527612558,Vass01,Vassilakis (2001),interference,#B50000,Compressed
6.216216216216216,-0.9903438117113907,Vass01,Vassilakis (2001),interference,#B50000,Compressed
6.231231231231231,-0.9806073534957767,Vass01,Vassilakis (2001),interference,#B50000,Compressed
6.246246246246246,-0.9702487194036373,Vass01,Vassilakis (2001),interference,#B50000,Compressed
6.261261261261261,-0.9592476591197562,Vass01,Vassilakis (2001),interference,#B50000,Compressed
6.276276276276276,-0.9475825593985623,Vass01,Vassilakis (2001),interference,#B50000,Compressed
6.291291291291291,-0.9352301064225925,Vass01,Vassilakis (2001),interference,#B50000,Compressed
6.306306306306306,-0.9221653544904815,Vass01,Vassilakis (2001),interference,#B50000,Compressed
6.321321321321321,-0.9083616672022898,Vass01,Vassilakis (2001),interference,#B50000,Compressed
6.336336336336336,-0.8937906813082233,Vass01,Vassilakis (2001),interference,#B50000,Compressed
6.351351351351351,-0.8784222679458086,Vass01,Vassilakis (2001),interference,#B50000,Compressed
6.366366366366366,-0.8622244912140863,Vass01,Vassilakis (2001),interference,#B50000,Compressed
6.381381381381381,-0.8451635640302929,Vass01,Vassilakis (2001),interference,#B50000,Compressed
6.396396396396396,-0.8272038012107215,Vass01,Vassilakis (2001),interference,#B50000,Compressed
6.411411411411412,-0.8083075697135148,Vass01,Vassilakis (2001),interference,#B50000,Compressed
6.426426426426427,-0.7884352359778276,Vass01,Vassilakis (2001),interference,#B50000,Compressed
6.441441441441442,-0.7675451134296871,Vass01,Vassilakis (2001),interference,#B50000,Compressed
6.456456456456457,-0.7455929233098821,Vass01,Vassilakis (2001),interference,#B50000,Compressed
6.471471471471472,-0.7225335964066809,Vass01,Vassilakis (2001),interference,#B50000,Compressed
6.486486486486487,-0.6983180474695371,Vass01,Vassilakis (2001),interference,#B50000,Compressed
6.501501501501502,-0.6773901657406292,Vass01,Vassilakis (2001),interference,#B50000,Compressed
6.516516516516517,-0.6988333102874493,Vass01,Vassilakis (2001),interference,#B50000,Compressed
6.531531531531532,-0.7190988450801769,Vass01,Vassilakis (2001),interference,#B50000,Compressed
6.546546546546547,-0.7382388861595346,Vass01,Vassilakis (2001),interference,#B50000,Compressed
6.561561561561562,-0.756303468182879,Vass01,Vassilakis (2001),interference,#B50000,Compressed
6.576576576576577,-0.7733406125597915,Vass01,Vassilakis (2001),interference,#B50000,Compressed
6.591591591591592,-0.7893963929780496,Vass01,Vassilakis (2001),interference,#B50000,Compressed
6.606606606606607,-0.8045149983945146,Vass01,Vassilakis (2001),interference,#B50000,Compressed
6.621621621621622,-0.818738793562299,Vass01,Vassilakis (2001),interference,#B50000,Compressed
6.636636636636637,-0.8321083771628418,Vass01,Vassilakis (2001),interference,#B50000,Compressed
6.651651651651652,-0.8446626376089975,Vass01,Vassilakis (2001),interference,#B50000,Compressed
6.666666666666667,-0.8564388065822683,Vass01,Vassilakis (2001),interference,#B50000,Compressed
6.681681681681682,-0.8674725103650042,Vass01,Vassilakis (2001),interference,#B50000,Compressed
6.696696696696697,-0.8777977698267571,Vass01,Vassilakis (2001),interference,#B50000,Compressed
6.711711711711712,-0.8874472499848985,Vass01,Vassilakis (2001),interference,#B50000,Compressed
6.726726726726727,-0.8964519871827822,Vass01,Vassilakis (2001),interference,#B50000,Compressed
6.741741741741742,-0.9048416628690771,Vass01,Vassilakis (2001),interference,#B50000,Compressed
6.756756756756757,-0.9126445730645298,Vass01,Vassilakis (2001),interference,#B50000,Compressed
6.771771771771772,-0.9198876731665347,Vass01,Vassilakis (2001),interference,#B50000,Compressed
6.786786786786787,-0.9265966153407276,Vass01,Vassilakis (2001),interference,#B50000,Compressed
6.801801801801802,-0.9327957841068234,Vass01,Vassilakis (2001),interference,#B50000,Compressed
6.816816816816817,-0.9385083301585401,Vass01,Vassilakis (2001),interference,#B50000,Compressed
6.831831831831832,-0.9437562024552743,Vass01,Vassilakis (2001),interference,#B50000,Compressed
6.846846846846847,-0.9485601786212877,Vass01,Vassilakis (2001),interference,#B50000,Compressed
6.861861861861862,-0.9529398936859796,Vass01,Vassilakis (2001),interference,#B50000,Compressed
6.876876876876877,-0.9569138671969023,Vass01,Vassilakis (2001),interference,#B50000,Compressed
6.891891891891892,-0.9604995287352125,Vass01,Vassilakis (2001),interference,#B50000,Compressed
6.906906906906907,-0.9637132418612543,Vass01,Vassilakis (2001),interference,#B50000,Compressed
6.921921921921922,-0.9665703265160989,Vass01,Vassilakis (2001),interference,#B50000,Compressed
6.936936936936937,-0.9690850799029771,Vass01,Vassilakis (2001),interference,#B50000,Compressed
6.951951951951952,-0.9712707958705948,Vass01,Vassilakis (2001),interference,#B50000,Compressed
6.966966966966967,-0.973139782818578,Vass01,Vassilakis (2001),interference,#B50000,Compressed
6.981981981981982,-0.9747033801433441,Vass01,Vassilakis (2001),interference,#B50000,Compressed
6.996996996996997,-0.9759719732409446,Vass01,Vassilakis (2001),interference,#B50000,Compressed
7.012012012012012,-0.9769550165652269,Vass01,Vassilakis (2001),interference,#B50000,Compressed
7.027027027027027,-0.9776610078565887,Vass01,Vassilakis (2001),interference,#B50000,Compressed
7.042042042042042,-0.9780975557858334,Vass01,Vassilakis (2001),interference,#B50000,Compressed
7.057057057057057,-0.9782713513922252,Vass01,Vassilakis (2001),interference,#B50000,Compressed
7.072072072072072,-0.9781881855351386,Vass01,Vassilakis (2001),interference,#B50000,Compressed
7.087087087087087,-0.9778529554846841,Vass01,Vassilakis (2001),interference,#B50000,Compressed
7.102102102102102,-0.977269670134558,Vass01,Vassilakis (2001),interference,#B50000,Compressed
7.117117117117117,-0.9764414538393597,Vass01,Vassilakis (2001),interference,#B50000,Compressed
7.132132132132132,-0.9753705488767263,Vass01,Vassilakis (2001),interference,#B50000,Compressed
7.147147147147147,-0.9740583165328729,Vass01,Vassilakis (2001),interference,#B50000,Compressed
7.162162162162162,-0.9725052368083722,Vass01,Vassilakis (2001),interference,#B50000,Compressed
7.177177177177177,-0.9707109067390735,Vass01,Vassilakis (2001),interference,#B50000,Compressed
7.192192192192192,-0.9686740373253577,Vass01,Vassilakis (2001),interference,#B50000,Compressed
7.207207207207207,-0.966392396097096,Vass01,Vassilakis (2001),interference,#B50000,Compressed
7.222222222222222,-0.9638630142525076,Vass01,Vassilakis (2001),interference,#B50000,Compressed
7.237237237237237,-0.9610818544887967,Vass01,Vassilakis (2001),interference,#B50000,Compressed
7.252252252252252,-0.9580440639186893,Vass01,Vassilakis (2001),interference,#B50000,Compressed
7.267267267267267,-0.9547437585667758,Vass01,Vassilakis (2001),interference,#B50000,Compressed
7.282282282282282,-0.9511742231992708,Vass01,Vassilakis (2001),interference,#B50000,Compressed
7.297297297297297,-0.9473277613636987,Vass01,Vassilakis (2001),interference,#B50000,Compressed
7.312312312312312,-0.9431957144633126,Vass01,Vassilakis (2001),interference,#B50000,Compressed
7.327327327327327,-0.93876844554075,Vass01,Vassilakis (2001),interference,#B50000,Compressed
7.342342342342342,-0.9340353214960972,Vass01,Vassilakis (2001),interference,#B50000,Compressed
7.357357357357357,-0.928984693710896,Vass01,Vassilakis (2001),interference,#B50000,Compressed
7.372372372372372,-0.9236038770473239,Vass01,Vassilakis (2001),interference,#B50000,Compressed
7.387387387387387,-0.9178791271896076,Vass01,Vassilakis (2001),interference,#B50000,Compressed
7.402402402402402,-0.9117956162925646,Vass01,Vassilakis (2001),interference,#B50000,Compressed
7.4174174174174174,-0.9053374068996088,Vass01,Vassilakis (2001),interference,#B50000,Compressed
7.4324324324324325,-0.8984874335255781,Vass01,Vassilakis (2001),interference,#B50000,Compressed
7.4474474474474475,-0.891227435283505,Vass01,Vassilakis (2001),interference,#B50000,Compressed
7.4624624624624625,-0.8835379589769595,Vass01,Vassilakis (2001),interference,#B50000,Compressed
7.4774774774774775,-0.8753983424854719,Vass01,Vassilakis (2001),interference,#B50000,Compressed
7.4924924924924925,-0.8667866888619792,Vass01,Vassilakis (2001),interference,#B50000,Compressed
7.5075075075075075,-0.8576797328947106,Vass01,Vassilakis (2001),interference,#B50000,Compressed
7.5225225225225225,-0.8480528618721195,Vass01,Vassilakis (2001),interference,#B50000,Compressed
7.5375375375375375,-0.8410499218696298,Vass01,Vassilakis (2001),interference,#B50000,Compressed
7.5525525525525525,-0.8472754393171493,Vass01,Vassilakis (2001),interference,#B50000,Compressed
7.5675675675675675,-0.8529600942497448,Vass01,Vassilakis (2001),interference,#B50000,Compressed
7.5825825825825826,-0.8581211182878886,Vass01,Vassilakis (2001),interference,#B50000,Compressed
7.597597597597598,-0.8627744138360245,Vass01,Vassilakis (2001),interference,#B50000,Compressed
7.612612612612613,-0.8669345758179536,Vass01,Vassilakis (2001),interference,#B50000,Compressed
7.627627627627628,-0.870614911510313,Vass01,Vassilakis (2001),interference,#B50000,Compressed
7.642642642642643,-0.8738274584928262,Vass01,Vassilakis (2001),interference,#B50000,Compressed
7.657657657657658,-0.8765830007318048,Vass01,Vassilakis (2001),interference,#B50000,Compressed
7.672672672672673,-0.8788910828108392,Vass01,Vassilakis (2001),interference,#B50000,Compressed
7.687687687687688,-0.8807600223205476,Vass01,Vassilakis (2001),interference,#B50000,Compressed
7.702702702702703,-0.8821968723860869,Vass01,Vassilakis (2001),interference,#B50000,Compressed
7.717717717717718,-0.8832078887061174,Vass01,Vassilakis (2001),interference,#B50000,Compressed
7.732732732732733,-0.8837971659347523,Vass01,Vassilakis (2001),interference,#B50000,Compressed
7.747747747747748,-0.8839684857562051,Vass01,Vassilakis (2001),interference,#B50000,Compressed
7.762762762762763,-0.8837241527008121,Vass01,Vassilakis (2001),interference,#B50000,Compressed
7.777777777777778,-0.883065280350687,Vass01,Vassilakis (2001),interference,#B50000,Compressed
7.792792792792793,-0.8819917909765778,Vass01,Vassilakis (2001),interference,#B50000,Compressed
7.807807807807808,-0.8805024133439724,Vass01,Vassilakis (2001),interference,#B50000,Compressed
7.822822822822823,-0.8785946786791935,Vass01,Vassilakis (2001),interference,#B50000,Compressed
7.837837837837838,-0.8762649147837032,Vass01,Vassilakis (2001),interference,#B50000,Compressed
7.852852852852853,-0.8735082382823611,Vass01,Vassilakis (2001),interference,#B50000,Compressed
7.867867867867868,-0.8703185449890878,Vass01,Vassilakis (2001),interference,#B50000,Compressed
7.882882882882883,-0.8666884983706052,Vass01,Vassilakis (2001),interference,#B50000,Compressed
7.897897897897898,-0.8626095160866215,Vass01,Vassilakis (2001),interference,#B50000,Compressed
7.912912912912913,-0.8580717545821529,Vass01,Vassilakis (2001),interference,#B50000,Compressed
7.927927927927928,-0.8530640917049821,Vass01,Vassilakis (2001),interference,#B50000,Compressed
7.942942942942943,-0.847574107318716,Vass01,Vassilakis (2001),interference,#B50000,Compressed
7.957957957957958,-0.8415880618791178,Vass01,Vassilakis (2001),interference,#B50000,Compressed
7.972972972972973,-0.8350908729385722,Vass01,Vassilakis (2001),interference,#B50000,Compressed
7.987987987987988,-0.8280660895408681,Vass01,Vassilakis (2001),interference,#B50000,Compressed
8.003003003003004,-0.8204958741476582,Vass01,Vassilakis (2001),interference,#B50000,Compressed
8.018018018018019,-0.8123609339617194,Vass01,Vassilakis (2001),interference,#B50000,Compressed
8.033033033033034,-0.8036405468224844,Vass01,Vassilakis (2001),interference,#B50000,Compressed
8.048048048048049,-0.7943124880020156,Vass01,Vassilakis (2001),interference,#B50000,Compressed
8.063063063063064,-0.7843530030591865,Vass01,Vassilakis (2001),interference,#B50000,Compressed
8.078078078078079,-0.773736768613834,Vass01,Vassilakis (2001),interference,#B50000,Compressed
8.093093093093094,-0.7624368506612467,Vass01,Vassilakis (2001),interference,#B50000,Compressed
8.108108108108109,-0.7504246603641653,Vass01,Vassilakis (2001),interference,#B50000,Compressed
8.123123123123124,-0.737669907255692,Vass01,Vassilakis (2001),interference,#B50000,Compressed
8.138138138138139,-0.7241405497831184,Vass01,Vassilakis (2001),interference,#B50000,Compressed
8.153153153153154,-0.7098027431190889,Vass01,Vassilakis (2001),interference,#B50000,Compressed
8.168168168168169,-0.694620784162279,Vass01,Vassilakis (2001),interference,#B50000,Compressed
8.183183183183184,-0.6785570536464262,Vass01,Vassilakis (2001),interference,#B50000,Compressed
8.198198198198199,-0.6806199962688728,Vass01,Vassilakis (2001),interference,#B50000,Compressed
8.213213213213214,-0.6943633435358121,Vass01,Vassilakis (2001),interference,#B50000,Compressed
8.228228228228229,-0.7072442172358678,Vass01,Vassilakis (2001),interference,#B50000,Compressed
8.243243243243244,-0.7192997974487964,Vass01,Vassilakis (2001),interference,#B50000,Compressed
8.258258258258259,-0.7305672695574702,Vass01,Vassilakis (2001),interference,#B50000,Compressed
8.273273273273274,-0.7410804651628953,Vass01,Vassilakis (2001),interference,#B50000,Compressed
8.288288288288289,-0.7508727447333552,Vass01,Vassilakis (2001),interference,#B50000,Compressed
8.303303303303304,-0.7599754544700894,Vass01,Vassilakis (2001),interference,#B50000,Compressed
8.318318318318319,-0.7684183767460457,Vass01,Vassilakis (2001),interference,#B50000,Compressed
8.333333333333334,-0.7762297748369178,Vass01,Vassilakis (2001),interference,#B50000,Compressed
8.348348348348349,-0.7834364354868896,Vass01,Vassilakis (2001),interference,#B50000,Compressed
8.363363363363364,-0.7900637093605765,Vass01,Vassilakis (2001),interference,#B50000,Compressed
8.378378378378379,-0.7961355494302632,Vass01,Vassilakis (2001),interference,#B50000,Compressed
8.393393393393394,-0.8016745473447596,Vass01,Vassilakis (2001),interference,#B50000,Compressed
8.408408408408409,-0.806701967823904,Vass01,Vassilakis (2001),interference,#B50000,Compressed
8.423423423423424,-0.8112377811202978,Vass01,Vassilakis (2001),interference,#B50000,Compressed
8.438438438438439,-0.8153007039363175,Vass01,Vassilakis (2001),interference,#B50000,Compressed
8.453453453453454,-0.8189081867428845,Vass01,Vassilakis (2001),interference,#B50000,Compressed
8.468468468468469,-0.8220764707428434,Vass01,Vassilakis (2001),interference,#B50000,Compressed
8.483483483483484,-0.8248206637983158,Vass01,Vassilakis (2001),interference,#B50000,Compressed
8.498498498498499,-0.827154720899303,Vass01,Vassilakis (2001),interference,#B50000,Compressed
8.513513513513514,-0.8290914191265144,Vass01,Vassilakis (2001),interference,#B50000,Compressed
8.528528528528529,-0.8306423673769691,Vass01,Vassilakis (2001),interference,#B50000,Compressed
8.543543543543544,-0.8318181557243379,Vass01,Vassilakis (2001),interference,#B50000,Compressed
8.558558558558559,-0.8326282636310973,Vass01,Vassilakis (2001),interference,#B50000,Compressed
8.573573573573574,-0.8330811018912445,Vass01,Vassilakis (2001),interference,#B50000,Compressed
8.588588588588589,-0.833184025918164,Vass01,Vassilakis (2001),interference,#B50000,Compressed
8.603603603603604,-0.8329433474222863,Vass01,Vassilakis (2001),interference,#B50000,Compressed
8.618618618618619,-0.832364344491628,Vass01,Vassilakis (2001),interference,#B50000,Compressed
8.633633633633634,-0.8314512700860713,Vass01,Vassilakis (2001),interference,#B50000,Compressed
8.64864864864865,-0.8302073589543866,Vass01,Vassilakis (2001),interference,#B50000,Compressed
8.663663663663664,-0.8286348329808514,Vass01,Vassilakis (2001),interference,#B50000,Compressed
8.67867867867868,-0.8267349049662738,Vass01,Vassilakis (2001),interference,#B50000,Compressed
8.693693693693694,-0.8245077339171508,Vass01,Vassilakis (2001),interference,#B50000,Compressed
8.70870870870871,-0.8219526134348977,Vass01,Vassilakis (2001),interference,#B50000,Compressed
8.723723723723724,-0.81906768373616,Vass01,Vassilakis (2001),interference,#B50000,Compressed
8.73873873873874,-0.8158501377345626,Vass01,Vassilakis (2001),interference,#B50000,Compressed
8.753753753753754,-0.8122961402121074,Vass01,Vassilakis (2001),interference,#B50000,Compressed
8.76876876876877,-0.8084008412838667,Vass01,Vassilakis (2001),interference,#B50000,Compressed
8.783783783783784,-0.8041583645912411,Vass01,Vassilakis (2001),interference,#B50000,Compressed
8.7987987987988,-0.7995617984876787,Vass01,Vassilakis (2001),interference,#B50000,Compressed
8.813813813813814,-0.7946031856102078,Vass01,Vassilakis (2001),interference,#B50000,Compressed
8.82882882882883,-0.7892735108208359,Vass01,Vassilakis (2001),interference,#B50000,Compressed
8.843843843843844,-0.7835626874997894,Vass01,Vassilakis (2001),interference,#B50000,Compressed
8.85885885885886,-0.7774595421704783,Vass01,Vassilakis (2001),interference,#B50000,Compressed
8.873873873873874,-0.7709517974336131,Vass01,Vassilakis (2001),interference,#B50000,Compressed
8.88888888888889,-0.7640260531858768,Vass01,Vassilakis (2001),interference,#B50000,Compressed
8.903903903903904,-0.7566677660962081,Vass01,Vassilakis (2001),interference,#B50000,Compressed
8.91891891891892,-0.7488612273103182,Vass01,Vassilakis (2001),interference,#B50000,Compressed
8.933933933933934,-0.7405895383519172,Vass01,Vassilakis (2001),interference,#B50000,Compressed
8.94894894894895,-0.7318345851865045,Vass01,Vassilakis (2001),interference,#B50000,Compressed
8.963963963963964,-0.7225770104112332,Vass01,Vassilakis (2001),interference,#B50000,Compressed
8.97897897897898,-0.7205896580670796,Vass01,Vassilakis (2001),interference,#B50000,Compressed
8.993993993993994,-0.7255698421056905,Vass01,Vassilakis (2001),interference,#B50000,Compressed
9.00900900900901,-0.7300456573293239,Vass01,Vassilakis (2001),interference,#B50000,Compressed
9.024024024024024,-0.7340318465738236,Vass01,Vassilakis (2001),interference,#B50000,Compressed
9.03903903903904,-0.7375419858211553,Vass01,Vassilakis (2001),interference,#B50000,Compressed
9.054054054054054,-0.7405884618760373,Vass01,Vassilakis (2001),interference,#B50000,Compressed
9.06906906906907,-0.7431824974228657,Vass01,Vassilakis (2001),interference,#B50000,Compressed
9.084084084084084,-0.7453341645791126,Vass01,Vassilakis (2001),interference,#B50000,Compressed
9.0990990990991,-0.7470523967699237,Vass01,Vassilakis (2001),interference,#B50000,Compressed
9.114114114114114,-0.7483449989311526,Vass01,Vassilakis (2001),interference,#B50000,Compressed
9.12912912912913,-0.74921865604584,Vass01,Vassilakis (2001),interference,#B50000,Compressed
9.144144144144144,-0.749678940017034,Vass01,Vassilakis (2001),interference,#B50000,Compressed
9.15915915915916,-0.7497303148779222,Vass01,Vassilakis (2001),interference,#B50000,Compressed
9.174174174174174,-0.7493761403378674,Vass01,Vassilakis (2001),interference,#B50000,Compressed
9.18918918918919,-0.7486186736610251,Vass01,Vassilakis (2001),interference,#B50000,Compressed
9.204204204204204,-0.7474590763985411,Vass01,Vassilakis (2001),interference,#B50000,Compressed
9.21921921921922,-0.7458973868649528,Vass01,Vassilakis (2001),interference,#B50000,Compressed
9.234234234234235,-0.7439324776670108,Vass01,Vassilakis (2001),interference,#B50000,Compressed
9.24924924924925,-0.741562338849778,Vass01,Vassilakis (2001),interference,#B50000,Compressed
9.264264264264265,-0.7387835741109673,Vass01,Vassilakis (2001),interference,#B50000,Compressed
9.27927927927928,-0.7355918346911866,Vass01,Vassilakis (2001),interference,#B50000,Compressed
9.294294294294295,-0.7319815396682327,Vass01,Vassilakis (2001),interference,#B50000,Compressed
9.30930930930931,-0.7279459914266597,Vass01,Vassilakis (2001),interference,#B50000,Compressed
9.324324324324325,-0.7234773301336124,Vass01,Vassilakis (2001),interference,#B50000,Compressed
9.33933933933934,-0.7185665182707379,Vass01,Vassilakis (2001),interference,#B50000,Compressed
9.354354354354355,-0.7132033233136393,Vass01,Vassilakis (2001),interference,#B50000,Compressed
9.36936936936937,-0.7073762985278936,Vass01,Vassilakis (2001),interference,#B50000,Compressed
9.384384384384385,-0.7010727618479254,Vass01,Vassilakis (2001),interference,#B50000,Compressed
9.3993993993994,-0.6942787728024515,Vass01,Vassilakis (2001),interference,#B50000,Compressed
9.414414414414415,-0.6869791074477424,Vass01,Vassilakis (2001),interference,#B50000,Compressed
9.42942942942943,-0.6859713551722307,Vass01,Vassilakis (2001),interference,#B50000,Compressed
9.444444444444445,-0.693388708901991,Vass01,Vassilakis (2001),interference,#B50000,Compressed
9.45945945945946,-0.7003188938479752,Vass01,Vassilakis (2001),interference,#B50000,Compressed
9.474474474474475,-0.7067887537717977,Vass01,Vassilakis (2001),interference,#B50000,Compressed
9.48948948948949,-0.7128241114581829,Vass01,Vassilakis (2001),interference,#B50000,Compressed
9.504504504504505,-0.7184495774750671,Vass01,Vassilakis (2001),interference,#B50000,Compressed
9.51951951951952,-0.7236886464924821,Vass01,Vassilakis (2001),interference,#B50000,Compressed
9.534534534534535,-0.728563841474741,Vass01,Vassilakis (2001),interference,#B50000,Compressed
9.54954954954955,-0.7330966421189784,Vass01,Vassilakis (2001),interference,#B50000,Compressed
9.564564564564565,-0.7373075540030555,Vass01,Vassilakis (2001),interference,#B50000,Compressed
9.57957957957958,-0.7412161432042869,Vass01,Vassilakis (2001),interference,#B50000,Compressed
9.594594594594595,-0.7448410695168726,Vass01,Vassilakis (2001),interference,#B50000,Compressed
9.60960960960961,-0.7482001183104181,Vass01,Vassilakis (2001),interference,#B50000,Compressed
9.624624624624625,-0.751310231070438,Vass01,Vassilakis (2001),interference,#B50000,Compressed
9.63963963963964,-0.7541875346600837,Vass01,Vassilakis (2001),interference,#B50000,Compressed
9.654654654654655,-0.7568473693407507,Vass01,Vassilakis (2001),interference,#B50000,Compressed
9.66966966966967,-0.7593043155877628,Vass01,Vassilakis (2001),interference,#B50000,Compressed
9.684684684684685,-0.7615722197358515,Vass01,Vassilakis (2001),interference,#B50000,Compressed
9.6996996996997,-0.7636641726287581,Vass01,Vassilakis (2001),interference,#B50000,Compressed
9.714714714714715,-0.7655928543303546,Vass01,Vassilakis (2001),interference,#B50000,Compressed
9.72972972972973,-0.7673697189540788,Vass01,Vassilakis (2001),interference,#B50000,Compressed
9.744744744744745,-0.7690060598220696,Vass01,Vassilakis (2001),interference,#B50000,Compressed
9.75975975975976,-0.7705123985112765,Vass01,Vassilakis (2001),interference,#B50000,Compressed
9.774774774774775,-0.7718986535229817,Vass01,Vassilakis (2001),interference,#B50000,Compressed
9.78978978978979,-0.7731741585915011,Vass01,Vassilakis (2001),interference,#B50000,Compressed
9.804804804804805,-0.7743476800512116,Vass01,Vassilakis (2001),interference,#B50000,Compressed
9.81981981981982,-0.7754274332848087,Vass01,Vassilakis (2001),interference,#B50000,Compressed
9.834834834834835,-0.7764210982745494,Vass01,Vassilakis (2001),interference,#B50000,Compressed
9.84984984984985,-0.77733583427707,Vass01,Vassilakis (2001),interference,#B50000,Compressed
9.864864864864865,-0.778178293641208,Vass01,Vassilakis (2001),interference,#B50000,Compressed
9.87987987987988,-0.7789546347872436,Vass01,Vassilakis (2001),interference,#B50000,Compressed
9.894894894894895,-0.779670534364779,Vass01,Vassilakis (2001),interference,#B50000,Compressed
9.90990990990991,-0.7803311986055157,Vass01,Vassilakis (2001),interference,#B50000,Compressed
9.924924924924925,-0.78094137388606,Vass01,Vassilakis (2001),interference,#B50000,Compressed
9.93993993993994,-0.7815053565148902,Vass01,Vassilakis (2001),interference,#B50000,Compressed
9.954954954954955,-0.7820270017565902,Vass01,Vassilakis (2001),interference,#B50000,Compressed
9.96996996996997,-0.7825097321054665,Vass01,Vassilakis (2001),interference,#B50000,Compressed
9.984984984984985,-0.7829565448196302,Vass01,Vassilakis (2001),interference,#B50000,Compressed
10,-0.7833700187256959,Vass01,Vassilakis (2001),interference,#B50000,Compressed
10.015015015015015,-0.7837523302318689,Vass01,Vassilakis (2001),interference,#B50000,Compressed
10.03003003003003,-0.7841052189872973,Vass01,Vassilakis (2001),interference,#B50000,Compressed
10.045045045045045,-0.7844300521169255,Vass01,Vassilakis (2001),interference,#B50000,Compressed
10.06006006006006,-0.7847277884805384,Vass01,Vassilakis (2001),interference,#B50000,Compressed
10.075075075075075,-0.7849989918757013,Vass01,Vassilakis (2001),interference,#B50000,Compressed
10.09009009009009,-0.7852438336247897,Vass01,Vassilakis (2001),interference,#B50000,Compressed
10.105105105105105,-0.7854620944766715,Vass01,Vassilakis (2001),interference,#B50000,Compressed
10.12012012012012,-0.7856531658255644,Vass01,Vassilakis (2001),interference,#B50000,Compressed
10.135135135135135,-0.7858160502486623,Vass01,Vassilakis (2001),interference,#B50000,Compressed
10.15015015015015,-0.7859493613631943,Vass01,Vassilakis (2001),interference,#B50000,Compressed
10.165165165165165,-0.7860513230026159,Vass01,Vassilakis (2001),interference,#B50000,Compressed
10.18018018018018,-0.7861197677107277,Vass01,Vassilakis (2001),interference,#B50000,Compressed
10.195195195195195,-0.7861521427527709,Vass01,Vassilakis (2001),interference,#B50000,Compressed
10.21021021021021,-0.7861454744398743,Vass01,Vassilakis (2001),interference,#B50000,Compressed
10.225225225225225,-0.7860964137467629,Vass01,Vassilakis (2001),interference,#B50000,Compressed
10.24024024024024,-0.7860011813962078,Vass01,Vassilakis (2001),interference,#B50000,Compressed
10.255255255255255,-0.7858556621289479,Vass01,Vassilakis (2001),interference,#B50000,Compressed
10.27027027027027,-0.7856552136472889,Vass01,Vassilakis (2001),interference,#B50000,Compressed
10.285285285285285,-0.7853948486437365,Vass01,Vassilakis (2001),interference,#B50000,Compressed
10.3003003003003,-0.7850691321234533,Vass01,Vassilakis (2001),interference,#B50000,Compressed
10.315315315315315,-0.7846721928819202,Vass01,Vassilakis (2001),interference,#B50000,Compressed
10.33033033033033,-0.7841977149002014,Vass01,Vassilakis (2001),interference,#B50000,Compressed
10.345345345345345,-0.7836389279807676,Vass01,Vassilakis (2001),interference,#B50000,Compressed
10.36036036036036,-0.7829885976107168,Vass01,Vassilakis (2001),interference,#B50000,Compressed
10.375375375375375,-0.7822390140381978,Vass01,Vassilakis (2001),interference,#B50000,Compressed
10.39039039039039,-0.7813819805467104,Vass01,Vassilakis (2001),interference,#B50000,Compressed
10.405405405405405,-0.7804088009107906,Vass01,Vassilakis (2001),interference,#B50000,Compressed
10.42042042042042,-0.7793102660155444,Vass01,Vassilakis (2001),interference,#B50000,Compressed
10.435435435435435,-0.7780766499673732,Vass01,Vassilakis (2001),interference,#B50000,Compressed
10.45045045045045,-0.7766976535977812,Vass01,Vassilakis (2001),interference,#B50000,Compressed
10.465465465465465,-0.7751624450328787,Vass01,Vassilakis (2001),interference,#B50000,Compressed
10.48048048048048,-0.7734596123638559,Vass01,Vassilakis (2001),interference,#B50000,Compressed
10.495495495495495,-0.771577162109173,Vass01,Vassilakis (2001),interference,#B50000,Compressed
10.51051051051051,-0.7695024182459075,Vass01,Vassilakis (2001),interference,#B50000,Compressed
10.525525525525525,-0.7672222349510321,Vass01,Vassilakis (2001),interference,#B50000,Compressed
10.54054054054054,-0.7647226613500259,Vass01,Vassilakis (2001),interference,#B50000,Compressed
10.555555555555555,-0.7619891219364731,Vass01,Vassilakis (2001),interference,#B50000,Compressed
10.57057057057057,-0.7590063437694867,Vass01,Vassilakis (2001),interference,#B50000,Compressed
10.585585585585585,-0.7557583323765192,Vass01,Vassilakis (2001),interference,#B50000,Compressed
10.6006006006006,-0.7522283465084147,Vass01,Vassilakis (2001),interference,#B50000,Compressed
10.615615615615615,-0.7483988717113259,Vass01,Vassilakis (2001),interference,#B50000,Compressed
10.63063063063063,-0.744251592678473,Vass01,Vassilakis (2001),interference,#B50000,Compressed
10.645645645645645,-0.7397673643429249,Vass01,Vassilakis (2001),interference,#B50000,Compressed
10.66066066066066,-0.734926181670977,Vass01,Vassilakis (2001),interference,#B50000,Compressed
10.675675675675675,-0.7297071481137587,Vass01,Vassilakis (2001),interference,#B50000,Compressed
10.69069069069069,-0.7240883978219027,Vass01,Vassilakis (2001),interference,#B50000,Compressed
10.705705705705705,-0.7180472406981345,Vass01,Vassilakis (2001),interference,#B50000,Compressed
10.72072072072072,-0.7115597647475707,Vass01,Vassilakis (2001),interference,#B50000,Compressed
10.735735735735735,-0.7046013416639169,Vass01,Vassilakis (2001),interference,#B50000,Compressed
10.75075075075075,-0.6971460078823566,Vass01,Vassilakis (2001),interference,#B50000,Compressed
10.765765765765765,-0.6891667742688433,Vass01,Vassilakis (2001),interference,#B50000,Compressed
10.78078078078078,-0.6806354978039755,Vass01,Vassilakis (2001),interference,#B50000,Compressed
10.795795795795796,-0.671522837540385,Vass01,Vassilakis (2001),interference,#B50000,Compressed
10.81081081081081,-0.6617982087459144,Vass01,Vassilakis (2001),interference,#B50000,Compressed
10.825825825825826,-0.6514297351687104,Vass01,Vassilakis (2001),interference,#B50000,Compressed
10.84084084084084,-0.6403841993575986,Vass01,Vassilakis (2001),interference,#B50000,Compressed
10.855855855855856,-0.6286269909685545,Vass01,Vassilakis (2001),interference,#B50000,Compressed
10.87087087087087,-0.6161220529853565,Vass01,Vassilakis (2001),interference,#B50000,Compressed
10.885885885885886,-0.6028318257794391,Vass01,Vassilakis (2001),interference,#B50000,Compressed
10.9009009009009,-0.5887171889312416,Vass01,Vassilakis (2001),interference,#B50000,Compressed
10.915915915915916,-0.5737374007321958,Vass01,Vassilakis (2001),interference,#B50000,Compressed
10.93093093093093,-0.5578500352831918,Vass01,Vassilakis (2001),interference,#B50000,Compressed
10.945945945945946,-0.5410109171023351,Vass01,Vassilakis (2001),interference,#B50000,Compressed
10.96096096096096,-0.5231740531511885,Vass01,Vassilakis (2001),interference,#B50000,Compressed
10.975975975975976,-0.5042915621852039,Vass01,Vassilakis (2001),interference,#B50000,Compressed
10.99099099099099,-0.48431360133064416,Vass01,Vassilakis (2001),interference,#B50000,Compressed
11.006006006006006,-0.4631882998073754,Vass01,Vassilakis (2001),interference,#B50000,Compressed
11.02102102102102,-0.44086163956548086,Vass01,Vassilakis (2001),interference,#B50000,Compressed
11.036036036036036,-0.41727743303951687,Vass01,Vassilakis (2001),interference,#B50000,Compressed
11.05105105105105,-0.39237719749277494,Vass01,Vassilakis (2001),interference,#B50000,Compressed
11.066066066066066,-0.3661000761406137,Vass01,Vassilakis (2001),interference,#B50000,Compressed
11.08108108108108,-0.33838274580849265,Vass01,Vassilakis (2001),interference,#B50000,Compressed
11.096096096096096,-0.30915932101742194,Vass01,Vassilakis (2001),interference,#B50000,Compressed
11.11111111111111,-0.278361254364925,Vass01,Vassilakis (2001),interference,#B50000,Compressed
11.126126126126126,-0.3043216790984342,Vass01,Vassilakis (2001),interference,#B50000,Compressed
11.14114114114114,-0.33236092528585115,Vass01,Vassilakis (2001),interference,#B50000,Compressed
11.156156156156156,-0.3589014455112152,Vass01,Vassilakis (2001),interference,#B50000,Compressed
11.17117117117117,-0.3840062383963376,Vass01,Vassilakis (2001),interference,#B50000,Compressed
11.186186186186186,-0.4077359586079978,Vass01,Vassilakis (2001),interference,#B50000,Compressed
11.2012012012012,-0.43014900785291493,Vass01,Vassilakis (2001),interference,#B50000,Compressed
11.216216216216216,-0.45130158142424587,Vass01,Vassilakis (2001),interference,#B50000,Compressed
11.23123123123123,-0.47124779710649667,Vass01,Vassilakis (2001),interference,#B50000,Compressed
11.246246246246246,-0.4900397290890756,Vass01,Vassilakis (2001),interference,#B50000,Compressed
11.26126126126126,-0.507727747107745,Vass01,Vassilakis (2001),interference,#B50000,Compressed
11.276276276276276,-0.5243595711010455,Vass01,Vassilakis (2001),interference,#B50000,Compressed
11.29129129129129,-0.5399818747439357,Vass01,Vassilakis (2001),interference,#B50000,Compressed
11.306306306306306,-0.5546393111277972,Vass01,Vassilakis (2001),interference,#B50000,Compressed
11.32132132132132,-0.5683748391065462,Vass01,Vassilakis (2001),interference,#B50000,Compressed
11.336336336336336,-0.5812297836228277,Vass01,Vassilakis (2001),interference,#B50000,Compressed
11.35135135135135,-0.5932438939389936,Vass01,Vassilakis (2001),interference,#B50000,Compressed
11.366366366366366,-0.6044553998414112,Vass01,Vassilakis (2001),interference,#B50000,Compressed
11.381381381381381,-0.6149010658840672,Vass01,Vassilakis (2001),interference,#B50000,Compressed
11.396396396396396,-0.6246162437354281,Vass01,Vassilakis (2001),interference,#B50000,Compressed
11.411411411411411,-0.6336349226904348,Vass01,Vassilakis (2001),interference,#B50000,Compressed
11.426426426426426,-0.6419897784071814,Vass01,Vassilakis (2001),interference,#B50000,Compressed
11.441441441441441,-0.6497122301976209,Vass01,Vassilakis (2001),interference,#B50000,Compressed
11.456456456456456,-0.6568325416869111,Vass01,Vassilakis (2001),interference,#B50000,Compressed
11.471471471471471,-0.6633795326467286,Vass01,Vassilakis (2001),interference,#B50000,Compressed
11.486486486486486,-0.6693812773764718,Vass01,Vassilakis (2001),interference,#B50000,Compressed
11.501501501501501,-0.6748644703615013,Vass01,Vassilakis (2001),interference,#B50000,Compressed
11.516516516516516,-0.6798547133044567,Vass01,Vassilakis (2001),interference,#B50000,Compressed
11.531531531531531,-0.684376828467448,Vass01,Vassilakis (2001),interference,#B50000,Compressed
11.546546546546546,-0.6884545420580646,Vass01,Vassilakis (2001),interference,#B50000,Compressed
11.561561561561561,-0.6921106343030781,Vass01,Vassilakis (2001),interference,#B50000,Compressed
11.576576576576576,-0.6953669733056316,Vass01,Vassilakis (2001),interference,#B50000,Compressed
11.591591591591591,-0.6982445476643655,Vass01,Vassilakis (2001),interference,#B50000,Compressed
11.606606606606606,-0.7007634978937723,Vass01,Vassilakis (2001),interference,#B50000,Compressed
11.621621621621621,-0.7029431466836519,Vass01,Vassilakis (2001),interference,#B50000,Compressed
11.636636636636636,-0.7048020280341812,Vass01,Vassilakis (2001),interference,#B50000,Compressed
11.651651651651651,-0.7063579153018379,Vass01,Vassilakis (2001),interference,#B50000,Compressed
11.666666666666666,-0.707627848190075,Vass01,Vassilakis (2001),interference,#B50000,Compressed
11.681681681681681,-0.7086281587174573,Vass01,Vassilakis (2001),interference,#B50000,Compressed
11.696696696696696,-0.7093744523205058,Vass01,Vassilakis (2001),interference,#B50000,Compressed
11.711711711711711,-0.7098817538299587,Vass01,Vassilakis (2001),interference,#B50000,Compressed
11.726726726726726,-0.7101644789294843,Vass01,Vassilakis (2001),interference,#B50000,Compressed
11.741741741741741,-0.7102363184184648,Vass01,Vassilakis (2001),interference,#B50000,Compressed
11.756756756756756,-0.7101104217507421,Vass01,Vassilakis (2001),interference,#B50000,Compressed
11.771771771771771,-0.7097993667132699,Vass01,Vassilakis (2001),interference,#B50000,Compressed
11.786786786786786,-0.7093151790541181,Vass01,Vassilakis (2001),interference,#B50000,Compressed
11.801801801801801,-0.7086693513085822,Vass01,Vassilakis (2001),interference,#B50000,Compressed
11.816816816816816,-0.7078728608462693,Vass01,Vassilakis (2001),interference,#B50000,Compressed
11.831831831831831,-0.7069361871611459,Vass01,Vassilakis (2001),interference,#B50000,Compressed
11.846846846846846,-0.7058693284255863,Vass01,Vassilakis (2001),interference,#B50000,Compressed
11.861861861861861,-0.7046818173285143,Vass01,Vassilakis (2001),interference,#B50000,Compressed
11.876876876876876,-0.7033827362169366,Vass01,Vassilakis (2001),interference,#B50000,Compressed
11.891891891891891,-0.7019807315592004,Vass01,Vassilakis (2001),interference,#B50000,Compressed
11.906906906906906,-0.7004840277475328,Vass01,Vassilakis (2001),interference,#B50000,Compressed
11.921921921921921,-0.6989004402565809,Vass01,Vassilakis (2001),interference,#B50000,Compressed
11.936936936936936,-0.6972373881738329,Vass01,Vassilakis (2001),interference,#B50000,Compressed
11.951951951951951,-0.6955019061170484,Vass01,Vassilakis (2001),interference,#B50000,Compressed
11.966966966966966,-0.69370065555302,Vass01,Vassilakis (2001),interference,#B50000,Compressed
11.981981981981981,-0.6918399355312366,Vass01,Vassilakis (2001),interference,#B50000,Compressed
11.996996996996996,-0.6899256928452857,Vass01,Vassilakis (2001),interference,#B50000,Compressed
12.012012012012011,-0.687963541734528,Vass01,Vassilakis (2001),interference,#B50000,Compressed
12.027027027027026,-0.6859587325356695,Vass01,Vassilakis (2001),interference,#B50000,Compressed
12.042042042042041,-0.6839162207965895,Vass01,Vassilakis (2001),interference,#B50000,Compressed
12.057057057057056,-0.6818406348636713,Vass01,Vassilakis (2001),interference,#B50000,Compressed
12.072072072072071,-0.6797362934482364,Vass01,Vassilakis (2001),interference,#B50000,Compressed
12.087087087087086,-0.6776072125831897,Vass01,Vassilakis (2001),interference,#B50000,Compressed
12.102102102102101,-0.6754571120771703,Vass01,Vassilakis (2001),interference,#B50000,Compressed
12.117117117117116,-0.6732894214734666,Vass01,Vassilakis (2001),interference,#B50000,Compressed
12.132132132132131,-0.6711072855202191,Vass01,Vassilakis (2001),interference,#B50000,Compressed
12.147147147147146,-0.6689135691578588,Vass01,Vassilakis (2001),interference,#B50000,Compressed
12.162162162162161,-0.6667108620290457,Vass01,Vassilakis (2001),interference,#B50000,Compressed
12.177177177177176,-0.664501482515684,Vass01,Vassilakis (2001),interference,#B50000,Compressed
12.192192192192191,-0.662287481307035,Vass01,Vassilakis (2001),interference,#B50000,Compressed
12.207207207207206,-0.660070652728855,Vass01,Vassilakis (2001),interference,#B50000,Compressed
12.222222222222221,-0.6578525044746238,Vass01,Vassilakis (2001),interference,#B50000,Compressed
12.237237237237236,-0.6556343145061175,Vass01,Vassilakis (2001),interference,#B50000,Compressed
12.252252252252251,-0.6534170655060892,Vass01,Vassilakis (2001),interference,#B50000,Compressed
12.267267267267266,-0.6512015390040669,Vass01,Vassilakis (2001),interference,#B50000,Compressed
12.282282282282281,-0.6489882148532574,Vass01,Vassilakis (2001),interference,#B50000,Compressed
12.297297297297296,-0.6467773309457017,Vass01,Vassilakis (2001),interference,#B50000,Compressed
12.312312312312311,-0.644568869409129,Vass01,Vassilakis (2001),interference,#B50000,Compressed
12.327327327327327,-0.642362556027575,Vass01,Vassilakis (2001),interference,#B50000,Compressed
12.342342342342342,-0.6401578591974563,Vass01,Vassilakis (2001),interference,#B50000,Compressed
12.357357357357357,-0.6379539884159929,Vass01,Vassilakis (2001),interference,#B50000,Compressed
12.372372372372372,-0.6357498922981285,Vass01,Vassilakis (2001),interference,#B50000,Compressed
12.387387387387387,-0.6335442561174943,Vass01,Vassilakis (2001),interference,#B50000,Compressed
12.402402402402402,-0.6313354988662601,Vass01,Vassilakis (2001),interference,#B50000,Compressed
12.417417417417417,-0.6291217698279632,Vass01,Vassilakis (2001),interference,#B50000,Compressed
12.432432432432432,-0.6269009548510801,Vass01,Vassilakis (2001),interference,#B50000,Compressed
12.447447447447447,-0.6246706311492245,Vass01,Vassilakis (2001),interference,#B50000,Compressed
12.462462462462462,-0.6224280992940326,Vass01,Vassilakis (2001),interference,#B50000,Compressed
12.477477477477477,-0.6201703993304456,Vass01,Vassilakis (2001),interference,#B50000,Compressed
12.492492492492492,-0.6178943055068555,Vass01,Vassilakis (2001),interference,#B50000,Compressed
12.507507507507507,-0.6155961833841158,Vass01,Vassilakis (2001),interference,#B50000,Compressed
12.522522522522522,-0.6132722213550451,Vass01,Vassilakis (2001),interference,#B50000,Compressed
12.537537537537537,-0.6109181942042384,Vass01,Vassilakis (2001),interference,#B50000,Compressed
12.552552552552552,-0.6085295854163111,Vass01,Vassilakis (2001),interference,#B50000,Compressed
12.567567567567567,-0.606101545901835,Vass01,Vassilakis (2001),interference,#B50000,Compressed
12.582582582582582,-0.6036288846158364,Vass01,Vassilakis (2001),interference,#B50000,Compressed
12.597597597597597,-0.6011060585602044,Vass01,Vassilakis (2001),interference,#B50000,Compressed
12.612612612612612,-0.5985271621538046,Vass01,Vassilakis (2001),interference,#B50000,Compressed
12.627627627627627,-0.5958859159531963,Vass01,Vassilakis (2001),interference,#B50000,Compressed
12.642642642642642,-0.593175654705949,Vass01,Vassilakis (2001),interference,#B50000,Compressed
12.657657657657657,-0.5903893147174993,Vass01,Vassilakis (2001),interference,#B50000,Compressed
12.672672672672672,-0.5875194205115084,Vass01,Vassilakis (2001),interference,#B50000,Compressed
12.687687687687687,-0.5845580707627063,Vass01,Vassilakis (2001),interference,#B50000,Compressed
12.702702702702702,-0.5814968805369165,Vass01,Vassilakis (2001),interference,#B50000,Compressed
12.717717717717717,-0.5783271008603792,Vass01,Vassilakis (2001),interference,#B50000,Compressed
12.732732732732732,-0.5750394919522978,Vass01,Vassilakis (2001),interference,#B50000,Compressed
12.747747747747747,-0.5716242556220996,Vass01,Vassilakis (2001),interference,#B50000,Compressed
12.762762762762762,-0.5680711232156948,Vass01,Vassilakis (2001),interference,#B50000,Compressed
12.777777777777777,-0.5643692992300335,Vass01,Vassilakis (2001),interference,#B50000,Compressed
12.792792792792792,-0.5605074414692988,Vass01,Vassilakis (2001),interference,#B50000,Compressed
12.807807807807807,-0.5564736402637805,Vass01,Vassilakis (2001),interference,#B50000,Compressed
12.822822822822824,-0.5522553967193621,Vass01,Vassilakis (2001),interference,#B50000,Compressed
12.837837837837839,-0.5478395999643514,Vass01,Vassilakis (2001),interference,#B50000,Compressed
12.852852852852854,-0.5432125033588109,Vass01,Vassilakis (2001),interference,#B50000,Compressed
12.867867867867869,-0.5383596996300322,Vass01,Vassilakis (2001),interference,#B50000,Compressed
12.882882882882884,-0.533266094896295,Vass01,Vassilakis (2001),interference,#B50000,Compressed
12.897897897897899,-0.5279158815394426,Vass01,Vassilakis (2001),interference,#B50000,Compressed
12.912912912912914,-0.5222925098850133,Vass01,Vassilakis (2001),interference,#B50000,Compressed
12.927927927927929,-0.5163786586471867,Vass01,Vassilakis (2001),interference,#B50000,Compressed
12.942942942942944,-0.5101562040937203,Vass01,Vassilakis (2001),interference,#B50000,Compressed
12.957957957957959,-0.5036061878844402,Vass01,Vassilakis (2001),interference,#B50000,Compressed
12.972972972972974,-0.4967087835348764,Vass01,Vassilakis (2001),interference,#B50000,Compressed
12.987987987987989,-0.48944326145455824,Vass01,Vassilakis (2001),interference,#B50000,Compressed
13.003003003003004,-0.48421777394441995,Vass01,Vassilakis (2001),interference,#B50000,Compressed
13.018018018018019,-0.48916937944190736,Vass01,Vassilakis (2001),interference,#B50000,Compressed
13.033033033033034,-0.49373481793428614,Vass01,Vassilakis (2001),interference,#B50000,Compressed
13.048048048048049,-0.4979285996247632,Vass01,Vassilakis (2001),interference,#B50000,Compressed
13.063063063063064,-0.501764340554363,Vass01,Vassilakis (2001),interference,#B50000,Compressed
13.078078078078079,-0.5052547840958578,Vass01,Vassilakis (2001),interference,#B50000,Compressed
13.093093093093094,-0.5084118211670063,Vass01,Vassilakis (2001),interference,#B50000,Compressed
13.108108108108109,-0.5112465091882484,Vass01,Vassilakis (2001),interference,#B50000,Compressed
13.123123123123124,-0.5137690898082428,Vass01,Vassilakis (2001),interference,#B50000,Compressed
13.138138138138139,-0.5159890054192326,Vass01,Vassilakis (2001),interference,#B50000,Compressed
13.153153153153154,-0.5179149144827865,Vass01,Vassilakis (2001),interference,#B50000,Compressed
13.168168168168169,-0.5195547056848218,Vass01,Vassilakis (2001),interference,#B50000,Compressed
13.183183183183184,-0.5209155109375877,Vass01,Vassilakis (2001),interference,#B50000,Compressed
13.198198198198199,-0.5220037253498035,Vass01,Vassilakis (2001),interference,#B50000,Compressed
13.213213213213214,-0.5228249855469617,Vass01,Vassilakis (2001),interference,#B50000,Compressed
13.228228228228229,-0.5233842336691639,Vass01,Vassilakis (2001),interference,#B50000,Compressed
13.243243243243244,-0.5236856705716345,Vass01,Vassilakis (2001),interference,#B50000,Compressed
13.258258258258259,-0.5237327139499779,Vass01,Vassilakis (2001),interference,#B50000,Compressed
13.273273273273274,-0.5235283411110853,Vass01,Vassilakis (2001),interference,#B50000,Compressed
13.288288288288289,-0.5230745724159971,Vass01,Vassilakis (2001),interference,#B50000,Compressed
13.303303303303304,-0.5223728199429098,Vass01,Vassilakis (2001),interference,#B50000,Compressed
13.318318318318319,-0.5214238063241756,Vass01,Vassilakis (2001),interference,#B50000,Compressed
13.333333333333334,-0.5202275668747776,Vass01,Vassilakis (2001),interference,#B50000,Compressed
13.348348348348349,-0.5187834506690814,Vass01,Vassilakis (2001),interference,#B50000,Compressed
13.363363363363364,-0.5170901205669676,Vass01,Vassilakis (2001),interference,#B50000,Compressed
13.378378378378379,-0.5151455521889927,Vass01,Vassilakis (2001),interference,#B50000,Compressed
13.393393393393394,-0.5129470318390617,Vass01,Vassilakis (2001),interference,#B50000,Compressed
13.408408408408409,-0.5104911533715593,Vass01,Vassilakis (2001),interference,#B50000,Compressed
13.423423423423424,-0.5077738139986328,Vass01,Vassilakis (2001),interference,#B50000,Compressed
13.438438438438439,-0.504790219146125,Vass01,Vassilakis (2001),interference,#B50000,Compressed
13.453453453453454,-0.5015348356649306,Vass01,Vassilakis (2001),interference,#B50000,Compressed
13.468468468468469,-0.4980014799893531,Vass01,Vassilakis (2001),interference,#B50000,Compressed
13.483483483483484,-0.49418314568757016,Vass01,Vassilakis (2001),interference,#B50000,Compressed
13.498498498498499,-0.4900721457109259,Vass01,Vassilakis (2001),interference,#B50000,Compressed
13.513513513513514,-0.4856600382770634,Vass01,Vassilakis (2001),interference,#B50000,Compressed
13.528528528528529,-0.4809376974849854,Vass01,Vassilakis (2001),interference,#B50000,Compressed
13.543543543543544,-0.47589513591954924,Vass01,Vassilakis (2001),interference,#B50000,Compressed
13.558558558558559,-0.4705216135325312,Vass01,Vassilakis (2001),interference,#B50000,Compressed
13.573573573573574,-0.4648055914721745,Vass01,Vassilakis (2001),interference,#B50000,Compressed
13.588588588588589,-0.4630052701100746,Vass01,Vassilakis (2001),interference,#B50000,Compressed
13.603603603603604,-0.46851498881785636,Vass01,Vassilakis (2001),interference,#B50000,Compressed
13.618618618618619,-0.47368800314287923,Vass01,Vassilakis (2001),interference,#B50000,Compressed
13.633633633633634,-0.4785401575536805,Vass01,Vassilakis (2001),interference,#B50000,Compressed
13.64864864864865,-0.48308656428350927,Vass01,Vassilakis (2001),interference,#B50000,Compressed
13.663663663663664,-0.48734162482024523,Vass01,Vassilakis (2001),interference,#B50000,Compressed
13.67867867867868,-0.49131905042623164,Vass01,Vassilakis (2001),interference,#B50000,Compressed
13.693693693693694,-0.4950318396411567,Vass01,Vassilakis (2001),interference,#B50000,Compressed
13.70870870870871,-0.49849246521866675,Vass01,Vassilakis (2001),interference,#B50000,Compressed
13.723723723723724,-0.5017126348047958,Vass01,Vassilakis (2001),interference,#B50000,Compressed
13.73873873873874,-0.5047034947428819,Vass01,Vassilakis (2001),interference,#B50000,Compressed
13.753753753753754,-0.5074755757060427,Vass01,Vassilakis (2001),interference,#B50000,Compressed
13.76876876876877,-0.5100388268939262,Vass01,Vassilakis (2001),interference,#B50000,Compressed
13.783783783783784,-0.5124026255116095,Vass01,Vassilakis (2001),interference,#B50000,Compressed
13.7987987987988,-0.5145757902493273,Vass01,Vassilakis (2001),interference,#B50000,Compressed
13.813813813813814,-0.5165665939569337,Vass01,Vassilakis (2001),interference,#B50000,Compressed
13.82882882882883,-0.5183827755263822,Vass01,Vassilakis (2001),interference,#B50000,Compressed
13.843843843843844,-0.5200315509945947,Vass01,Vassilakis (2001),interference,#B50000,Compressed
13.85885885885886,-0.5215196238782039,Vass01,Vassilakis (2001),interference,#B50000,Compressed
13.873873873873874,-0.52285319475061,Vass01,Vassilakis (2001),interference,#B50000,Compressed
13.88888888888889,-0.5240379700709785,Vass01,Vassilakis (2001),interference,#B50000,Compressed
13.903903903903904,-0.5250791702738317,Vass01,Vassilakis (2001),interference,#B50000,Compressed
13.91891891891892,-0.5259815371269358,Vass01,Vassilakis (2001),interference,#B50000,Compressed
13.933933933933934,-0.5267493403643871,Vass01,Vassilakis (2001),interference,#B50000,Compressed
13.94894894894895,-0.5273863836007738,Vass01,Vassilakis (2001),interference,#B50000,Compressed
13.963963963963964,-0.5278960095314501,Vass01,Vassilakis (2001),interference,#B50000,Compressed
13.97897897897898,-0.5282811044230628,Vass01,Vassilakis (2001),interference,#B50000,Compressed
13.993993993993994,-0.5285441018975149,Vass01,Vassilakis (2001),interference,#B50000,Compressed
14.00900900900901,-0.5286869962312791,Vass01,Vassilakis (2001),interference,#B50000,Compressed
14.024024024024024,-0.5287113038547324,Vass01,Vassilakis (2001),interference,#B50000,Compressed
14.03903903903904,-0.5286181263419915,Vass01,Vassilakis (2001),interference,#B50000,Compressed
14.054054054054054,-0.5284081105066187,Vass01,Vassilakis (2001),interference,#B50000,Compressed
14.06906906906907,-0.5280814588881908,Vass01,Vassilakis (2001),interference,#B50000,Compressed
14.084084084084084,-0.5276379293136579,Vass01,Vassilakis (2001),interference,#B50000,Compressed
14.0990990990991,-0.5270768337491557,Vass01,Vassilakis (2001),interference,#B50000,Compressed
14.114114114114114,-0.5263970364381058,Vass01,Vassilakis (2001),interference,#B50000,Compressed
14.12912912912913,-0.5255969513205219,Vass01,Vassilakis (2001),interference,#B50000,Compressed
14.144144144144144,-0.5246745387274717,Vass01,Vassilakis (2001),interference,#B50000,Compressed
14.15915915915916,-0.5236273013436291,Vass01,Vassilakis (2001),interference,#B50000,Compressed
14.174174174174174,-0.5224522794299344,Vass01,Vassilakis (2001),interference,#B50000,Compressed
14.18918918918919,-0.521146045297298,Vass01,Vassilakis (2001),interference,#B50000,Compressed
14.204204204204204,-0.5197047050017566,Vass01,Vassilakis (2001),interference,#B50000,Compressed
14.21921921921922,-0.5181238593654877,Vass01,Vassilakis (2001),interference,#B50000,Compressed
14.234234234234235,-0.5163986496682238,Vass01,Vassilakis (2001),interference,#B50000,Compressed
14.24924924924925,-0.5145236945217482,Vass01,Vassilakis (2001),interference,#B50000,Compressed
14.264264264264265,-0.5124931200609104,Vass01,Vassilakis (2001),interference,#B50000,Compressed
14.27927927927928,-0.5103005345875221,Vass01,Vassilakis (2001),interference,#B50000,Compressed
14.294294294294295,-0.507939013998483,Vass01,Vassilakis (2001),interference,#B50000,Compressed
14.30930930930931,-0.5054010943728315,Vass01,Vassilakis (2001),interference,#B50000,Compressed
14.324324324324325,-0.5026787583908683,Vass01,Vassilakis (2001),interference,#B50000,Compressed
14.33933933933934,-0.4997634215876905,Vass01,Vassilakis (2001),interference,#B50000,Compressed
14.354354354354355,-0.4966459176866011,Vass01,Vassilakis (2001),interference,#B50000,Compressed
14.36936936936937,-0.49331648298969244,Vass01,Vassilakis (2001),interference,#B50000,Compressed
14.384384384384385,-0.4897647398015737,Vass01,Vassilakis (2001),interference,#B50000,Compressed
14.3993993993994,-0.4859796788607651,Vass01,Vassilakis (2001),interference,#B50000,Compressed
14.414414414414415,-0.48194964075206526,Vass01,Vassilakis (2001),interference,#B50000,Compressed
14.42942942942943,-0.47766229627154017,Vass01,Vassilakis (2001),interference,#B50000,Compressed
14.444444444444445,-0.473104635747429,Vass01,Vassilakis (2001),interference,#B50000,Compressed
14.45945945945946,-0.46826274142057656,Vass01,Vassilakis (2001),interference,#B50000,Compressed
14.474474474474475,-0.4631224758985714,Vass01,Vassilakis (2001),interference,#B50000,Compressed
14.48948948948949,-0.45766829636437334,Vass01,Vassilakis (2001),interference,#B50000,Compressed
14.504504504504505,-0.45188449630615474,Vass01,Vassilakis (2001),interference,#B50000,Compressed
14.51951951951952,-0.4457541160295211,Vass01,Vassilakis (2001),interference,#B50000,Compressed
14.534534534534535,-0.4392594858930846,Vass01,Vassilakis (2001),interference,#B50000,Compressed
14.54954954954955,-0.43238207526099154,Vass01,Vassilakis (2001),interference,#B50000,Compressed
14.564564564564565,-0.4251024544358796,Vass01,Vassilakis (2001),interference,#B50000,Compressed
14.57957957957958,-0.4174002626497891,Vass01,Vassilakis (2001),interference,#B50000,Compressed
14.594594594594595,-0.4092541745891081,Vass01,Vassilakis (2001),interference,#B50000,Compressed
14.60960960960961,-0.4006418654043616,Vass01,Vassilakis (2001),interference,#B50000,Compressed
14.624624624624625,-0.391539974153513,Vass01,Vassilakis (2001),interference,#B50000,Compressed
14.63963963963964,-0.3819240656250081,Vass01,Vassilakis (2001),interference,#B50000,Compressed
14.654654654654655,-0.37176859048472166,Vass01,Vassilakis (2001),interference,#B50000,Compressed
14.66966966966967,-0.36104684368863754,Vass01,Vassilakis (2001),interference,#B50000,Compressed
14.684684684684685,-0.3497309211002902,Vass01,Vassilakis (2001),interference,#B50000,Compressed
14.6996996996997,-0.35331113347412435,Vass01,Vassilakis (2001),interference,#B50000,Compressed
14.714714714714715,-0.3630757187451781,Vass01,Vassilakis (2001),interference,#B50000,Compressed
14.72972972972973,-0.3722617226719438,Vass01,Vassilakis (2001),interference,#B50000,Compressed
14.744744744744745,-0.3808952571434085,Vass01,Vassilakis (2001),interference,#B50000,Compressed
14.75975975975976,-0.3890013386151544,Vass01,Vassilakis (2001),interference,#B50000,Compressed
14.774774774774775,-0.3966039270836808,Vass01,Vassilakis (2001),interference,#B50000,Compressed
14.78978978978979,-0.40372596162527113,Vass01,Vassilakis (2001),interference,#B50000,Compressed
14.804804804804805,-0.4103893945284556,Vass01,Vassilakis (2001),interference,#B50000,Compressed
14.81981981981982,-0.41661522406148277,Vass01,Vassilakis (2001),interference,#B50000,Compressed
14.834834834834835,-0.4224235259149145,Vass01,Vassilakis (2001),interference,#B50000,Compressed
14.84984984984985,-0.4278334833576826,Vass01,Vassilakis (2001),interference,#B50000,Compressed
14.864864864864865,-0.4328634161434107,Vass01,Vassilakis (2001),interference,#B50000,Compressed
14.87987987987988,-0.4375308082024727,Vass01,Vassilakis (2001),interference,#B50000,Compressed
14.894894894894895,-0.44185233415360997,Vass01,Vassilakis (2001),interference,#B50000,Compressed
14.90990990990991,-0.445843884667588,Vass01,Vassilakis (2001),interference,#B50000,Compressed
14.924924924924925,-0.4495205907140395,Vass01,Vassilakis (2001),interference,#B50000,Compressed
14.93993993993994,-0.4528968467211505,Vass01,Vassilakis (2001),interference,#B50000,Compressed
14.954954954954955,-0.45598633267666894,Vass01,Vassilakis (2001),interference,#B50000,Compressed
14.96996996996997,-0.4588020351973294,Vass01,Vassilakis (2001),interference,#B50000,Compressed
14.984984984984985,-0.4613562675925232,Vass01,Vassilakis (2001),interference,#B50000,Compressed
15,-0.46366068894688917,Vass01,Vassilakis (2001),interference,#B50000,Compressed
