interval,rating,rating_boot_mean,rating_boot_se
0,0.6082500993228861,0.6124186423975959,0.17909663626991382
0.015015015015015015,0.6058292556586512,0.6098082322004111,0.1771410242099129
0.03003003003003003,0.6030091695918699,0.6067967251883879,0.17510586490649238
0.04504504504504504,0.599747558136168,0.6033424902101959,0.1729945811540427
0.06006006006006006,0.5960013675694311,0.5994030841100695,0.17081155148355648
0.07507507507507508,0.5917271648932052,0.5949356288908347,0.16856218061288397
0.09009009009009009,0.5868815773893697,0.5898972385903337,0.16625296450088387
0.10510510510510511,0.5814217763584998,0.5842454930966917,0.16389154795684335
0.12012012012012012,0.575305999450275,0.5779389545791213,0.16148677220112534
0.13513513513513514,0.5684941044004626,0.5709377206723354,0.1590487089568748
0.15015015015015015,0.5609481455859027,0.5632040071087775,0.15658867652432337
0.16516516516516516,0.552632963718213,0.5547027512329439,0.15411923183340995
0.18018018018018017,0.5435167783297182,0.5454022268410913,0.15165413073737058
0.19519519519519518,0.5335717725506778,0.5352746601399754,0.14920824694926055
0.21021021021021022,0.5227746600871772,0.5242968363599252,0.14679743831696643
0.22522522522522523,0.5111072252846345,0.5124506867092313,0.14443834801657932
0.24024024024024024,0.498556828640777,0.4997238458991675,0.1421481283070118
0.2552552552552553,0.4851168719846716,0.48611017134104206,0.13994407642507609
0.2702702702702703,0.470787219569134,0.47161021621614324,0.1378431767056665
0.2852852852852853,0.45557457328217144,0.45623164980843167,0.13586155060862393
0.3003003003003003,0.439492801783466,0.43998961960463234,0.1340138271363717
0.3153153153153153,0.4225632243222604,0.4229070505335626,0.13231245958673926
0.3303303303303303,0.40481485002986023,0.4050148771705337,0.13076702930171172
0.34534534534534533,0.38628457240591957,0.3863522046384029,0.12938359076771902
0.36036036036036034,0.3670173164390525,0.36696639321041186,0.12816412219510445
0.37537537537537535,0.34706613236126843,0.3469130602499278,0.1271061485909179
0.39039039039039036,0.3264922256327476,0.32625599118628024,0.12620259810329928
0.40540540540540543,0.3053649077575357,0.3050669489022978,0.12544193633170417
0.42042042042042044,0.283761447471404,0.2834253684803869,0.1248085986305405
0.43543543543543545,0.2617667973848612,0.2614179221007174,0.12428371036974357
0.45045045045045046,0.2394731680594994,0.2391379374682003,0.12384605409262299
0.46546546546546547,0.21697942051766897,0.21668465297421682,0.12347321516825664
0.4804804804804805,0.1943902500430331,0.19416229438662946,0.12314281765920503
0.4954954954954955,0.171815139369889,0.17167896166025814,0.12283375196094448
0.5105105105105106,0.1493670682654083,0.1493453207887753,0.1225272958787551
0.5255255255255256,0.12716097900681972,0.12727310458227398,0.122208040399633
0.5405405405405406,0.10531201284408995,0.10557343766521467,0.12186454890569505
0.5555555555555556,0.08393355026230036,0.084355014310415,0.1214897020870675
0.5705705705705706,0.06313510633586866,0.06372217204954772,0.12108070844689595
0.5855855855855856,0.0430201499894166,0.043772918084567146,0.12063879010790907
0.6006006006006006,0.023683930672437438,0.02459697788110967,0.12016858344739452
0.6156156156156156,0.005211405994773531,0.006273944384512205,0.11967732128263464
0.6306306306306306,-0.012324632266691836,-0.011128389383573937,0.1191738848290878
0.6456456456456456,-0.028865139682906795,-0.027555433109076957,0.11866782625550289
0.6606606606606606,-0.044366024844765435,-0.04296686400345848,0.118168463686768
0.6756756756756757,-0.05879891347447538,-0.05733729441300804,0.11768413864819902
0.6906906906906907,-0.07215142848479149,-0.07065650238886932,0.11722170199594391
0.7057057057057057,-0.08442697033304399,-0.08292920854084712,0.11678626150973595
0.7207207207207207,-0.09564401009370119,-0.09417440735174581,0.11638118769018431
0.7357357357357357,-0.10583493451097611,-0.1044242854366898,0.11600833997967337
0.7507507507507507,-0.11504450561861627,-0.11372278084418821,0.11566844920095991
0.7657657657657657,-0.12332801552439525,-0.12212385463568186,0.11536157728724665
0.7807807807807807,-0.1307492285005751,-0.1296895574454142,0.11508757364698545
0.7957957957957957,-0.13737820717487864,-0.13648797898308376,0.11484645753314043
0.8108108108108109,-0.14328911765293253,-0.14259116763111576,0.11463867446295647
0.8258258258258259,-0.1485581006756953,-0.1480731011009893,0.1144651980490126
0.8408408408408409,-0.15326128368226855,-0.1530077786433561,0.114327472583891
0.8558558558558559,-0.15747299337750226,-0.15746749186568704,0.11422721310949552
0.8708708708708709,-0.16126421158810003,-0.16152131615319357,0.11416609627055305
0.8858858858858859,-0.16470130019895468,-0.16523384927183307,0.11414538583175012
0.9009009009009009,-0.16784500493441498,-0.16866420902240836,0.11416554107350488
0.9159159159159159,-0.17074973354741405,-0.17186528863563202,0.11422585482470131
0.9309309309309309,-0.17346309217233213,-0.1748832575166407,0.11432416160537634
0.9459459459459459,-0.17602565448619034,-0.17775728628875986,0.11445664654311485
0.960960960960961,-0.17847093198277067,-0.18051946896283733,0.11461777388137313
0.975975975975976,-0.1808255099971759,-0.18319491140904245,0.11480034152424015
0.990990990990991,-0.18310931290305732,-0.18580195393726182,0.11499565652139213
1.006006006006006,-0.1853359628422184,-0.18835249640885035,0.11519381675121237
1.021021021021021,-0.18751319909416936,-0.19085239655350444,0.1153840769664671
1.0360360360360361,-0.18964332938982895,-0.19330191566555333,0.11555527304492909
1.0510510510510511,-0.19172368975185733,-0.19569619021231444,0.11569627656496964
1.0660660660660661,-0.1937470954376811,-0.19802571272520667,0.11579645225093335
1.0810810810810811,-0.1957022719050608,-0.2002768103124266,0.11584609281486963
1.0960960960960962,-0.1975742610490501,-0.20243211391993507,0.11583680867111336
1.1111111111111112,-0.19934480390796722,-0.20447101580988156,0.11576185343750675
1.1261261261261262,-0.20099270624244592,-0.2063701164050642,0.11561636974966623
1.1411411411411412,-0.2024941975067926,-0.20810366449459652,0.11539754357391172
1.1561561561561562,-0.20382329643863634,-0.209643996687445,0.11510465894419822
1.1711711711711712,-0.20495219753188004,-0.21096198286185242,0.11473904902120578
1.1861861861861862,-0.2058516918615787,-0.2120274841646686,0.11430394379085053
1.2012012012012012,-0.20649163305704285,-0.21280982889348019,0.1138042197889177
1.2162162162162162,-0.20684145479103427,-0.21327830943331583,0.11324606307033365
1.2312312312312312,-0.2068707402699345,-0.2134027004688391,0.1126365631613482
1.2462462462462462,-0.20654983735849766,-0.2131537951672301,0.1119832625872523
1.2612612612612613,-0.20585050580069456,-0.21250395220123422,0.11129369306468452
1.2762762762762763,-0.20474657626210097,-0.21142764267903968,0.11057493456871026
1.2912912912912913,-0.20321459540630032,-0.20990198261923013,0.10983323601469004
1.3063063063063063,-0.20123442764830615,-0.20790723390864957,0.10907373506492118
1.3213213213213213,-0.19878978315431828,-0.20542725503368361,0.10830030878320272
1.3363363363363363,-0.19586864337597573,-0.2024498825453444,0.10751557640275079
1.3513513513513513,-0.19246355990311412,-0.198967225377664,0.10672106109722228
1.3663663663663663,-0.18857180935142628,-0.19497585684025817,0.10591750093991945
1.3813813813813813,-0.1841953957414604,-0.1904768932650026,0.10510528236267411
1.3963963963963963,-0.17934090153639315,-0.18547595367452507,0.10428495468542166
1.4114114114114114,-0.17401919825448448,-0.1799830010923924,0.10345777366091885
1.4264264264264264,-0.16824503645005343,-0.17401207275885594,0.10262621676941953
1.4414414414414414,-0.162036542092409,-0.16758091301461076,0.10179441367146105
1.4564564564564564,-0.15541465141322106,-0.16071052842231714,0.10096844146602786
1.4714714714714714,-0.1484025188502426,-0.1534246893168919,0.10015644531564401
1.4864864864864864,-0.14102493276512548,-0.14574940502171518,0.09936855939569515
1.5015015015015014,-0.13330777136286154,-0.13771240119633765,0.09861661974046171
1.5165165165165164,-0.12527752707075263,-0.12934262711687325,0.09791367819424897
1.5315315315315314,-0.11696092202944192,-0.12066981822490483,0.09727334420387934
1.5465465465465464,-0.10838463082619755,-0.11172413525265669,0.09670899745916052
1.5615615615615615,-0.09957511965742943,-0.10253589599007276,0.0962329281140767
1.5765765765765765,-0.09055860417609074,-0.09313540971691114,0.09585547103645868
1.5915915915915915,-0.081361121706197,-0.08355291791114106,0.09558420471225641
1.6066066066066067,-0.0720087075436757,-0.07381863846822084,0.09542328281013389
1.6216216216216217,-0.06252765987448666,-0.06396290466781464,0.09537295645238253
1.6366366366366367,-0.05294487351755607,-0.0540163847660724,0.09542932854337932
1.6516516516516517,-0.043288219275765816,-0.04401036354409935,0.0955843599951241
1.6666666666666667,-0.03358694315095792,-0.03397706349550136,0.09582612435101187
1.6816816816816818,-0.023872058029390113,-0.023949980612723475,0.09613928556683249
1.6966966966966968,-0.014176699652858836,-0.013964207920229425,0.09650575658730946
1.7117117117117118,-0.004536418752405969,-0.004056718980194203,0.09690548577342711
1.7267267267267268,0.005010617844534655,0.005733416441431755,0.09731731466271053
1.7417417417417418,0.014423542466852625,0.015364911481253121,0.09771985313200893
1.7567567567567568,0.023658840688531812,0.02479426111383988,0.09809232507411905
1.7717717717717718,0.032670562771313416,0.03397588297728744,0.09841534721738235
1.7867867867867868,0.04141070581788303,0.04286241788683971,0.09867161395048404
1.8018018018018018,0.049829773554671275,0.05140520216342196,0.09884647069521314
1.8168168168168168,0.057877512943497245,0.05955491673790287,0.09892836677253009
1.8318318318318318,0.06550381792600105,0.06726240935139807,0.09890918553762047
1.8468468468468469,0.0726597807982958,0.07447967624055392,0.09878445477359088
1.8618618618618619,0.07929886145080935,0.08116097886791415,0.09855344396729378
1.8768768768768769,0.08537813464757311,0.08726406015951488,0.0982191571555112
1.8918918918918919,0.09085956649808336,0.09275141419878313,0.09778823049317774
1.906906906906907,0.09571126424759015,0.09759155442306992,0.09727074254843998
1.921921921921922,0.09990863944315312,0.10176021917091503,0.09667994271189435
1.936936936936937,0.10343542425971232,0.10524145095227197,0.09603189944970855
1.951951951951952,0.10628448484903191,0.10802848783334426,0.09534506625556767
1.966966966966967,0.10845838414337207,0.11012441220724892,0.09463976028387158
1.981981981981982,0.10996965923553455,0.11154251379642688,0.09393754824955637
1.996996996996997,0.11084079437308511,0.11230633925935597,0.09326053767783171
2.012012012012012,0.11110388839928123,0.11244941897832564,0.0926305799000422
2.027027027027027,0.11080003350253517,0.11201468082453526,0.09206840424452209
2.042042042042042,0.10997843867746196,0.11105357910033518,0.09159271919997292
2.057057057057057,0.1086953447931613,0.10962498270138675,0.09121933298757592
2.0720720720720722,0.10701278742598497,0.1077938784082358,0.09096035892439701
2.0870870870870872,0.10499726799299891,0.10562995220476032,0.09082357598105092
2.1021021021021022,0.10271839315884806,0.10320611333421545,0.09081200894359177
2.1171171171171173,0.10024753748014636,0.10059702274490752,0.09092377486748103
2.1321321321321323,0.09765657573623815,0.09787768045050657,0.09115221535740897
2.1471471471471473,0.0950167205846208,0.09512211627876171,0.09148630256143508
2.1621621621621623,0.09239748937389185,0.09240221680461767,0.09191127685278573
2.1771771771771773,0.089865812368869,0.08978670923186295,0.09240945163976061
2.1921921921921923,0.08748528430783961,0.08734031170403596,0.09296110909756919
2.2072072072072073,0.08531555285500245,0.0851230498280189,0.09354541050819991
2.2222222222222223,0.08341183155752736,0.08318973161177014,0.09414125444565657
2.2372372372372373,0.08182452149693352,0.08158956777450888,0.09472803186645615
2.2522522522522523,0.0805989248152611,0.08036592143772896,0.09528624556205809
2.2672672672672673,0.07977503437438511,0.07955617029107008,0.09579797931549344
2.2822822822822824,0.07938738650550907,0.07919166504483383,0.09624721744933165
2.2972972972972974,0.07946496757001141,0.07929776984654786,0.096620027290653
2.3123123123123124,0.0800311692865954,0.07989397284633375,0.0969046252530364
2.3273273273273274,0.08110379189187851,0.08099405776606397,0.09709135205954973
2.3423423423423424,0.08269509764832353,0.08260632974751442,0.09717258460152059
2.3573573573573574,0.084811919541556,0.08473389060609217,0.09714261154275057
2.3723723723723724,0.0874558308973025,0.08737495969248785,0.09699749745864604
2.3873873873873874,0.09062338094359905,0.09052323677802829,0.0967349563908922
2.4024024024024024,0.09430639908648872,0.09416830276222646,0.0963542505164289
2.4174174174174174,0.09849236709518398,0.0982960526915566,0.0958561235110452
2.4324324324324325,0.1031648539216214,0.1028891538018413,0.09524277152688218
2.4474474474474475,0.10830400305636977,0.10792751933586317,0.09451784796150163
2.4624624624624625,0.11388705775562127,0.11338878705003157,0.09368649188803732
2.4774774774774775,0.11988890574734765,0.11924878990351456,0.09275536467197465
2.4924924924924925,0.12628262261872747,0.1254820056665914,0.09173267542356925
2.5075075075075075,0.13303999231062574,0.13206197226097502,0.09062817395936187
2.5225225225225225,0.14013198409944294,0.13896165662528676,0.08945309020166078
2.5375375375375375,0.14752916802279092,0.14615376675199646,0.0882200016329526
2.5525525525525525,0.15520205461531048,0.15361099914034554,0.08694261559501393
2.5675675675675675,0.16312134965394395,0.1613062170503552,0.08563546075390642
2.5825825825825826,0.17125811990324652,0.16921255837786955,0.08431349159209489
2.5975975975975976,0.17958387114743932,0.177303475440197,0.08299162069994902
2.6126126126126126,0.1880705447070107,0.1855527122265562,0.08168420492969791
2.6276276276276276,0.19669044286872397,0.19393422753161005,0.0804045217726912
2.6426426426426426,0.20541609701814706,0.20242207471579912,0.0791642799375299
2.6576576576576576,0.21422009465791392,0.21099025054456397,0.07797321125303804
2.6726726726726726,0.22307488290243155,0.21961252662357472,0.07683878818115278
2.6876876876876876,0.23195256649077606,0.2282622773810449,0.07576610163662206
2.7027027027027026,0.24082471791337234,0.23691231838566107,0.07475791789368985
2.7177177177177176,0.24966221597918406,0.24553476807327923,0.07381491292244417
2.7327327327327327,0.25843512714337274,0.25410094473048117,0.07293606055495042
2.7477477477477477,0.2671126412692251,0.2625813088892798,0.07211913107971306
2.7627627627627627,0.27566307033253395,0.2709454591672069,0.0713612426539564
2.7777777777777777,0.2840539150412713,0.2791621870939603,0.0706594017610448
2.7927927927927927,0.29225200062161083,0.2871995936752553,0.07001097176451138
2.8078078078078077,0.3002236793261945,0.2950252674635783,0.06941401974788816
2.8228228228228227,0.3079350937820858,0.30260652087788126,0.06886750928188924
2.8378378378378377,0.31535249234072554,0.3099106786165587,0.06837132770969548
2.8528528528528527,0.3224425853182129,0.31690540943775525,0.06792615789427098
2.8678678678678677,0.3291729295657227,0.3235590905354531,0.06753322321885247
2.8828828828828827,0.3355123282583233,0.32984119239075566,0.0671939485853786
2.8978978978978978,0.3414312331245185,0.3357226714455227,0.06690958759764133
2.9129129129129128,0.3469021374659645,0.3411763582781435,0.06668086638125913
2.9279279279279278,0.35189995007638547,0.3461773301234375,0.06650768797702519
2.942942942942943,0.35640234235335444,0.35070325845230677,0.06638892938210536
2.957957957957958,0.36039006327806195,0.35473472472382184,0.06632234836582444
2.972972972972973,0.36384721929346475,0.3582555001065484,0.06630460182733984
2.987987987987988,0.3667615182437248,0.3612527876797426,0.06633136423665775
3.003003003003003,0.3691244782929512,0.36371742811740554,0.06639752549748056
3.018018018018018,0.37093160401313385,0.36564407190767395,0.06649744326846614
3.033033033033033,0.3721825325637329,0.3670313225927398,0.06662522516295298
3.048048048048048,0.37288115306685055,0.36788185621324576,0.06677502019843576
3.063063063063063,0.3730357019380848,0.3682025220498315,0.06694130474383943
3.078078078078078,0.37265883611822237,0.36800442887618556,0.06711915427931021
3.093093093093093,0.3717676849408729,0.36730301933109616,0.06730449707748717
3.108108108108108,0.3703838798587885,0.366118132790984,0.06749434848264022
3.123123123123123,0.3685335595431526,0.3644740544350463,0.06768702444803988
3.138138138138138,0.36624734608490644,0.36239954524085755,0.0678823306067247
3.153153153153153,0.36356028629665976,0.35992784466541267,0.06808171908002146
3.168168168168168,0.36051175058031837,0.3570966350221974,0.06828840048731684
3.183183183183183,0.3571452806393959,0.3539479543446516,0.06850739440846358
3.198198198198198,0.35350837662730106,0.3505280431171465,0.06874549909637362
3.2132132132132134,0.34965221427528986,0.34688710991860444,0.0690111616417951
3.2282282282282284,0.34563128325518916,0.34307900196940144,0.06931423384844232
3.2432432432432434,0.34150293958180566,0.3391607689203819,0.0696656070773658
3.2582582582582584,0.3373268672728159,0.33519211197861476,0.0700767308675175
3.2732732732732734,0.3331644477154029,0.33123471549598843,0.07055903401777944
3.2882882882882885,0.3290780391184424,0.32735146417974725,0.07112328100173235
3.3033033033033035,0.3251301728594521,0.32360555571573424,0.0717789084973247
3.3183183183183185,0.32138267820362665,0.32005952532776777,0.07253339381732363
3.3333333333333335,0.31789575146881865,0.3167742050889164,0.07339170714213254
3.3483483483483485,0.3147269899080583,0.31380764612875606,0.07435589203657697
3.3633633633633635,0.3119304140679675,0.3112140358017943,0.07542480484285091
3.3783783783783785,0.30955550489356914,0.30904264408584237,0.07659402581837108
3.3933933933933935,0.3076462831999812,0.30733683382224986,0.07785593684243296
3.4084084084084085,0.30624045922721227,0.30613316792683504,0.07919994553130906
3.4234234234234235,0.3053686788446779,0.3054606435864934,0.0806128259944952
3.4384384384384385,0.3050538906803287,0.3053400790317046,0.08207914297567574
3.4534534534534536,0.3053108551938128,0.3057836731315913,0.08358172796796154
3.4684684684684686,0.30614581271988595,0.30679475220404767,0.08510218127386625
3.4834834834834836,0.30755632302038904,0.30836771244092087,0.08662138076845659
3.4984984984984986,0.3095312841308015,0.3104881605139441,0.08811998446611909
3.5135135135135136,0.31205113346488117,0.3131332494496982,0.0895789186619027
3.5285285285285286,0.3150882293921411,0.3162722018385554,0.09097984589877578
3.5435435435435436,0.3186074069171863,0.31986700788211136,0.09230560737116912
3.5585585585585586,0.32256669670863136,0.3238732816337824,0.09354063306079348
3.5735735735735736,0.3269181925555787,0.3282412549679346,0.09467131053584311
3.5885885885885886,0.33160904836407623,0.33291688525208096,0.0956863005817979
3.6036036036036037,0.33658258204334435,0.337843049361457,0.09657678528015333
3.6186186186186187,0.34177946009616245,0.3429607935938132,0.09733663236240706
3.6336336336336337,0.34713893348390606,0.34821060631502765,0.09796245915163032
3.6486486486486487,0.3526000924962649,0.3535336779632177,0.0984535806495438
3.6636636636636637,0.3581031060784348,0.358873111586177,0.09881182978256914
3.6786786786786787,0.36359040955350813,0.36417504664053724,0.09904124383896959
3.6936936936936937,0.36900780414782414,0.36938965959688,0.0991476198564272
3.7087087087087087,0.37430543240764047,0.3744720071926235,0.09913795294350354
3.7237237237237237,0.3794385956889607,0.3793826821032426,0.0990197845179338
3.7387387387387387,0.38436838356160896,0.38408825641130545,0.0988005008923139
3.7537537537537538,0.38906209027047706,0.38856149546959334,0.09848663463059976
3.7687687687687688,0.3934934003192129,0.39278133337403587,0.09808322937563255
3.7837837837837838,0.39764233364557416,0.39673261094880924,0.09759333120611999
3.798798798798799,0.4014949504766207,0.40040558744679106,0.09701766443204188
3.813813813813814,0.4050428263898197,0.40379524753922447,0.09635453664948727
3.828828828828829,0.40828231884692334,0.4069004350070522,0.09559999791636836
3.843843843843844,0.4112136568960391,0.40972285323400215,0.09474825461073184
3.858858858858859,0.4138398951757047,0.41226597954767974,0.09379231343011847
3.873873873873874,0.41616578110992275,0.41453394514320835,0.09272480884566409
3.888888888888889,0.41819658960823836,0.41653043435851944,0.09153895126269136
3.903903903903904,0.4199369821469597,0.41825765621771505,0.09022952497049236
3.918918918918919,0.42138994645541955,0.41971543738237116,0.08879386488489692
3.933933933933934,0.4225558690548827,0.42090047913179407,0.08723274780323655
3.948948948948949,0.4234317857673163,0.4218058121336132,0.08555114505607415
3.963963963963964,0.4240108454864846,0.4224204721658154,0.08375879624127526
3.978978978978979,0.42428201070655264,0.4227294083622284,0.08187057545054198
3.993993993993994,0.42423000545366707,0.4227136238094456,0.07990662988347513
4.009009009009009,0.4238355083851215,0.4223505372576904,0.07789227470786776
4.024024024024024,0.4230755769166214,0.42161454506679313,0.0758576273422277
4.039039039039039,0.42192427818663814,0.42047775487463784,0.07383696034262487
4.054054054054054,0.4203534951112377,0.4189108572156599,0.07186774792248397
4.069069069069069,0.41833387106485365,0.4168840985561844,0.06998938205341933
4.084084084084084,0.4158358548572202,0.4143683188408717,0.06824154714490191
4.099099099099099,0.41283080837215624,0.41133601834593486,0.06666227485890065
4.114114114114114,0.409292141951657,0.40776242194417284,0.06528575693055974
4.129129129129129,0.405196446651206,0.4036265132479997,0.06414006984855418
4.1441441441441444,0.40052459710453014,0.3989120159263622,0.06324504378907618
4.1591591591591595,0.39526280320332685,0.3936083042374758,0.06261055959418559
4.1741741741741745,0.38940359252902673,0.38771122900806454,0.06223554940728978
4.1891891891891895,0.3829467080612399,0.38122384856309083,0.062107891640326145
4.2042042042042045,0.3758999069398308,0.3741570562481296,0.06220524312172056
4.2192192192192195,0.3682796460047411,0.366530097119928,0.06249668535201403
4.2342342342342345,0.3601116387174519,0.35837096618928904,0.06294493306215675
4.2492492492492495,0.35143126628917726,0.34971667950243784,0.06350879920801983
4.2642642642642645,0.34228382393749557,0.3406134076785155,0.0641456343936692
4.2792792792792795,0.3327245817659033,0.3311164597060272,0.0648135344619204
4.2942942942942945,0.3228186394152106,0.3212901033160718,0.06547320113691105
4.3093093093093096,0.3126405549153818,0.31120720758084147,0.06608941811651405
4.324324324324325,0.302273731489229,0.3009486939815973,0.06663215517082977
4.33933933933934,0.2918095516578373,0.29060278441703263,0.06707733543092426
4.354354354354355,0.2813462558721099,0.28026403871765165,0.0674073034808315
4.36936936936937,0.2709875727848634,0.2700321802632904,0.06761102333417011
4.384384384384385,0.26084111965883067,0.26001071614134363,0.06768402378844927
4.3993993993994,0.2510166035161213,0.25030536759464567,0.0676280994955852
4.414414414414415,0.24162386553505313,0.24102233674883974,0.06745077258120127
4.42942942942943,0.2327708218627901,0.23226644606301308,0.06716452324603668
4.444444444444445,0.22456136243023275,0.22413919677488423,0.06678580861838655
4.45945945945946,0.21709327466077352,0.2167368009224677,0.06633390616938155
4.474474474474475,0.21045626053678337,0.2101482474648355,0.0658296390346871
4.48948948948949,0.20473011303815206,0.20445346587399696,0.065294062125566
4.504504504504505,0.19998311158308105,0.1997216498302051,0.06474720535747872
4.51951951951952,0.19627068624238525,0.1960097991238251,0.06420697855885277
4.534534534534535,0.19363438794576213,0.19336152969239168,0.06368833718798873
4.54954954954955,0.1921011876624516,0.19180619039741523,0.06320278662096256
4.564564564564565,0.19168311274148084,0.19135831148341861,0.06275826675359224
4.57957957957958,0.1923772143454996,0.1920173947096868,0.0623594132021483
4.594594594594595,0.19416584718377536,0.19376804007491727,0.06200814462511076
4.60960960960961,0.1970172322991823,0.19658039002849043,0.061704486404888445
4.624624624624625,0.20088626596970832,0.20041086010046866,0.06144751592924271
4.63963963963964,0.20571553303215265,0.20520311575358952,0.061236307001103114
4.654654654654655,0.211436481035304,0.21088924940529707,0.06107075941189395
4.66966966966967,0.21797071226577008,0.21739110907312484,0.060952220495091865
4.684684684684685,0.22523135338306674,0.2246217307167227,0.06088383362962404
4.6996996996997,0.23312446658261882,0.23248682956934918,0.060870579987913655
4.714714714714715,0.24155047128532944,0.24088631087686238,0.06091901161061579
4.72972972972973,0.2504055507775099,0.24971576672318627,0.06103670470089805
4.744744744744745,0.2595830235252678,0.2588679322706982,0.0612314908041006
4.75975975975976,0.26897466370388856,0.268234081139168,0.06151054857576369
4.774774774774775,0.27847195958073934,0.2777053453063779,0.061879457260457404
4.78978978978979,0.28796730165761314,0.28717394954633385,0.062341321068703076
4.804804804804805,0.29735509491319106,0.2965343539272752,0.06289606800012787
4.81981981981982,0.3065327911748855,0.305684300340451,0.06354000605208977
4.834834834834835,0.3154018387404818,0.3145257606188987,0.06426568629643882
4.84984984984985,0.32386854704571827,0.322965784806674,0.06506208160379767
4.864864864864865,0.3318448646215055,0.3309172488477,0.06591504953478847
4.87987987987988,0.3392490689717103,0.33829950164462685,0.06680801555073136
4.894894894894895,0.34600636745789287,0.3450389122858852,0.06772279323331268
4.90990990990991,0.3520494088784648,0.35106931935159885,0.06864045310173267
4.924924924924925,0.3573187061979688,0.3563323855801159,0.06954215905441818
4.93993993993994,0.3617629717867395,0.36077786270579276,0.07040990759115419
4.954954954954955,0.3653393674991771,0.36436377279363447,0.0712271254148005
4.96996996996997,0.3680136728509603,0.36705651368852743,0.07197910200920074
4.984984984984985,0.36976037534370443,0.3688308970570327,0.07265325273346335
5,0.37056268753171256,0.36967012775485436,0.07323922342290327
5.015015015015015,0.37041249565642004,0.36956573279463306,0.0737288588991127
5.03003003003003,0.3693102445534603,0.3685174469919181,0.07411606517882977
5.045045045045045,0.36726476307062433,0.3665330604993192,0.07439659883696598
5.06006006006006,0.36429303346976694,0.3636282310547999,0.07456781736597701
5.075075075075075,0.36041990730630125,0.35982626109820726,0.07462842200861448
5.09009009009009,0.35567776919749483,0.3551578372289179,0.07457822003125424
5.105105105105105,0.350106148832429,0.34966072708590257,0.0744179274380044
5.12012012012012,0.3437512806719863,0.3433794269167114,0.07414902644036551
5.135135135135135,0.3366656101580235,0.3363647521069511,0.07377368531563087
5.15015015015015,0.3289072449997773,0.3286733629377711,0.07329474222016218
5.165165165165165,0.3205393503094232,0.3203672189044023,0.07271574947629919
5.18018018018018,0.3116294870638159,0.3115129570399303,0.07204107096201048
5.195195195195195,0.3022488945886132,0.30218119272071553,0.07127602236724023
5.21021021021021,0.2924717194737363,0.29244574517123356,0.07042704189577773
5.225225225225225,0.282374195481729,0.2823827940610266,0.0695018770432835
5.24024024024024,0.27203378151894164,0.2720699778852208,0.06850977096788723
5.255255255255255,0.26152826749095714,0.2615854489313273,0.06746162946067064
5.27027027027027,0.25093486072059756,0.2510069032750461,0.0663701466681697
5.285285285285285,0.24032926841008048,0.24041060718329718,0.06524986490362351
5.3003003003003,0.22978479420254813,0.22987044336478937,0.06411714184350022
5.315315315315315,0.2193714690552625,0.2194570015950664,0.06298999819218293
5.33033033033033,0.20915523818655424,0.20923673831323725,0.061887821788957784
5.345345345345345,0.19919722661586223,0.19927122884813597,0.060830911457462486
5.36036036036036,0.18955310561169827,0.18961653402092787,0.05983985672627057
5.375375375375375,0.18027258105613136,0.18032270004483655,0.05893476819081386
5.39039039039039,0.17139902222910444,0.17143340696378917,0.05813439665217412
5.405405405405405,0.16296924577191807,0.16298577640896,0.05745520417763339
5.42042042042042,0.15501346463848004,0.15501034428512772,0.056910471674495394
5.435435435435435,0.14755540580124324,0.14753119823086086,0.056509538919344675
5.45045045045045,0.14061259355425174,0.14056627347091044,0.056257268338216135
5.465465465465465,0.13419678775160454,0.1341277941941436,0.056153800576756494
5.48048048048048,0.12831455862908608,0.12822284111008542,0.05619463082653902
5.495495495495495,0.12296797244782603,0.12285401969277954,0.05637098830480938
5.51051051051051,0.11815535558921579,0.11802019819969103,0.05667045858495676
5.525525525525525,0.1138720994502775,0.11371728027461972,0.05707775991637434
5.54054054054054,0.11011146503634091,0.10993897422062747,0.05757557573775049
5.555555555555555,0.10686534493816317,0.10667752022339032,0.05814535556165102
5.57057057057057,0.10412494169547591,0.10392433817751984,0.05876801965424054
5.585585585585585,0.10188132549401333,0.10167056243202205,0.05942453175234254
5.6006006006006,0.10012584061899148,0.0999074356603119,0.060096331493046676
5.615615615615615,0.09885033878147505,0.09862654191619932,0.06076563971254284
5.63063063063063,0.09804722783257928,0.09781986831772425,0.061415663430510185
5.645645645645645,0.09770933581030482,0.09747969511379082,0.062030733405753734
5.66066066066066,0.0978296019479677,0.0975983244462873,0.06259640706332407
5.675675675675675,0.09840061740107332,0.09816766820390162,0.0630995652058292
5.6906906906906904,0.09941404825022315,0.099178724290919,0.06352852399088305
5.7057057057057055,0.10085998114615885,0.10062097781843929,0.06387317559957763
5.7207207207207205,0.10272623727195757,0.10248176872005284,0.06412516284586241
5.7357357357357355,0.10499770278874777,0.10474566981642562,0.06427808531542276
5.7507507507507505,0.10765572348794257,0.10739391929026296,0.06432772780550566
5.7657657657657655,0.11067760807072843,0.11040394893097154,0.0642722959835949
5.7807807807807805,0.11403627856222587,0.11374904455332494,0.06411263929508917
5.7957957957957955,0.11770009823374217,0.1173981679901812,0.06385243720577656
5.8108108108108105,0.12163289755271992,0.12131596140469189,0.06349832190622813
5.8258258258258255,0.125794207686393,0.12546294483722145,0.06305990882121963
5.8408408408408405,0.13013969958116064,0.12979590742932626,0.06254970606184429
5.8558558558558556,0.13462181527607708,0.1342684822242425,0.06198287598971047
5.870870870870871,0.13919056752844336,0.13883188442000177,0.061376827228184126
5.885885885885886,0.14379447463658337,0.14343578402532822,0.06075062477129022
5.900900900900901,0.14838159007084936,0.1480292765702923,0.06012422016603665
5.915915915915916,0.15290058159271575,0.15256191029707003,0.05951752331141092
5.930930930930931,0.15730181223631767,0.15698472541941896,0.05894936121387578
5.945945945945946,0.16153837596305887,0.16125126075383295,0.058436394230203935
5.960960960960961,0.16556704391205027,0.1653184852757388,0.05799208209293504
5.975975975975976,0.1693490827109269,0.16914761674784318,0.05762580421720156
5.990990990990991,0.1728509138745656,0.17270479615117798,0.05734223569360693
6.006006006006006,0.17604459236791162,0.17596159474258444,0.0571410590221043
6.021021021021021,0.17890809232824736,0.1788953396054425,0.05701705387061235
6.036036036036036,0.18142539809071176,0.18148925296638285,0.05696055995976473
6.051051051051051,0.18358640842510193,0.18373240975641925,0.05695826188291664
6.066066066066066,0.18538667073224135,0.185619526404195,0.05699420934050302
6.081081081081081,0.1868269694326524,0.18715060126287963,0.05705096827636049
6.096096096096096,0.18791279860458407,0.1883304331039482,0.05711079869863525
6.111111111111111,0.18865375292015604,0.18916804858683184,0.05715676967903541
6.126126126126126,0.1890628730387807,0.18967607246076354,0.05717374471439544
6.141141141141141,0.18915598190356842,0.18987007548400647,0.05714919485092307
6.156156156156156,0.18895104699018847,0.1897679347262675,0.05707381800878945
6.171171171171171,0.18846760067927573,0.18938923916271722,0.056941958454645204
6.186186186186186,0.1877262468006218,0.18875477040751132,0.05675183006635416
6.201201201201201,0.18674827628581023,0.1878860842212095,0.0565055519839514
6.216216216216216,0.18555540902399073,0.18680521322325053,0.05620900714471886
6.231231231231231,0.18416967269302248,0.18553450522500678,0.05587153487458603
6.246246246246246,0.18261342276830064,0.1840966049664029,0.055505469784887636
6.261261261261261,0.18090950130522268,0.18251458000519696,0.055125541995069895
6.276276276276276,0.1790815256342057,0.18081218430743853,0.05474815900510467
6.291291291291291,0.17715429195895097,0.17901424596847512,0.054390597605275794
6.306306306306306,0.17515427314425977,0.17714715870825057,0.05407014445360676
6.321321321321321,0.17311018483317167,0.17523945057646256,0.053803234798876776
6.336336336336336,0.17105358954423477,0.17332239789658713,0.0536046477161417
6.351351351351351,0.1690195046618679,0.17143064806850838,0.0534868199675189
6.366366366366366,0.16704697734240428,0.16960281160018884,0.05345933622583621
6.381381381381381,0.1651795874233005,0.16788198178105296,0.05352863926878937
6.396396396396396,0.16346583856829047,0.16631613984942936,0.05369798059399915
6.411411411411412,0.16195939825087194,0.16495840443203202,0.05396760315065569
6.426426426426427,0.1607191489312321,0.16386708652312434,0.05433511897917767
6.441441441441442,0.1598090160794389,0.16310551539436924,0.05479602140413265
6.456456456456457,0.15929754368789717,0.16274160663944606,0.055344258618571895
6.471471471471472,0.15925719470695504,0.16284715108810738,0.05597279504653754
6.486486486486487,0.15976336247021866,0.16349681254937107,0.056674097984267875
6.501501501501502,0.16089308959469478,0.16476683316087196,0.05744050675278897
6.516516516516517,0.16272350286535503,0.16673345732137398,0.05826446590206182
6.531531531531532,0.16532998591880188,0.16947109842583902,0.059138628713613
6.546546546546547,0.16878412564486045,0.1730502864249247,0.06005585865906761
6.561561561561562,0.1731514824926267,0.17753544797310583,0.06100917167014839
6.576576576576577,0.1784892485278444,0.18298258387614907,0.06199166908570058
6.591591591591592,0.18484386927076416,0.18943691988730685,0.06299650908850328
6.606606606606607,0.19224871513077674,0.19693061579747334,0.0640169537229827
6.621621621621622,0.20072189475082966,0.20548062342179438,0.0650465109245634
6.636636636636637,0.2102643049873237,0.21508678581323068,0.066079169303234
6.651651651651652,0.220858009972888,0.22573026731263465,0.06710970137499521
6.666666666666667,0.23246503440112046,0.2373723965870435,0.0681339923264728
6.681681681681682,0.2450266438321668,0.2499539926106056,0.06914933950221312
6.696696696696697,0.2584631678254016,0.2633952269291955,0.0701546648200538
6.711711711711712,0.27267440083348604,0.27759605519162717,0.07115058904548162
6.726726726726727,0.2875405921774987,0.2924372278411857,0.07213933258698545
6.741741741741742,0.3029240114934802,0.30778186535684726,0.07312443008995616
6.756756756756757,0.31867105140222357,0.32347755905056674,0.07411027230324849
6.771771771771772,0.33461480644547575,0.3393589358011071,0.07510151437280148
6.786786786786787,0.3505780480667267,0.35525060581697443,0.07610241056443978
6.801801801801802,0.3663765008282889,0.37097039792904896,0.07711614765835527
6.816816816816817,0.3818223159767871,0.38633277799302856,0.07814425050113441
6.831831831831832,0.39672763523623283,0.4011523432023444,0.0791861231409121
6.846846846846847,0.4109081401465997,0.41524728837208796,0.08023876964670927
6.861861861861862,0.4241864897229856,0.42844274888963735,0.08129671413389537
6.876876876876877,0.4363955606451603,0.4405739378944752,0.08235211467301316
6.891891891891892,0.4473814183047068,0.451489010872362,0.08339504530557858
6.906906906906907,0.45700596244473574,0.46105160760713704,0.08441390747201771
6.921921921921922,0.46514920649239866,0.46914303776020566,0.08539592775738493
6.936936936936937,0.4717111638741573,0.4756640909108993,0.08632770185563277
6.951951951951952,0.4766133267884346,0.4805364637290476,0.08719575244769011
6.966966966966967,0.4797997326260067,0.4837038055540908,0.08798707813558919
6.981981981981982,0.48123762038960943,0.48513238898008054,0.08868967884647293
6.996996996996997,0.4809176843329113,0.48481141447868203,0.08929304830301096
7.012012012012012,0.4788539351549672,0.48275295836122323,0.08978862549473701
7.027027027027027,0.47508318117108095,0.4789915724429845,0.0901701949193293
7.042042042042042,0.46966414372314663,0.4735835426832713,0.0904342208748732
7.057057057057057,0.4626762234325154,0.46660581385413147,0.09058009595278424
7.072072072072072,0.45421793731922,0.45815458880021864,0.09061027993599592
7.087087087087087,0.4444050516521664,0.44834361468458583,0.09053030421728549
7.102102102102102,0.4333684416946575,0.4373021750078973,0.09034861986424461
7.117117117117117,0.4212517169896064,0.42517281497157616,0.09007627518218266
7.132132132132132,0.4082086589181905,0.41210883833968415,0.08972642088968248
7.147147147147147,0.394400525168912,0.39827162537279576,0.08931365679115388
7.162162162162162,0.3799932825525939,0.3838278324113806,0.0888532512604886
7.177177177177177,0.3651548343757891,0.3689465428959429,0.08836028147463014
7.192192192192192,0.3500523105543146,0.3537964457023125,0.08784875543317569
7.207207207207207,0.3348494872695416,0.3385431185729049,0.08733078389126461
7.222222222222222,0.31970439803156675,0.3233464914996826,0.08681586973674328
7.237237237237237,0.3047671896711264,0.30835855707170645,0.08631037364052549
7.252252252252252,0.29017826554694087,0.29372138253413976,0.08581719906220243
7.267267267267267,0.2760667449321137,0.2795654626362733,0.0853357192944558
7.282282282282282,0.2625492531348243,0.2660084346775797,0.08486194738870315
7.297297297297297,0.24972904249702393,0.2531541590828542,0.08438892979393377
7.312312312312312,0.23769543104272686,0.24109215191089176,0.08390732894603224
7.327327327327327,0.2265235341137709,0.2298973412640456,0.08340615024971575
7.342342342342342,0.21627425551514431,0.21963010859408533,0.08287356494829064
7.357357357357357,0.20699449891236385,0.21033656893440392,0.08229778122642392
7.372372372372372,0.19871755762925347,0.20204904123622555,0.08166791984978942
7.387387387387387,0.1914636414858624,0.19478666097226,0.0809748558915173
7.402402402402402,0.18524050258291538,0.18855609143000931,0.0802119930700881
7.4174174174174174,0.18004412750722779,0.1833522968949713,0.07937594085329513
7.4324324324324325,0.17585947071077385,0.17915934937571057,0.07846706625017971
7.4474474474474475,0.172661212135656,0.1759512497871611,0.07748989213839548
7.4624624624624625,0.17041453080255534,0.1736927537632391,0.0764533125900687
7.4774774774774775,0.16907589431368902,0.17234020076249318,0.07537059401539838
7.4924924924924925,0.16859387130722464,0.17184235219680155,0.07425913065674786
7.5075075075075075,0.16890997913547512,0.1721412493892715,0.07313992625031565
7.5225225225225225,0.16995958179868167,0.17317310480780315,0.07203678322537452
7.5375375375375375,0.1716728529654866,0.17486923992650297,0.07097519937361375
7.5525525525525525,0.173975815487137,0.17715708012877096,0.0699810013254682
7.5675675675675675,0.17679146221016045,0.17996121141419053,0.06907878385041148
7.5825825825825826,0.18004095354071303,0.18320449572516653,0.06829026932922133
7.597597597597598,0.18364487596460397,0.18680923220170337,0.06763274313645234
7.612612612612613,0.1875245338301128,0.1906983416353344,0.06711774469133071
7.627627627627628,0.19160323569820095,0.19479654208035949,0.06675018732039975
7.642642642642643,0.1958075280996011,0.1990314763290374,0.06652803582566673
7.657657657657658,0.20006832509942046,0.2033347479918268,0.06644259334627872
7.672672672672673,0.2043218827181051,0.20764282314062532,0.06647935572051966
7.687687687687688,0.20851057339289472,0.21189775924884757,0.06661930607640607
7.702702702702703,0.21258342689702966,0.21604773223786425,0.06684046638428061
7.717717717717718,0.21649641930409289,0.2200473449171997,0.06711950712962605
7.732732732732733,0.22021250893132838,0.2238577145735745,0.06743323866876176
7.747747747747748,0.22370143565281664,0.22744635222295662,0.0677598557743259
7.762762762762763,0.22693931551984822,0.23078685938995552,0.06807986443723515
7.777777777777778,0.2299080746125946,0.23385847879358335,0.0683766735946627
7.792792792792793,0.23259477342973067,0.23664554205072355,0.06863687584995677
7.807807807807808,0.23499087555830792,0.23913686009027238,0.06885026761952497
7.822822822822823,0.23709151217181945,0.24132510059329654,0.06900967155957162
7.837837837837838,0.23889478790383575,0.24320619207472954,0.06911062567931464
7.852852852852853,0.2404011649566167,0.24477878711088863,0.06915099784460949
7.867867867867868,0.2416129521247295,0.2460438086957419,0.06913057465670264
7.882882882882883,0.24253391483570858,0.24700409471218293,0.06905066244425985
7.897897897897898,0.2431690122058226,0.2476641467944866,0.06891372701108257
7.912912912912913,0.2435242580818693,0.2480299819743096,0.0687230888109091
7.927927927927928,0.24360669543217695,0.24810907876532032,0.06848268181555633
7.942942942942943,0.24342446739308962,0.24791040388979108,0.06819687759088965
7.957957957957958,0.24298696376009168,0.2474445016998902,0.0678703708867891
7.972972972972973,0.2423050186511285,0.24672362544862725,0.06750811919422953
7.987987987987988,0.24139113336327753,0.24576188785753803,0.06711532603512765
8.003003003003004,0.24025969801270777,0.24457540786492843,0.06669745607494668
8.018018018018019,0.238927186346006,0.24318243100281153,0.06626026937185882
8.033033033033034,0.23741230011880965,0.24160340254590357,0.06580986211494884
8.048048048048049,0.2357360426378002,0.23986097540255913,0.06535270197987368
8.063063063063064,0.23392170540516866,0.23797993864074232,0.06489564765625341
8.078078078078079,0.2319947571748673,0.23598705746047527,0.06444594407266102
8.093093093093094,0.22998263091756616,0.2339108211438331,0.06401118724378906
8.108108108108109,0.22791441088077752,0.23178110173816463,0.06359925536367197
8.123123123123124,0.22582042870861038,0.22962873256722435,0.06321820563793656
8.138138138138139,0.2237317839707939,0.22748502166167503,0.06287613924672023
8.153153153153154,0.22167980994168246,0.22538122037739164,0.06258103959578479
8.168168168168169,0.2196955096053945,0.2233479713833506,0.06234059144832275
8.183183183183184,0.21780898928078873,0.22141476249598785,0.062161990398983964
8.198198198198199,0.21604891774667978,0.21960941329427638,0.06205175320565199
8.213213213213214,0.21444203726823693,0.21795762001294317,0.06201553952164095
8.228228228228229,0.21301274962602632,0.2164825809921126,0.0620579944668485
8.243243243243244,0.21178279543322076,0.2152047202223496,0.062182619310284626
8.258258258258259,0.21077103911095088,0.214141520639615,0.0623916745839811
8.273273273273274,0.20999336534907925,0.21330747223382648,0.06268611666788548
8.288288288288289,0.20946268617997052,0.21271413318831892,0.06306556583323072
8.303303303303304,0.20918905135434526,0.21237029558288595,0.06352830143741629
8.318318318318319,0.20917984886476193,0.21228224102213825,0.06407127880255332
8.333333333333334,0.20944007745122575,0.21245406616589343,0.06469016241874163
8.348348348348349,0.20997266889379937,0.21288805373526723,0.06537937136884961
8.363363363363364,0.21077883493329116,0.21358506128638047,0.06613213494054908
8.378378378378379,0.21185841181555856,0.21454489799388243,0.06694055882335365
8.393393393393394,0.21321017478183332,0.21576665898145214,0.06779570462020036
8.408408408408409,0.21483209540837303,0.21724898751343583,0.06868768724017091
8.423423423423424,0.21672151665410372,0.21899023778976012,0.06960579579763487
8.438438438438439,0.21887522395349843,0.22098851534947472,0.0705386437542511
8.453453453453454,0.22128939583777166,0.2232415783427577,0.07147435312963478
8.468468468468469,0.22395942446281664,0.2257465912351139,0.07240077567267561
8.483483483483484,0.2268796050153671,0.22849973273401836,0.07330575099282165
8.498498498498499,0.23004270299743682,0.23149567147756944,0.07417739794401607
8.513513513513514,0.23343941931854717,0.2347269355590877,0.07500443128850899
8.528528528528529,0.2370577841252785,0.23818321419406455,0.07577649123555179
8.543543543543544,0.24088252027567694,0.24185064039652962,0.07648446937962852
8.558558558558559,0.2448944250740603,0.2457111109282344,0.07712081147344466
8.573573573573574,0.2490698230925083,0.2497417026436598,0.07767977597574877
8.588588588588589,0.2533801426354892,0.25391424171218036,0.0781576278917482
8.603603603603604,0.257791663142125,0.25819507376672945,0.0785527502918824
8.618618618618619,0.26226547070070416,0.26254506936140065,0.07886566092785513
8.633633633633634,0.26675764472039687,0.26691988162500674,0.0790989280902138
8.64864864864865,0.2712196821529878,0.2712704537455532,0.07925698752496281
8.663663663663664,0.2755991483931962,0.27554375529905456,0.0793458699666498
8.67867867867868,0.27984052812481963,0.27968371071081827,0.07937285578571884
8.693693693693694,0.2838862366912274,0.2836322720369899,0.07934607866478226
8.70870870870871,0.28767774427741394,0.28733058268109485,0.0792741036104544
8.723723723723724,0.291156761796194,0.29072017859095795,0.07916550572706756
8.73873873873874,0.29426643861926355,0.29374417806640163,0.0790284750291373
8.753753753753754,0.2969525272984324,0.29634841912652116,0.07887046938253783
8.76876876876877,0.29916447788937056,0.2984825127725775,0.07869793286772864
8.783783783783784,0.3008564329884439,0.3001007898513215,0.0785160910315472
8.7987987987988,0.30198810280677446,0.3011631273094723,0.07832882830623539
8.813813813813814,0.3025255065255002,0.3016356456339681,0.07813864700330615
8.82882882882883,0.30244157120699666,0.3014912728943747,0.07794670232884043
8.843843843843844,0.30171658252025846,0.3007101721947352,0.07775290423584015
8.85885885885886,0.3003384827086714,0.2992800290010219,0.07755607481078407
8.873873873873874,0.2983030111211982,0.2971961934602976,0.0773541492068664
8.88888888888889,0.2956136819692566,0.29446167128926637,0.07714440857092485
8.903903903903904,0.2922815935579245,0.2910869558893538,0.07692373448472528
8.91891891891892,0.28832506382722217,0.2870896947392867,0.07668887561103607
8.933933933933934,0.283769089241774,0.2824941853359333,0.0764367180097802
8.94894894894895,0.27864462827645714,0.27733070026982853,0.07616455063616463
8.963963963963964,0.27298771706798514,0.2716346474253434,0.07587031675140202
8.97897897897898,0.2668384330240923,0.26544557948791364,0.07555284053266267
8.993993993993994,0.2602397317666956,0.2588060763454724,0.07521201647033683
9.00900900900901,0.253236192909614,0.25176053377821467,0.07484894776520104
9.024024024024024,0.24587271979985503,0.24435390107044655,0.07446601951976534
9.03903903903904,0.23819324634920552,0.2366304178222379,0.07406689361580467
9.054054054054054,0.23023950935433962,0.2286324053172799,0.07365641514438141
9.06906906906907,0.22204994633975064,0.22039916952625413,0.07324042517906462
9.084084084084084,0.2136587763705807,0.2119660706871037,0.07282548130921042
9.0990990990991,0.20509531430327438,0.20336380826151712,0.07241849513181442
9.114114114114114,0.1963835578658967,0.19461796017223087,0.0720263040674843
9.12912912912913,0.18754207252468796,0.18574880220801526,0.07165520252816118
9.144144144144144,0.1785841823971124,0.17677141828557713,0.07131046372196487
9.15915915915916,0.16951845784046238,0.16769609603236146,0.07099588742764389
9.174174174174174,0.16034947317440132,0.15852898613481078,0.07071341028311436
9.18918918918919,0.15107879259079363,0.14927298926437488,0.07046281314427129
9.204204204204204,0.14170612974405655,0.1399288221582914,0.07024155484319992
9.21921921921922,0.13223061756025917,0.13049620534220716,0.0700447535433072
9.234234234234235,0.12265211985195311,0.12097510947379095,0.06986532656086263
9.24924924924925,0.1129725154228837,0.1113669954776371,0.06969428801171453
9.264264264264265,0.1031968882305778,0.1016759853597462,0.06952119212339473
9.27927927927928,0.09333456335125316,0.09190990543181754,0.06933469966514386
9.294294294294295,0.0833999373181598,0.08208115108243173,0.069123236595343
9.30930930930931,0.07341306217173448,0.07220733156552633,0.06887570823328125
9.324324324324325,0.0633999545584047,0.06231166388717452,0.06858222913052427
9.33933933933934,0.053392613784634134,0.0524230961526715,0.06823482807420496
9.354354354354355,0.043428745293436856,0.04257615215706537,0.0678280887827119
9.36936936936937,0.03355119809467527,0.03281050012645446,0.06735968925073042
9.384384384384385,0.02380713585472987,0.023170259002577756,0.06683080583457822
9.3993993993994,0.014246971330470955,0.01370306525406204,0.0662463517151307
9.414414414414415,0.004923102390884813,0.004458931711736313,0.06561502332073332
9.42942942942943,-0.004111505148842584,-0.004511062762477398,0.0649491330108128
9.444444444444445,-0.012804837345466596,-0.013156207936098327,0.06426421260771073
9.45945945945946,-0.02110740046185095,-0.021427671669349547,0.06357838138121505
9.474474474474475,-0.028973781780128292,-0.029280031337423785,0.06291148514961836
9.48948948948949,-0.036364146606912645,-0.03667277245006865,0.0622840312691795
9.504504504504505,-0.043245616507946644,-0.043571699215354885,0.06171596742436644
9.51951951951952,-0.04959347661945414,-0.04995020276711723,0.06122537843059353
9.534534534534535,-0.055392164096447156,-0.05579033526834009,0.06082720041695323
9.54954954954955,-0.060635995315969936,-0.06108364219574205,0.06053206929575114
9.564564564564565,-0.06532959633487263,-0.06583171090761486,0.06034542324877603
9.57957957957958,-0.06948800932701477,-0.07004640121451274,0.060266962039694304
9.594594594594595,-0.07313645734191071,-0.0737497332168437,0.060290529165011354
9.60960960960961,-0.07630976078035023,-0.07697341919980102,0.06040443226673093
9.624624624624625,-0.07905141146150498,-0.07975803983195558,0.06059216377056716
9.63963963963964,-0.08141232392621256,-0.08215188007227127,0.06083343934617232
9.654654654654655,-0.08344929835175302,-0.08420945658294543,0.061105445144334955
9.66966966966967,-0.08522324455506594,-0.0859897853122743,0.061384178477168726
9.684684684684685,-0.08679723115495121,-0.08755445418764991,0.061645777439375514
9.6996996996997,-0.08823443690143722,-0.08896558021614927,0.06186775623094241
9.714714714714715,-0.08959609113212129,-0.09028374125022838,0.06203008751718222
9.72972972972973,-0.09093949592398821,-0.09156597878729739,0.06211609571277352
9.744744744744745,-0.09231622260048272,-0.09286396823753743,0.06211314284311462
9.75975975975976,-0.0937705690655172,-0.09422244640919808,0.06201310109237104
9.774774774774775,-0.09533835182390694,-0.09567797250910724,0.06181261412680564
9.78978978978979,-0.09704608811136183,-0.09725807951681059,0.06151315412022771
9.804804804804805,-0.09891060065054043,-0.09898084891137515,0.061120884379673446
9.81981981981982,-0.10093905215247026,-0.100854915559962,0.06064633955749017
9.834834834834835,-0.10312939114802784,-0.10287988358222552,0.060103937352125804
9.84984984984985,-0.10547116745581998,-0.1050471106132735,0.05951133791492466
9.864864864864865,-0.10794665665761817,-0.10734079914534257,0.0588886704491265
9.87987987987988,-0.11053221984869493,-0.10973932092251039,0.058257651272775275
9.894894894894895,-0.11319981836839146,-0.11221669427633048,0.057640624356423344
9.90990990990991,-0.11591860309029557,-0.11474413459588412,0.05705956405798277
9.924924924924925,-0.11865650333858348,-0.1172916039118116,0.056535089686093304
9.93993993993994,-0.12138175025887102,-0.11982929546069258,0.056085550778265283
9.954954954954955,-0.12406428190932502,-0.1223290014909352,0.055726247704423706
9.96996996996997,-0.1266769908452013,-0.12476532591156922,0.05546885109292545
9.984984984984985,-0.12919678814529356,-0.12711671633175556,0.05532107301398705
10,-0.13160546961299632,-0.1293663015979395,0.05528662223486149
10.015015015015015,-0.1338903796236403,-0.13150253050774585,0.0553654474078827
10.03003003003003,-0.13604487552621855,-0.13351961474331392,0.05555424059851495
10.045045045045045,-0.1380686007213788,-0.1354177843155696,0.05584714514112649
10.06006006006006,-0.13996757785445355,-0.1372033672645407,0.05623659166180976
10.075075075075075,-0.1417541354523394,-0.13888870746626564,0.05671417702869969
10.09009009009009,-0.14344668231234897,-0.14049193563433215,0.057271502821657626
10.105105105105105,-0.14506934449892617,-0.14203660940769816,0.057900900234351904
10.12012012012012,-0.14665148029964276,-0.1435512391141522,0.058595983829288704
10.135135135135135,-0.14822708917493155,-0.14506871657624498,0.059351994383587445
10.15015015015015,-0.14983413169010013,-0.14662566521459905,0.0601659094517108
10.165165165165165,-0.15151377857619797,-0.14826173059020228,0.06103631862025227
10.18018018018018,-0.15330960823600517,-0.15001883119074408,0.06196307872512898
10.195195195195195,-0.1552667729165244,-0.15194038942490498,0.0629467824101579
10.21021021021021,-0.1574311541026916,-0.15407056216257975,0.063988090500196
10.225225225225225,-0.15984852716724557,-0.15645348853079807,0.06508699301389752
10.24024024024024,-0.16256375373768503,-0.15913256994335404,0.06624207289173065
10.255255255255255,-0.16562001753578207,-0.16214979355734951,0.06744984835876004
10.27027027027027,-0.16905811568100296,-0.16554510572646552,0.06870426289747346
10.285285285285285,-0.17291581285479538,-0.16935583692338196,0.06999637632314652
10.3003003003003,-0.1772272606647252,-0.17361617451019037,0.07131428852522759
10.315315315315315,-0.1820224794948823,-0.1783566751836897,0.07264330257006316
10.33033033033033,-0.187326895602723,-0.18360380544848082,0.0739663100465484
10.345345345345345,-0.19316092273903054,-0.18937949655017292,0.0752643621965939
10.36036036036036,-0.19953957558313926,-0.19570070029622388,0.07651737756955221
10.375375375375375,-0.20647210214733663,-0.20257893431338983,0.0777049311242499
10.39039039039039,-0.21396162421307766,-0.21001980957068558,0.0788070699782122
10.405405405405405,-0.22200477884496395,-0.2180225392750637,0.07980510571165138
10.42042042042042,-0.23059135992638033,-0.22657943616681445,0.08068234047966208
10.435435435435435,-0.23970396611956182,-0.23567541425386931,0.08142469270759582
10.45045045045045,-0.24931767012908168,-0.2452875204009986,0.08202119692694058
10.465465465465465,-0.2593997329197782,-0.25538453005198464,0.08246436096401669
10.48048048048048,-0.2699093947348045,-0.2659266487238847,0.08275037217842675
10.495495495495495,-0.2807977813956201,-0.2768653657467587,0.08287915281282993
10.51051051051051,-0.29200796842279836,-0.28814350805864086,0.08285427266552468
10.525525525525525,-0.30347524603059445,-0.2996955389043581,0.08268273483491313
10.54054054054054,-0.3151276242353727,-0.31144813853147835,0.08237465648324079
10.555555555555555,-0.3268866087140435,-0.32332109136192466,0.08194287050035556
10.57057057057057,-0.3386682646483313,-0.33522848711055603,0.08140247476870204
10.585585585585585,-0.3503845681566315,-0.347080222968282,0.08077035302827135
10.6006006006006,-0.3619450242272164,-0.35878377185997506,0.08006468547191198
10.615615615615615,-0.3732585080801791,-0.3702461599427871,0.07930445944779024
10.63063063063063,-0.38423526578431033,-0.38137607715415117,0.07850898307223296
10.645645645645645,-0.39478899210099255,-0.3920860299069146,0.07769739954097514
10.66066066066066,-0.4048388911359459,-0.40229443674479576,0.07688819944351531
10.675675675675675,-0.41431162017867246,-0.41192756705170785,0.076098733252130707
10.69069069069069,-0.42314302003976484,-0.4209212300547947,0.0753447355313304
10.705705705705705,-0.43127954622794584,-0.4292221357743435,0.07463988377325897
10.72072072072072,-0.4386793334132708,-0.4367888698304666,0.07399542447977436
10.735735735735735,-0.4453128489140225,-0.44359244807255993,0.07341990349609559
10.75075075075075,-0.45116311696531497,-0.449616442481102,0.07291903412767102
10.765765765765765,-0.4562255216202134,-0.45485669432932163,0.07249572482322347
10.78078078078078,-0.46050721982575915,-0.45932065211166556,0.07215027016493694
10.795795795795796,-0.4640262155385398,-0.4630263887016726,0.07188068842677717
10.81081081081081,-0.46681015944158427,-0.46600136370138157,0.0716831705941761
10.825825825825826,-0.46889494642279544,-0.4682810027642573,0.0715525933457656
10.84084084084084,-0.47032318472439655,-0.4699071661799583,0.07148304419587308
10.855855855855856,-0.47114260738805824,-0.4709265750135267,0.07146831076994564
10.87087087087087,-0.4714044894741858,-0.4713892556745107,0.07150229622203653
10.885885885885886,-0.47116212483951175,-0.47134705412804967,0.07157933629802718
10.9009009009009,-0.4704694052814779,-0.4708522601724406,0.07169440760315163
10.915915915915916,-0.4693795336845928,-0.46995637125903317,0.07184322895418092
10.93093093093093,-0.4679438922557775,-0.4687090149645933,0.07202226693913537
10.945945945945946,-0.46621107755152547,-0.46715703995075936,0.07222866258031567
10.96096096096096,-0.46422610605466585,-0.4653437773454212,0.07246009864994084
10.975975975975976,-0.4620297876136968,-0.4633084680572495,0.07271462750332335
10.99099099099099,-0.4596582590228122,-0.46108584654955787,0.0729904781845437
11.006006006006006,-0.45714266622101585,-0.4587058679270644,0.07328585983365403
11.02102102102102,-0.45450898082159047,-0.4561935626576289,0.0735987766461263
11.036036036036036,-0.45177793476493805,-0.4535690016811958,0.07392686806763699
11.05105105105105,-0.44896505568008677,-0.4508473538869353,0.07426728653386093
11.066066066066066,-0.44608078496298,-0.44803901783629213,0.07461662366700604
11.08108108108108,-0.44313066060486206,-0.4451498100802342,0.07497089410748574
11.096096096096096,-0.4401155474393066,-0.4421811934029561,0.07532558380501377
11.11111111111111,-0.4370318987394537,-0.4391305297842896,0.07567576645793955
11.126126126126126,-0.43387203498853666,-0.4359913447801748,0.0760162878964939
11.14114114114114,-0.43062442812654184,-0.4327535923387949,0.07634201376944791
11.156156156156156,-0.42727398254700705,-0.4294039117414163,0.07664813127443532
11.17117117117117,-0.42380230742281283,-0.42592587129159093,0.07693049129116578
11.186186186186186,-0.4201879783674458,-0.4223001964474863,0.07718597352006662
11.2012012012012,-0.41640678974373524,-0.4185049831393917,0.0774128543675176
11.216216216216216,-0.4124320018623242,-0.41451589985426485,0.07761115547014713
11.23123123123123,-0.4082345896350969,-0.4103063845104189,0.07778294989356538
11.246246246246246,-0.40378350078027686,-0.40584784401046997,0.07793260308103597
11.26126126126126,-0.39904593230138413,-0.4011098655059999,0.0780669264934178
11.276276276276276,-0.3939876336490111,-0.39606044874291296,0.07819522362291671
11.29129129129129,-0.3885732437756516,-0.39066626835953566,0.07832921091795174
11.306306306306306,-0.38276666734219267,-0.3848929737305827,0.07848280055575596
11.32132132132132,-0.3765314928293371,-0.37870553201122475,0.0786717384828569
11.336336336336336,-0.36983145249383415,-0.37206861761921195,0.07891310017440996
11.35135135135135,-0.3626309212574085,-0.36494704872497874,0.07922465825486188
11.366366366366366,-0.3548954489930196,-0.3573062686457132,0.07962414993155707
11.381381381381381,-0.34659231851896444,-0.34911286760017185,0.08012848668601874
11.396396396396396,-0.3376911201154963,-0.3403351382864471,0.08075296150354147
11.411411411411411,-0.32816433265944034,-0.33094365735052694,0.08151051718192351
11.426426426426426,-0.317987901562064,-0.3209118841019864,0.08241114015326952
11.441441441441441,-0.3071418045342545,-0.31021676780144847,0.08346143603812249
11.456456456456456,-0.2956105976391688,-0.29883935539979795,0.0846644259443405
11.471471471471471,-0.2833839358952627,-0.28676539257389705,0.0860195785942511
11.486486486486486,-0.2704570645721362,-0.27398591203085076,0.0875230667001082
11.501501501501501,-0.2568312789589232,-0.2604978040513025,0.08916821124544756
11.516516516516516,-0.24251435146652187,-0.24630436480983836,0.09094605847059763
11.531531531531531,-0.22752092518086653,-0.23141581787419455,0.0928460237963792
11.546546546546546,-0.21187287222517728,-0.21584980324274813,0.0948565351035182
11.561561561561561,-0.19559961343805124,-0.19963182624052014,0.09696561355606602
11.576576576576576,-0.17873839299161026,-0.1827956556102606,0.09916134145438299
11.591591591591591,-0.16133449787023652,-0.1653836564229418,0.1014321812054538
11.606606606606606,-0.14344140796535945,-0.14744703937300432,0.10376712552507945
11.621621621621621,-0.12512085840824033,-0.1290460041472259,0.10615567507541872
11.636636636636636,-0.10644279225295265,-0.11024975149680302,0.10858765496411399
11.651651651651651,-0.08748517937684604,-0.09113633707678571,0.11105289518878049
11.666666666666666,-0.06833367710873713,-0.0717923406813285,0.11354081154525483
11.681681681681681,-0.04908111015176127,-0.05231232769978255,0.11603993203347876
11.696696696696696,-0.029826752182697727,-0.03279808572425546,0.11853741871159224
11.711711711711711,-0.010675399165996283,-0.013357628227554881,0.12101863575983743
11.726726726726726,0.008263765320710194,0.005896031275456985,0.12346681107018959
11.741741741741741,0.026878500183424848,0.0248463179020791,0.12586283130323764
11.756756756756756,0.045055006411979855,0.04337471622905597,0.12818519985722426
11.771771771771771,0.06267955702292552,0.06136252910719088,0.13041017472245736
11.786786786786786,0.07964020639403802,0.07869271865727581,0.13251209000449765
11.801801801801801,0.09582851902376409,0.09525176508092938,0.13446385211955517
11.816816816816816,0.1111412526333893,0.11093147442915946,0.1362375901336082
11.831831831831831,0.12548193007044117,0.1256306666598876,0.13780542994761788
11.846846846846846,0.1387622389274244,0.13925668032673696,0.13914035429975158
11.861861861861861,0.15090320686223493,0.15172663972615266,0.140217105037558
11.876876876876876,0.1618361134652721,0.1629684434830935,0.1410130810050353
11.891891891891891,0.17150311490884582,0.17292144920790556,0.14150918444739505
11.906906906906906,0.17985757403102048,0.18153684561037378,0.14169057131719595
11.921921921921921,0.18686410439859355,0.18877771984467145,0.14154726640127532
11.936936936936936,0.19249835087364756,0.1946188425119546,0.14107461264611537
11.951951951951951,0.19674654021582288,0.19904620454688582,0.14027353494843953
11.966966966966966,0.19960484266496517,0.20205634841248302,0.1391506111334509
11.981981981981981,0.2010785891112205,0.20365554032018718,0.13771795570238962
11.996996996996996,0.2011813886467509,0.20385883073282723,0.13599293387919117
12.012012012012011,0.1999341886135118,0.20268904776009206,0.1339977332412429
12.027027027027026,0.19736431452772188,0.20017576308432153,0.1317588267220571
12.042042042042041,0.19350452135099816,0.19635426377627754,0.12930636334719567
12.057057057057056,0.18839208130693932,0.19126455677758353,0.12667352152229247
12.072072072072071,0.18206792746966574,0.18495042676804335,0.12389585437533396
12.087087087087086,0.17457586712508127,0.17745856314402256,0.12101064839747626
12.102102102102101,0.16596187464839665,0.1688377681111957,0.11805630664456514
12.117117117117116,0.15627347037194725,0.15913825532340908,0.11507175749817775
12.132132132132131,0.14555918950112842,0.14841104672293942,0.112095880931543
12.147147147147146,0.13386814334679925,0.13670747378210626,0.1091669377562024
12.162162162162161,0.1212496737235725,0.12407878775127609,0.10632198456630272
12.177177177177176,0.10775310008043099,0.11057588144440877,0.10359625882927162
12.192192192192191,0.09342755760541666,0.09624912238855117,0.10102252513139015
12.207207207207206,0.07832192307460727,0.08114829387732846,0.09863038473173427
12.222222222222221,0.06248482356445938,0.06532263681875325,0.0964455652930993
12.237237237237236,0.04596472134253994,0.04882098157797722,0.09448922396340338
12.252252252252251,0.02881006636237993,0.0316919556391826,0.09277731188600805
12.267267267267266,0.011069505903089505,0.013984250161401859,0.09132005803713616
12.282282282282281,-0.007207860891197132,-0.0042530733950582236,0.09012163145450974
12.297297297297296,-0.025972197412173492,-0.02297025633251193,0.08918003119538187
12.312312312312311,-0.04517262809207318,-0.04211651521464375,0.08848723302311992
12.327327327327327,-0.06475693715611616,-0.06163973267828826,0.08802959418474052
12.342342342342342,-0.08467128434089106,-0.08148618389060058,0.08778848842866394
12.357357357357357,-0.10485995440911675,-0.10160031396007889,0.08774111902989692
12.372372372372372,-0.12526515689186338,-0.1219245793059159,0.08786144302086824
12.387387387387387,-0.14582689153769082,-0.1423993635727621,0.08812113709307154
12.402402402402402,-0.16648289341744898,-0.1629629762642308,0.08849054350304252
12.417417417417417,-0.18716866951726763,-0.18355173991804988,0.0889395492077348
12.432432432432432,-0.20781763597199407,-0.20410016936433545,0.08943836897254646
12.447447447447447,-0.22836136190239292,-0.22454124436043307,0.08995821952219644
12.462462462462462,-0.24872992221457169,-0.2448067746237871,0.09047188449596918
12.477477477477477,-0.2688523578291335,-0.2648278539328109,0.09095417807845815
12.492492492492492,-0.28865723779186453,-0.28453539750379836,0.09138231892758873
12.507507507507507,-0.308073313760944,-0.3038607542916087,0.09173622631500403
12.522522522522522,-0.3270302536600077,-0.3227363832685761,0.0919987483768124
12.537537537537537,-0.3454594380178484,-0.34109658022806216,0.09215582915662399
12.552552552552552,-0.36329479984836954,-0.35887823939507385,0.09219661765193979
12.567567567567567,-0.38047368698777245,-0.37602163228404895,0.09211351909399178
12.582582582582582,-0.3969377246842792,-0.3924711849909705,0.0919021867539888
12.597597597597597,-0.4126336559633786,-0.4081762345728491,0.0915614520476859
12.612612612612612,-0.4275141378521945,-0.4230917454190315,0.09109319178643485
12.627627627627627,-0.4415384728775711,-0.43717896754737684,0.09050213406163678
12.642642642642642,-0.45467325725143637,-0.4504060204803339,0.0897956081744509
12.657657657657657,-0.4668929296922539,-0.4627483886256741,0.08898324870929473
12.672672672672672,-0.4781802077522056,-0.4741893167197785,0.08807666855503035
12.687687687687687,-0.4885264016672599,-0.48472009669206284,0.08708911951324333
12.702702702702702,-0.4979315989657095,-0.4943402400967112,0.0860351611815336
12.717717717717717,-0.5064047162155841,-0.5030575328861172,0.0849303582629112
12.732732732732732,-0.5139634172398517,-0.5108879716692811,0.08379102281056085
12.747747747747747,-0.5206338997845752,-0.5178555826557558,0.08263401107502544
12.762762762762762,-0.5264505549271612,-0.5239921262228685,0.08147657501327614
12.777777777777777,-0.5314555054333977,-0.5293366914865308,0.08033625715497275
12.792792792792792,-0.5356980308240715,-0.5339351864542751,0.07923080595027236
12.807807807807807,-0.5392338881392238,-0.5378397303586109,0.0781780789209909
12.822822822822824,-0.5421245383632188,-0.541107955682714,0.07719589510241785
12.837837837837839,-0.5444362892869888,-0.5438022282733891,0.07630179852453622
12.852852852852854,-0.5462393663314307,-0.5459887948577377,0.07551270248821298
12.867867867867869,-0.5476069236250692,-0.5477368682972308,0.07484440079235857
12.882882882882884,-0.5486140084848623,-0.5491176620627188,0.0743109559271482
12.897897897897899,-0.5493364934213409,-0.5502033867037428,0.07392400257722075
12.912912912912914,-0.5498499908653964,-0.5510662224863134,0.07369203248013909
12.927927927927929,-0.5502287669362612,-0.5517772838159567,0.07361974725339494
12.942942942942944,-0.550544671639734,-0.5524055924396957,0.073707572915691
12.957957957957959,-0.5508661037747637,-0.5530170775951665,0.07395141950652234
12.972972972972974,-0.551257029394205,-0.5536736220960323,0.07434274169578202
12.987987987987989,-0.5517760727791493,-0.5544321736656125,0.07486891660996801
13.003003003003004,-0.5524756984402588,-0.5553439405371574,0.07551391182109722
13.018018018018019,-0.5534015015933871,-0.556453689358187,0.07625917883138394
13.033033033033034,-0.5545916228644834,-0.557799161754213,0.0770846824960719
13.048048048048049,-0.5560763007097065,-0.5594106235727152,0.07796996763918054
13.063063063063064,-0.5578775722881935,-0.5613105579446003,0.07889516946063682
13.078078078078079,-0.5600091304250119,-0.5635135100105045,0.07984189024787738
13.093093093093094,-0.5624763409886562,-0.5660260876239367,0.08079388653157207
13.108108108108109,-0.5652764216066434,-0.5688471187179333,0.08173753394371852
13.123123123123124,-0.5683987792496383,-0.5719679624368573,0.08266205882003361
13.138138138138139,-0.5718255008830975,-0.5753729676807123,0.08355954461358853
13.153153153153154,-0.575531988128802,-0.5790400694329841,0.08442473700236194
13.168168168168169,-0.5794877236785141,-0.5829415101529782,0.08525468416072748
13.183183183183184,-0.5836571540286715,-0.5870446705942486,0.08604825801424117
13.198198198198199,-0.588000669941398,-0.5913129916417287,0.08680560820642425
13.213213213213214,-0.5924756629028736,-0.5957069661382849,0.08752760260165786
13.228228228228229,-0.5970376328220066,-0.6001851772287533,0.08821530606503819
13.243243243243244,-0.6016413194328599,-0.604705357565719,0.08886954288890705
13.258258258258259,-0.6062418275393623,-0.6092254419268113,0.0894905779332447
13.273273273273274,-0.6107957146221092,-0.6137045845625,0.09007793822549674
13.288288288288289,-0.6152620086833659,-0.6181041121283595,0.0906303818224234
13.303303303303304,-0.6196031247862253,-0.6223883835628506,0.09114600584000014
13.318318318318319,-0.6237856507352765,-0.6265255299316322,0.09162247234995177
13.333333333333334,-0.6277809758415477,-0.6304880501971258,0.09205732065598589
13.348348348348349,-0.6315657416839732,-0.6342532431269658,0.09244832812768232
13.363363363363364,-0.6351221000614496,-0.6378034610585994,0.0927938795462008
13.378378378378379,-0.6384377706346426,-0.6411261778012929,0.09309330655913578
13.393393393393394,-0.6415058986937882,-0.6442138702754803,0.0933471637455515
13.408408408408409,-0.6443247215991,-0.6470637211589823,0.09355741515560106
13.423423423423424,-0.6468970602444175,-0.6496771573630817,0.09372751415859222
13.438438438438439,-0.6492296589382657,-0.652059246116136,0.09386236919366187
13.453453453453454,-0.6513324029940811,-0.6542179763429626,0.09396819782856951
13.468468468468469,-0.6532174477896902,-0.6561634575374511,0.09405228073078134
13.483483483483484,-0.6548982959335375,-0.6579070712041565,0.09412263514028105
13.498498498498499,-0.6563888604273884,-0.6594606111113595,0.09418763366405407
13.513513513513514,-0.6577025514253313,-0.6608354481219724,0.09425559822489532
13.528528528528529,-0.6588514225355148,-0.6620417534460742,0.09433440045270924
13.543543543543544,-0.6598454098374175,-0.6630878110761725,0.09443109855051653
13.558558558558559,-0.6606916931640133,-0.6639794462516796,0.09455163679082025
13.573573573573574,-0.6613942049861669,-0.6647195923724206,0.09470062767096002
13.588588588588589,-0.6619533076511674,-0.6653080141095685,0.09488122901651992
13.603603603603604,-0.6623656549115698,-0.6657411997272635,0.09509511980757727
13.618618618618619,-0.6626242486852767,-0.6660124309061182,0.09534257013520281
13.633633633633634,-0.6627186967685769,-0.666112033621529,0.09562259333854628
13.64864864864865,-0.6626356716508043,-0.6660278087553804,0.09593316269906094
13.663663663663664,-0.6623595644665985,-0.6657456359297221,0.09627147146946675
13.67867867867868,-0.6618733212741609,-0.6652502383516472,0.09663421357278676
13.693693693693694,-0.6611594411234439,-0.6645260900970568,0.09701786282854657
13.70870870870871,-0.6602011067613289,-0.6635584401875614,0.09741893066498312
13.723723723723724,-0.6589834094987256,-0.6623344201425279,0.09783418548661542
13.73873873873874,-0.6574946201873245,-0.6608441937413818,0.09826082072529804
13.753753753753754,-0.6557274491700452,-0.6590821000716153,0.0986965627320913
13.76876876876877,-0.6536802305065116,-0.6570477343533779,0.0991397138082465
13.783783783783784,-0.6513579609612378,-0.6547469064816617,0.09958912968977586
13.7987987987988,-0.6487731234518143,-0.6521924157359372,0.10004413465426282
13.813813813813814,-0.6459462289955985,-0.6494045826128088,0.10050438113390438
13.82882882882883,-0.6429060213598943,-0.6464114859124492,0.10096966433015266
13.843843843843844,-0.6396893046598112,-0.6432488652830529,0.10143970582365322
13.85885885885886,-0.6363403753000214,-0.6399596660437894,0.10191392344681403
13.873873873873874,-0.6329100643250398,-0.6365932232622102,0.10239120746995946
13.88888888888889,-0.629454422126966,-0.6332041041488554,0.10286972500597838
13.903903903903904,-0.626033101853044,-0.6298506497994985,0.10334677488745804
13.91891891891892,-0.622707518059116,-0.626593276938781,0.1038187135210163
13.933933933933934,-0.6195388709279485,-0.6234926155268986,0.10428096794946586
13.94894894894895,-0.616586132316065,-0.6206075672985437,0.1047281454960626
13.963963963963964,-0.6139040876862656,-0.6179933726728041,0.10515424037762547
13.97897897897898,-0.6115415184025637,-0.6156997690500965,0.1055529275198098
13.993993993993994,-0.6095395936062938,-0.6137693132039924,0.10591792381056887
14.00900900900901,-0.60793052223303,-0.612235925875848,0.10624338858737539
14.024024024024024,-0.6067364961176004,-0.6111236997835663,0.10652432943979633
14.03903903903904,-0.6059689367935,-0.6104459951263662,0.10675697712531208
14.054054054054054,-0.6056280432278143,-0.6102048311252389,0.10693909469127923
14.06906906906907,-0.6057026263608362,-0.6103905695257319,0.1070701904286404
14.084084084084084,-0.6061702092476036,-0.6109818770436614,0.1071516113978976
14.0990990990991,-0.6069973685113804,-0.6119459485759873,0.10718650320100961
14.114114114114114,-0.6081402929430249,-0.6132389712135751,0.10717963171408024
14.12912912912913,-0.6095455373752531,-0.6148068098710363,0.10713707306043273
14.144144144144144,-0.6111509533059393,-0.6165858976587364,0.10706578870553882
14.15915915915916,-0.6128867810897465,-0.6185043168721125,0.10697311270666131
14.174174174174174,-0.6146768909945612,-0.620483058656898,0.10686618724199176
14.18918918918919,-0.6164401614082262,-0.6224374502126542,0.10675138976755537
14.204204204204204,-0.6180919816386006,-0.6242787372743309,0.1066337995131852
14.21921921921922,-0.6195458640089403,-0.6259158063213845,0.10651675149763903
14.234234234234235,-0.6207151454965592,-0.6272570255773776,0.10640152199267303
14.24924924924925,-0.6215147533973748,-0.6282121767462073,0.10628718007805583
14.264264264264265,-0.6218630029905154,-0.6286944412010094,0.1061706260353512
14.27927927927928,-0.6216833886053963,-0.6286223958068539,0.1060468200967943
14.294294294294295,-0.6209063235892637,-0.6279219656406849,0.10590918647502444
14.30930930930931,-0.6194707801551916,-0.6265282745253371,0.10575016000671436
14.324324324324325,-0.6173257776055144,-0.6243873304153298,0.10556182844090826
14.33933933933934,-0.6144316674910678,-0.6214574820186575,0.10533661419510958
14.354354354354355,-0.6107611672223051,-0.6177105861545861,0.10506793631568731
14.36936936936937,-0.6063000996208053,-0.6131328325004696,0.10475079656828927
14.384384384384385,-0.6010478047805229,-0.6077251835161885,0.10438224241291645
14.3993993993994,-0.5950172020497939,-0.6015034020491818,0.10396167285362412
14.414414414414415,-0.5882344933764004,-0.5944976566617685,0.10349096918636663
14.42942942942943,-0.5807385139166313,-0.5867517140108391,0.10297444971646393
14.444444444444445,-0.5725797507949144,-0.5783217473205842,0.10241866377990651
14.45945945945946,-0.5638190652415154,-0.5692748086501248,0.10183205420374923
14.474474474474475,-0.5545261660682738,-0.559687028795448,0.1012245272714677
14.48948948948949,-0.544777892694218,-0.5496416209653273,0.1006069743398105
14.504504504504505,-0.534656373004245,-0.5392267718397117,0.09999078909191433
14.51951951951952,-0.5242471247550705,-0.5285335057101717,0.09938741930880218
14.534534534534535,-0.5136371688598182,-0.5176536040890316,0.09880798299398744
14.54954954954955,-0.5029132188163309,-0.5066776549498181,0.09826296724505472
14.564564564564565,-0.4921600032136245,-0.4956932935652468,0.09776201626797712
14.57957957957958,-0.48145876831705786,-0.48478368198981375,0.09731380415250097
14.594594594594595,-0.47088599602717257,-0.47402625798564885,0.09692597986164228
14.60960960960961,-0.4605123599427076,-0.46349176797682234,0.09660516711272496
14.624624624624625,-0.4504019297381585,-0.4532435836276716,0.09635700053196138
14.63963963963964,-0.44061162239967877,-0.44333728878381623,0.09618618113620592
14.654654654654655,-0.43119088870088657,-0.4338205133694571,0.09609653791647128
14.66966966966967,-0.4221816150931062,-0.42473298364908263,0.09609108699219882
14.684684684684685,-0.41361821517154673,-0.4161067539923912,0.0961720844682075
14.6996996996997,-0.40552788109592003,-0.40796658365714544,0.09634107298794606
14.714714714714715,-0.39793096365608227,-0.40033042270387326,0.0965989245839184
14.72972972972973,-0.39084144981584096,-0.3932099734785633,0.09694588364505255
14.744744744744745,-0.38426750819510785,-0.38661129762998747,0.09738161378225588
14.75975975975976,-0.3782120756795245,-0.3805354428855245,0.09790525138644914
14.774774774774775,-0.3726734617983104,-0.3749790683765806,0.09851546713065427
14.78978978978979,-0.36764595133899314,-0.36993505184697123,0.09921053496159352
14.804804804804805,-0.3631203895781324,-0.36539306634580593,0.0999884065861806
14.81981981981982,-0.35908473826903886,-0.3613401178329252,0.1008467883146024
14.834834834834835,-0.3555245939744424,-0.35776103841360046,0.10178321649413702
14.84984984984985,-0.3524236633577755,-0.35463893263229107,0.10279512767460976
14.864864864864865,-0.3497641925975984,-0.35195557639956765,0.10387992002605581
14.87987987987988,-0.34752735015386954,-0.34969176974059085,0.1050350032690655
14.894894894894895,-0.34569356371222887,-0.34782764569642044,0.1062578353423133
14.90990990990991,-0.3442428133046425,-0.3463429384506312,0.10754594508399956
14.924924924924925,-0.34315488340607264,-0.34521721416614415,0.10889694122519598
14.93993993993994,-0.3424095772971915,-0.344430068171901,0.11030850889088878
14.954954954954955,-0.34198689722345793,-0.34396129210132914,0.11177839551648794
14.96996996996997,-0.34186719392798026,-0.3437910144120157,0.1133043885806217
14.984984984984985,-0.34203128904109054,-0.3438998174570173,0.11488428782150277
15,-0.34246057361770865,-0.3442688339722349,0.11651587465665131
