interval,output,model_id,model_label,model_theory,model_colour,timbre_label
11.75,129.31569138681675,PraatF0,Praat (F0),harmonicity,#11A3FF,Pure tones
11.7505005005005,129.31864381857906,PraatF0,Praat (F0),harmonicity,#11A3FF,Pure tones
11.751001001001,129.3215913898945,PraatF0,Praat (F0),harmonicity,#11A3FF,Pure tones
11.751501501501501,129.3245126242926,PraatF0,Praat (F0),harmonicity,#11A3FF,Pure tones
11.752002002002001,129.32824438606758,PraatF0,Praat (F0),harmonicity,#11A3FF,Pure tones
11.752502502502503,129.33119798508073,PraatF0,Praat (F0),harmonicity,#11A3FF,Pure tones
11.753003003003004,129.33411631372704,PraatF0,Praat (F0),harmonicity,#11A3FF,Pure tones
11.753503503503504,129.33707161142138,PraatF0,Praat (F0),harmonicity,#11A3FF,Pure tones
11.754004004004004,129.3400163056391,PraatF0,Praat (F0),harmonicity,#11A3FF,Pure tones
11.754504504504505,129.34297024480725,PraatF0,Praat (F0),harmonicity,#11A3FF,Pure tones
11.755005005005005,129.34592157579402,PraatF0,Praat (F0),harmonicity,#11A3FF,Pure tones
11.755505505505505,129.3488752431894,PraatF0,Praat (F0),harmonicity,#11A3FF,Pure tones
11.756006006006006,129.35181772153516,PraatF0,Praat (F0),harmonicity,#11A3FF,Pure tones
11.756506506506506,129.35477552683489,PraatF0,Praat (F0),harmonicity,#11A3FF,Pure tones
11.757007007007006,129.35771924211596,PraatF0,Praat (F0),harmonicity,#11A3FF,Pure tones
11.757507507507508,129.36067647762013,PraatF0,Praat (F0),harmonicity,#11A3FF,Pure tones
11.758008008008009,129.36362768230447,PraatF0,Praat (F0),harmonicity,#11A3FF,Pure tones
11.758508508508509,129.36658286975208,PraatF0,Praat (F0),harmonicity,#11A3FF,Pure tones
11.75900900900901,129.36953580789447,PraatF0,Praat (F0),harmonicity,#11A3FF,Pure tones
11.75950950950951,129.37249012729234,PraatF0,Praat (F0),harmonicity,#11A3FF,Pure tones
11.76001001001001,129.3754494792978,PraatF0,Praat (F0),harmonicity,#11A3FF,Pure tones
11.76051051051051,129.3784037777856,PraatF0,Praat (F0),harmonicity,#11A3FF,Pure tones
11.76101101101101,129.38136837929721,PraatF0,Praat (F0),harmonicity,#11A3FF,Pure tones
11.761511511511511,129.38431261292186,PraatF0,Praat (F0),harmonicity,#11A3FF,Pure tones
11.762012012012011,129.38728006268002,PraatF0,Praat (F0),harmonicity,#11A3FF,Pure tones
11.762512512512513,129.39022878321313,PraatF0,Praat (F0),harmonicity,#11A3FF,Pure tones
11.763013013013014,129.3931933468899,PraatF0,Praat (F0),harmonicity,#11A3FF,Pure tones
11.763513513513514,129.39615412525546,PraatF0,Praat (F0),harmonicity,#11A3FF,Pure tones
11.764014014014014,129.39911890226125,PraatF0,Praat (F0),harmonicity,#11A3FF,Pure tones
11.764514514514515,129.40208935462135,PraatF0,Praat (F0),harmonicity,#11A3FF,Pure tones
11.765015015015015,129.40505801002,PraatF0,Praat (F0),harmonicity,#11A3FF,Pure tones
11.765515515515515,129.40800018170964,PraatF0,Praat (F0),harmonicity,#11A3FF,Pure tones
11.766016016016016,129.41096680170133,PraatF0,Praat (F0),harmonicity,#11A3FF,Pure tones
11.766516516516516,129.41394082871977,PraatF0,Praat (F0),harmonicity,#11A3FF,Pure tones
11.767017017017016,129.41690935939926,PraatF0,Praat (F0),harmonicity,#11A3FF,Pure tones
11.767517517517518,129.41988292765174,PraatF0,Praat (F0),harmonicity,#11A3FF,Pure tones
11.768018018018019,129.42285279025384,PraatF0,Praat (F0),harmonicity,#11A3FF,Pure tones
11.768518518518519,129.4258289064899,PraatF0,Praat (F0),harmonicity,#11A3FF,Pure tones
11.76901901901902,129.4287699292518,PraatF0,Praat (F0),harmonicity,#11A3FF,Pure tones
11.76951951951952,129.4317464558413,PraatF0,Praat (F0),harmonicity,#11A3FF,Pure tones
11.77002002002002,129.43471706300264,PraatF0,Praat (F0),harmonicity,#11A3FF,Pure tones
11.77052052052052,129.43769624974408,PraatF0,Praat (F0),harmonicity,#11A3FF,Pure tones
11.77102102102102,129.44066776556681,PraatF0,Praat (F0),harmonicity,#11A3FF,Pure tones
11.771521521521521,129.44364369062419,PraatF0,Praat (F0),harmonicity,#11A3FF,Pure tones
11.772022022022021,129.4466155127908,PraatF0,Praat (F0),harmonicity,#11A3FF,Pure tones
11.772522522522523,129.4495924465158,PraatF0,Praat (F0),harmonicity,#11A3FF,Pure tones
11.773023023023024,129.45256936847616,PraatF0,Praat (F0),harmonicity,#11A3FF,Pure tones
11.773523523523524,129.45554863583075,PraatF0,Praat (F0),harmonicity,#11A3FF,Pure tones
11.774024024024024,129.45849934975314,PraatF0,Praat (F0),harmonicity,#11A3FF,Pure tones
11.774524524524525,129.4615233832784,PraatF0,Praat (F0),harmonicity,#11A3FF,Pure tones
11.775025025025025,129.4644947991876,PraatF0,Praat (F0),harmonicity,#11A3FF,Pure tones
11.775525525525525,129.46746516039133,PraatF0,Praat (F0),harmonicity,#11A3FF,Pure tones
11.776026026026026,129.4704357753169,PraatF0,Praat (F0),harmonicity,#11A3FF,Pure tones
11.776526526526526,129.47341070921283,PraatF0,Praat (F0),harmonicity,#11A3FF,Pure tones
11.777027027027026,129.47640623710146,PraatF0,Praat (F0),harmonicity,#11A3FF,Pure tones
11.777527527527528,129.4793838129877,PraatF0,Praat (F0),harmonicity,#11A3FF,Pure tones
11.778028028028029,129.48235349190938,PraatF0,Praat (F0),harmonicity,#11A3FF,Pure tones
11.778528528528529,129.48532656200246,PraatF0,Praat (F0),harmonicity,#11A3FF,Pure tones
11.77902902902903,129.48834350427356,PraatF0,Praat (F0),harmonicity,#11A3FF,Pure tones
11.77952952952953,129.49132733739225,PraatF0,Praat (F0),harmonicity,#11A3FF,Pure tones
11.78003003003003,129.49427930353025,PraatF0,Praat (F0),harmonicity,#11A3FF,Pure tones
11.78053053053053,129.49726384463185,PraatF0,Praat (F0),harmonicity,#11A3FF,Pure tones
11.78103103103103,129.5002708987558,PraatF0,Praat (F0),harmonicity,#11A3FF,Pure tones
11.781531531531531,129.5032526800847,PraatF0,Praat (F0),harmonicity,#11A3FF,Pure tones
11.782032032032031,129.50623242370338,PraatF0,Praat (F0),harmonicity,#11A3FF,Pure tones
11.782532532532533,129.5092180480893,PraatF0,Praat (F0),harmonicity,#11A3FF,Pure tones
11.783033033033034,129.51220097892067,PraatF0,Praat (F0),harmonicity,#11A3FF,Pure tones
11.783533533533534,129.5151811605237,PraatF0,Praat (F0),harmonicity,#11A3FF,Pure tones
11.784034034034034,129.51815413970354,PraatF0,Praat (F0),harmonicity,#11A3FF,Pure tones
11.784534534534535,129.5211416880514,PraatF0,Praat (F0),harmonicity,#11A3FF,Pure tones
11.785035035035035,129.52412237047852,PraatF0,Praat (F0),harmonicity,#11A3FF,Pure tones
11.785535535535535,129.52710781001838,PraatF0,Praat (F0),harmonicity,#11A3FF,Pure tones
11.786036036036036,129.53009052104386,PraatF0,Praat (F0),harmonicity,#11A3FF,Pure tones
11.786536536536536,129.53307676752434,PraatF0,Praat (F0),harmonicity,#11A3FF,Pure tones
11.787037037037036,129.5360547964101,PraatF0,Praat (F0),harmonicity,#11A3FF,Pure tones
11.787537537537538,129.5390408532959,PraatF0,Praat (F0),harmonicity,#11A3FF,Pure tones
11.788038038038039,129.54204555943568,PraatF0,Praat (F0),harmonicity,#11A3FF,Pure tones
11.788538538538539,129.54502826069842,PraatF0,Praat (F0),harmonicity,#11A3FF,Pure tones
11.78903903903904,129.5480030722751,PraatF0,Praat (F0),harmonicity,#11A3FF,Pure tones
11.78953953953954,129.55098382475313,PraatF0,Praat (F0),harmonicity,#11A3FF,Pure tones
11.79004004004004,129.55396090297745,PraatF0,Praat (F0),harmonicity,#11A3FF,Pure tones
11.79054054054054,129.55696977849624,PraatF0,Praat (F0),harmonicity,#11A3FF,Pure tones
11.79104104104104,129.5599433579757,PraatF0,Praat (F0),harmonicity,#11A3FF,Pure tones
11.791541541541541,129.56292881702475,PraatF0,Praat (F0),harmonicity,#11A3FF,Pure tones
11.792042042042041,129.56590380839,PraatF0,Praat (F0),harmonicity,#11A3FF,Pure tones
11.792542542542543,129.5688813512357,PraatF0,Praat (F0),harmonicity,#11A3FF,Pure tones
11.793043043043044,129.57185842987764,PraatF0,Praat (F0),harmonicity,#11A3FF,Pure tones
11.793543543543544,129.57484347648855,PraatF0,Praat (F0),harmonicity,#11A3FF,Pure tones
11.794044044044044,129.57781526876428,PraatF0,Praat (F0),harmonicity,#11A3FF,Pure tones
11.794544544544545,129.58079513439722,PraatF0,Praat (F0),harmonicity,#11A3FF,Pure tones
11.795045045045045,129.58376831616948,PraatF0,Praat (F0),harmonicity,#11A3FF,Pure tones
11.795545545545545,129.58675196363677,PraatF0,Praat (F0),harmonicity,#11A3FF,Pure tones
11.796046046046046,129.5897601457158,PraatF0,Praat (F0),harmonicity,#11A3FF,Pure tones
11.796546546546546,129.59273958044142,PraatF0,Praat (F0),harmonicity,#11A3FF,Pure tones
11.797047047047046,129.5957142247026,PraatF0,Praat (F0),harmonicity,#11A3FF,Pure tones
11.797547547547548,129.59867055744388,PraatF0,Praat (F0),harmonicity,#11A3FF,Pure tones
11.798048048048049,129.60164303455457,PraatF0,Praat (F0),harmonicity,#11A3FF,Pure tones
11.798548548548549,129.60462542079395,PraatF0,Praat (F0),harmonicity,#11A3FF,Pure tones
11.79904904904905,129.60760002199015,PraatF0,Praat (F0),harmonicity,#11A3FF,Pure tones
11.79954954954955,129.61058084981823,PraatF0,Praat (F0),harmonicity,#11A3FF,Pure tones
11.80005005005005,129.61355596099295,PraatF0,Praat (F0),harmonicity,#11A3FF,Pure tones
11.80055055055055,129.61653524538212,PraatF0,Praat (F0),harmonicity,#11A3FF,Pure tones
11.80105105105105,129.61951137826867,PraatF0,Praat (F0),harmonicity,#11A3FF,Pure tones
11.801551551551551,129.62249572169992,PraatF0,Praat (F0),harmonicity,#11A3FF,Pure tones
11.802052052052051,129.62544341194706,PraatF0,Praat (F0),harmonicity,#11A3FF,Pure tones
11.802552552552553,129.62842239594727,PraatF0,Praat (F0),harmonicity,#11A3FF,Pure tones
11.803053053053054,129.63139949622996,PraatF0,Praat (F0),harmonicity,#11A3FF,Pure tones
11.803553553553554,129.63435322630156,PraatF0,Praat (F0),harmonicity,#11A3FF,Pure tones
11.804054054054054,129.63732756986303,PraatF0,Praat (F0),harmonicity,#11A3FF,Pure tones
11.804554554554555,129.6403065336271,PraatF0,Praat (F0),harmonicity,#11A3FF,Pure tones
11.805055055055055,129.6432878268852,PraatF0,Praat (F0),harmonicity,#11A3FF,Pure tones
11.805555555555555,129.64623010364642,PraatF0,Praat (F0),harmonicity,#11A3FF,Pure tones
11.806056056056056,129.64920600754562,PraatF0,Praat (F0),harmonicity,#11A3FF,Pure tones
11.806556556556556,129.65218399035723,PraatF0,Praat (F0),harmonicity,#11A3FF,Pure tones
11.807057057057056,129.6551399961185,PraatF0,Praat (F0),harmonicity,#11A3FF,Pure tones
11.807557557557558,129.6581102785133,PraatF0,Praat (F0),harmonicity,#11A3FF,Pure tones
11.808058058058059,129.66106729795047,PraatF0,Praat (F0),harmonicity,#11A3FF,Pure tones
11.808558558558559,129.66404003223016,PraatF0,Praat (F0),harmonicity,#11A3FF,Pure tones
11.80905905905906,129.66699917326736,PraatF0,Praat (F0),harmonicity,#11A3FF,Pure tones
11.80955955955956,129.66996717322414,PraatF0,Praat (F0),harmonicity,#11A3FF,Pure tones
11.81006006006006,129.67292640832014,PraatF0,Praat (F0),harmonicity,#11A3FF,Pure tones
11.81056056056056,129.67589144520906,PraatF0,Praat (F0),harmonicity,#11A3FF,Pure tones
11.81106106106106,129.6788503454531,PraatF0,Praat (F0),harmonicity,#11A3FF,Pure tones
11.811561561561561,129.68181338449202,PraatF0,Praat (F0),harmonicity,#11A3FF,Pure tones
11.812062062062061,129.68477298978934,PraatF0,Praat (F0),harmonicity,#11A3FF,Pure tones
11.812562562562563,129.68773719880738,PraatF0,Praat (F0),harmonicity,#11A3FF,Pure tones
11.813063063063064,129.69070049018106,PraatF0,Praat (F0),harmonicity,#11A3FF,Pure tones
11.813563563563564,129.69366411654227,PraatF0,Praat (F0),harmonicity,#11A3FF,Pure tones
11.814064064064064,129.6966224387102,PraatF0,Praat (F0),harmonicity,#11A3FF,Pure tones
11.814564564564565,129.69958816627633,PraatF0,Praat (F0),harmonicity,#11A3FF,Pure tones
11.815065065065065,129.70251933671477,PraatF0,Praat (F0),harmonicity,#11A3FF,Pure tones
11.815565565565565,129.70627195414204,PraatF0,Praat (F0),harmonicity,#11A3FF,Pure tones
11.816066066066066,129.70923362925166,PraatF0,Praat (F0),harmonicity,#11A3FF,Pure tones
11.816566566566566,129.71219828796876,PraatF0,Praat (F0),harmonicity,#11A3FF,Pure tones
11.817067067067066,129.71512859865535,PraatF0,Praat (F0),harmonicity,#11A3FF,Pure tones
11.817567567567568,129.71809553449128,PraatF0,Praat (F0),harmonicity,#11A3FF,Pure tones
11.818068068068069,129.7210574407326,PraatF0,Praat (F0),harmonicity,#11A3FF,Pure tones
11.818568568568569,129.72402213193502,PraatF0,Praat (F0),harmonicity,#11A3FF,Pure tones
11.81906906906907,129.72698620315722,PraatF0,Praat (F0),harmonicity,#11A3FF,Pure tones
11.81956956956957,129.7299548599059,PraatF0,Praat (F0),harmonicity,#11A3FF,Pure tones
11.82007007007007,129.73291268827987,PraatF0,Praat (F0),harmonicity,#11A3FF,Pure tones
11.82057057057057,129.7358807352286,PraatF0,Praat (F0),harmonicity,#11A3FF,Pure tones
11.82107107107107,129.7388419773681,PraatF0,Praat (F0),harmonicity,#11A3FF,Pure tones
11.821571571571571,129.74181081178108,PraatF0,Praat (F0),harmonicity,#11A3FF,Pure tones
11.822072072072071,129.74477117380644,PraatF0,Praat (F0),harmonicity,#11A3FF,Pure tones
11.822572572572573,129.74774145802024,PraatF0,Praat (F0),harmonicity,#11A3FF,Pure tones
11.823073073073074,129.75070827606342,PraatF0,Praat (F0),harmonicity,#11A3FF,Pure tones
11.823573573573574,129.75366879224958,PraatF0,Praat (F0),harmonicity,#11A3FF,Pure tones
11.824074074074074,129.75664554005957,PraatF0,Praat (F0),harmonicity,#11A3FF,Pure tones
11.824574574574575,129.7596274487405,PraatF0,Praat (F0),harmonicity,#11A3FF,Pure tones
11.825075075075075,129.7625932152967,PraatF0,Praat (F0),harmonicity,#11A3FF,Pure tones
11.825575575575575,129.76555378559425,PraatF0,Praat (F0),harmonicity,#11A3FF,Pure tones
11.826076076076076,129.76853259796468,PraatF0,Praat (F0),harmonicity,#11A3FF,Pure tones
11.826576576576576,129.77151850542214,PraatF0,Praat (F0),harmonicity,#11A3FF,Pure tones
11.827077077077076,129.7744737027373,PraatF0,Praat (F0),harmonicity,#11A3FF,Pure tones
11.827577577577578,129.7774521690113,PraatF0,Praat (F0),harmonicity,#11A3FF,Pure tones
11.828078078078079,129.78043016394025,PraatF0,Praat (F0),harmonicity,#11A3FF,Pure tones
11.828578578578579,129.78341765237374,PraatF0,Praat (F0),harmonicity,#11A3FF,Pure tones
11.82907907907908,129.78639646847336,PraatF0,Praat (F0),harmonicity,#11A3FF,Pure tones
11.82957957957958,129.78935332960276,PraatF0,Praat (F0),harmonicity,#11A3FF,Pure tones
11.83008008008008,129.79233383420097,PraatF0,Praat (F0),harmonicity,#11A3FF,Pure tones
11.83058058058058,129.79532063069448,PraatF0,Praat (F0),harmonicity,#11A3FF,Pure tones
11.83108108108108,129.79830364943814,PraatF0,Praat (F0),harmonicity,#11A3FF,Pure tones
11.831581581581581,129.80129004471706,PraatF0,Praat (F0),harmonicity,#11A3FF,Pure tones
11.832082082082081,129.80427183707894,PraatF0,Praat (F0),harmonicity,#11A3FF,Pure tones
11.832582582582583,129.80726076286498,PraatF0,Praat (F0),harmonicity,#11A3FF,Pure tones
11.833083083083084,129.8102185008231,PraatF0,Praat (F0),harmonicity,#11A3FF,Pure tones
11.833583583583584,129.81320607262379,PraatF0,Praat (F0),harmonicity,#11A3FF,Pure tones
11.834084084084084,129.81619091451267,PraatF0,Praat (F0),harmonicity,#11A3FF,Pure tones
11.834584584584585,129.81918304123295,PraatF0,Praat (F0),harmonicity,#11A3FF,Pure tones
11.835085085085085,129.82216696603479,PraatF0,Praat (F0),harmonicity,#11A3FF,Pure tones
11.835585585585585,129.8251626231558,PraatF0,Praat (F0),harmonicity,#11A3FF,Pure tones
11.836086086086086,129.8281446068516,PraatF0,Praat (F0),harmonicity,#11A3FF,Pure tones
11.836586586586586,129.83113739829628,PraatF0,Praat (F0),harmonicity,#11A3FF,Pure tones
11.837087087087086,129.8341251948694,PraatF0,Praat (F0),harmonicity,#11A3FF,Pure tones
11.837587587587588,129.8371180972557,PraatF0,Praat (F0),harmonicity,#11A3FF,Pure tones
11.838088088088089,129.840127859385,PraatF0,Praat (F0),harmonicity,#11A3FF,Pure tones
11.838588588588589,129.84312012968968,PraatF0,Praat (F0),harmonicity,#11A3FF,Pure tones
11.83908908908909,129.84610283927168,PraatF0,Praat (F0),harmonicity,#11A3FF,Pure tones
11.83958958958959,129.84909249383801,PraatF0,Praat (F0),harmonicity,#11A3FF,Pure tones
11.84009009009009,129.8520706976609,PraatF0,Praat (F0),harmonicity,#11A3FF,Pure tones
11.84059059059059,129.85506047548077,PraatF0,Praat (F0),harmonicity,#11A3FF,Pure tones
11.84109109109109,129.85807224633857,PraatF0,Praat (F0),harmonicity,#11A3FF,Pure tones
11.841591591591591,129.86106258934706,PraatF0,Praat (F0),harmonicity,#11A3FF,Pure tones
11.842092092092091,129.8640444763413,PraatF0,Praat (F0),harmonicity,#11A3FF,Pure tones
11.842592592592593,129.86703526153957,PraatF0,Praat (F0),harmonicity,#11A3FF,Pure tones
11.843093093093094,129.87006244640682,PraatF0,Praat (F0),harmonicity,#11A3FF,Pure tones
11.843593593593594,129.8730608207062,PraatF0,Praat (F0),harmonicity,#11A3FF,Pure tones
11.844094094094094,129.87602436148558,PraatF0,Praat (F0),harmonicity,#11A3FF,Pure tones
11.844594594594595,129.8790221005201,PraatF0,Praat (F0),harmonicity,#11A3FF,Pure tones
11.845095095095095,129.88204285070157,PraatF0,Praat (F0),harmonicity,#11A3FF,Pure tones
11.845595595595595,129.88504305746397,PraatF0,Praat (F0),harmonicity,#11A3FF,Pure tones
11.846096096096096,129.88803544217333,PraatF0,Praat (F0),harmonicity,#11A3FF,Pure tones
11.846596596596596,129.891032435893,PraatF0,Praat (F0),harmonicity,#11A3FF,Pure tones
11.847097097097096,129.89402728924804,PraatF0,Praat (F0),harmonicity,#11A3FF,Pure tones
11.847597597597598,129.89702083130555,PraatF0,Praat (F0),harmonicity,#11A3FF,Pure tones
11.848098098098099,129.9000141983015,PraatF0,Praat (F0),harmonicity,#11A3FF,Pure tones
11.848598598598599,129.9030124523548,PraatF0,Praat (F0),harmonicity,#11A3FF,Pure tones
11.8490990990991,129.90600602137863,PraatF0,Praat (F0),harmonicity,#11A3FF,Pure tones
11.8495995995996,129.90900650825216,PraatF0,Praat (F0),harmonicity,#11A3FF,Pure tones
11.8501001001001,129.91200184195895,PraatF0,Praat (F0),harmonicity,#11A3FF,Pure tones
11.8506006006006,129.91500237546097,PraatF0,Praat (F0),harmonicity,#11A3FF,Pure tones
11.8511011011011,129.91799491945423,PraatF0,Praat (F0),harmonicity,#11A3FF,Pure tones
11.851601601601601,129.9209945904662,PraatF0,Praat (F0),harmonicity,#11A3FF,Pure tones
11.852102102102101,129.92401633467716,PraatF0,Praat (F0),harmonicity,#11A3FF,Pure tones
11.852602602602603,129.9270110302871,PraatF0,Praat (F0),harmonicity,#11A3FF,Pure tones
11.853103103103104,129.929998697882,PraatF0,Praat (F0),harmonicity,#11A3FF,Pure tones
11.853603603603604,129.93299436056614,PraatF0,Praat (F0),harmonicity,#11A3FF,Pure tones
11.854104104104104,129.93598262795655,PraatF0,Praat (F0),harmonicity,#11A3FF,Pure tones
11.854604604604605,129.93900390777208,PraatF0,Praat (F0),harmonicity,#11A3FF,Pure tones
11.855105105105105,129.94199432019025,PraatF0,Praat (F0),harmonicity,#11A3FF,Pure tones
11.855605605605605,129.94499149109765,PraatF0,Praat (F0),harmonicity,#11A3FF,Pure tones
11.856106106106106,129.9479790079635,PraatF0,Praat (F0),harmonicity,#11A3FF,Pure tones
11.856606606606606,129.9509715489864,PraatF0,Praat (F0),harmonicity,#11A3FF,Pure tones
11.857107107107106,129.95395958977133,PraatF0,Praat (F0),harmonicity,#11A3FF,Pure tones
11.857607607607608,129.95695498478472,PraatF0,Praat (F0),harmonicity,#11A3FF,Pure tones
11.858108108108109,129.95994532296857,PraatF0,Praat (F0),harmonicity,#11A3FF,Pure tones
11.858608608608609,129.96293930866017,PraatF0,Praat (F0),harmonicity,#11A3FF,Pure tones
11.85910910910911,129.96596438427093,PraatF0,Praat (F0),harmonicity,#11A3FF,Pure tones
11.85960960960961,129.96895798458394,PraatF0,Praat (F0),harmonicity,#11A3FF,Pure tones
11.86011011011011,129.9719456664379,PraatF0,Praat (F0),harmonicity,#11A3FF,Pure tones
11.86061061061061,129.9749371291652,PraatF0,Praat (F0),harmonicity,#11A3FF,Pure tones
11.86111111111111,129.97792905002015,PraatF0,Praat (F0),harmonicity,#11A3FF,Pure tones
11.861611611611611,129.98089757440792,PraatF0,Praat (F0),harmonicity,#11A3FF,Pure tones
11.862112112112111,129.98388730012158,PraatF0,Praat (F0),harmonicity,#11A3FF,Pure tones
11.862612612612613,129.98688128870793,PraatF0,Praat (F0),harmonicity,#11A3FF,Pure tones
11.863113113113114,129.98987148220215,PraatF0,Praat (F0),harmonicity,#11A3FF,Pure tones
11.863613613613614,129.99286514421803,PraatF0,Praat (F0),harmonicity,#11A3FF,Pure tones
11.864114114114114,129.99585279060403,PraatF0,Praat (F0),harmonicity,#11A3FF,Pure tones
11.864614614614615,129.99884692129876,PraatF0,Praat (F0),harmonicity,#11A3FF,Pure tones
11.865115115115115,130.00183580335036,PraatF0,Praat (F0),harmonicity,#11A3FF,Pure tones
11.865615615615615,130.00482902022554,PraatF0,Praat (F0),harmonicity,#11A3FF,Pure tones
11.866116116116116,130.00781799711058,PraatF0,Praat (F0),harmonicity,#11A3FF,Pure tones
11.866616616616616,130.01078250178233,PraatF0,Praat (F0),harmonicity,#11A3FF,Pure tones
11.867117117117116,130.0137735803189,PraatF0,Praat (F0),harmonicity,#11A3FF,Pure tones
11.867617617617618,130.01676981257813,PraatF0,Praat (F0),harmonicity,#11A3FF,Pure tones
11.868118118118119,130.01972958358914,PraatF0,Praat (F0),harmonicity,#11A3FF,Pure tones
11.868618618618619,130.02272606759811,PraatF0,Praat (F0),harmonicity,#11A3FF,Pure tones
11.86911911911912,130.02570925354883,PraatF0,Praat (F0),harmonicity,#11A3FF,Pure tones
11.86961961961962,130.02870384747422,PraatF0,Praat (F0),harmonicity,#11A3FF,Pure tones
11.87012012012012,130.03166402284376,PraatF0,Praat (F0),harmonicity,#11A3FF,Pure tones
11.87062062062062,130.03465459118988,PraatF0,Praat (F0),harmonicity,#11A3FF,Pure tones
11.87112112112112,130.0376412526805,PraatF0,Praat (F0),harmonicity,#11A3FF,Pure tones
11.871621621621621,130.0406133922712,PraatF0,Praat (F0),harmonicity,#11A3FF,Pure tones
11.872122122122121,130.04359150535484,PraatF0,Praat (F0),harmonicity,#11A3FF,Pure tones
11.872622622622623,130.0465734252594,PraatF0,Praat (F0),harmonicity,#11A3FF,Pure tones
11.873123123123124,130.04954894111444,PraatF0,Praat (F0),harmonicity,#11A3FF,Pure tones
11.873623623623624,130.05252974063924,PraatF0,Praat (F0),harmonicity,#11A3FF,Pure tones
11.874124124124124,130.0555030816604,PraatF0,Praat (F0),harmonicity,#11A3FF,Pure tones
11.874624624624625,130.05848702814853,PraatF0,Praat (F0),harmonicity,#11A3FF,Pure tones
11.875125125125125,130.06146709405206,PraatF0,Praat (F0),harmonicity,#11A3FF,Pure tones
11.875625625625625,130.06442522807512,PraatF0,Praat (F0),harmonicity,#11A3FF,Pure tones
11.876126126126126,130.06740621275827,PraatF0,Praat (F0),harmonicity,#11A3FF,Pure tones
11.876626626626626,130.07038505800625,PraatF0,Praat (F0),harmonicity,#11A3FF,Pure tones
11.877127127127126,130.0733616614496,PraatF0,Praat (F0),harmonicity,#11A3FF,Pure tones
11.877627627627628,130.07633986172692,PraatF0,Praat (F0),harmonicity,#11A3FF,Pure tones
11.878128128128129,130.07931219392827,PraatF0,Praat (F0),harmonicity,#11A3FF,Pure tones
11.87862862862863,130.08229250172081,PraatF0,Praat (F0),harmonicity,#11A3FF,Pure tones
11.87912912912913,130.08523771445783,PraatF0,Praat (F0),harmonicity,#11A3FF,Pure tones
11.87962962962963,130.08900414561856,PraatF0,Praat (F0),harmonicity,#11A3FF,Pure tones
11.88013013013013,130.0919783608365,PraatF0,Praat (F0),harmonicity,#11A3FF,Pure tones
11.88063063063063,130.09492908533394,PraatF0,Praat (F0),harmonicity,#11A3FF,Pure tones
11.88113113113113,130.09790405861304,PraatF0,Praat (F0),harmonicity,#11A3FF,Pure tones
11.881631631631631,130.10088259636888,PraatF0,Praat (F0),harmonicity,#11A3FF,Pure tones
11.882132132132131,130.10386008467324,PraatF0,Praat (F0),harmonicity,#11A3FF,Pure tones
11.882632632632633,130.10684023657728,PraatF0,Praat (F0),harmonicity,#11A3FF,Pure tones
11.883133133133134,130.10981691575603,PraatF0,Praat (F0),harmonicity,#11A3FF,Pure tones
11.883633633633634,130.11279627384732,PraatF0,Praat (F0),harmonicity,#11A3FF,Pure tones
11.884134134134134,130.1157701533981,PraatF0,Praat (F0),harmonicity,#11A3FF,Pure tones
11.884634634634635,130.11875150199108,PraatF0,Praat (F0),harmonicity,#11A3FF,Pure tones
11.885135135135135,130.12172916063201,PraatF0,Praat (F0),harmonicity,#11A3FF,Pure tones
11.885635635635635,130.12471215242144,PraatF0,Praat (F0),harmonicity,#11A3FF,Pure tones
11.886136136136136,130.12768796980214,PraatF0,Praat (F0),harmonicity,#11A3FF,Pure tones
11.886636636636636,130.1306727855361,PraatF0,Praat (F0),harmonicity,#11A3FF,Pure tones
11.887137137137136,130.13365359412614,PraatF0,Praat (F0),harmonicity,#11A3FF,Pure tones
11.887637637637638,130.13663759457836,PraatF0,Praat (F0),harmonicity,#11A3FF,Pure tones
11.888138138138139,130.13960987059045,PraatF0,Praat (F0),harmonicity,#11A3FF,Pure tones
11.88863863863864,130.14260355856328,PraatF0,Praat (F0),harmonicity,#11A3FF,Pure tones
11.88913913913914,130.14558584232464,PraatF0,Praat (F0),harmonicity,#11A3FF,Pure tones
11.88963963963964,130.14855692287628,PraatF0,Praat (F0),harmonicity,#11A3FF,Pure tones
11.89014014014014,130.15155399508293,PraatF0,Praat (F0),harmonicity,#11A3FF,Pure tones
11.89064064064064,130.1545547990242,PraatF0,Praat (F0),harmonicity,#11A3FF,Pure tones
11.89114114114114,130.15754837794123,PraatF0,Praat (F0),harmonicity,#11A3FF,Pure tones
11.891641641641641,130.1605523020027,PraatF0,Praat (F0),harmonicity,#11A3FF,Pure tones
11.892142142142141,130.1634907380354,PraatF0,Praat (F0),harmonicity,#11A3FF,Pure tones
11.892642642642643,130.16651726847948,PraatF0,Praat (F0),harmonicity,#11A3FF,Pure tones
11.893143143143144,130.16948268411704,PraatF0,Praat (F0),harmonicity,#11A3FF,Pure tones
11.893643643643644,130.1724832638196,PraatF0,Praat (F0),harmonicity,#11A3FF,Pure tones
11.894144144144144,130.1754779714155,PraatF0,Praat (F0),harmonicity,#11A3FF,Pure tones
11.894644644644645,130.17847743912182,PraatF0,Praat (F0),harmonicity,#11A3FF,Pure tones
11.895145145145145,130.18147286961505,PraatF0,Praat (F0),harmonicity,#11A3FF,Pure tones
11.895645645645645,130.18447566677247,PraatF0,Praat (F0),harmonicity,#11A3FF,Pure tones
11.896146146146146,130.1874717301306,PraatF0,Praat (F0),harmonicity,#11A3FF,Pure tones
11.896646646646646,130.19047422511142,PraatF0,Praat (F0),harmonicity,#11A3FF,Pure tones
11.897147147147146,130.19344507320992,PraatF0,Praat (F0),harmonicity,#11A3FF,Pure tones
11.897647647647648,130.19644913613268,PraatF0,Praat (F0),harmonicity,#11A3FF,Pure tones
11.898148148148149,130.1994482567188,PraatF0,Praat (F0),harmonicity,#11A3FF,Pure tones
11.89864864864865,130.202452775538,PraatF0,Praat (F0),harmonicity,#11A3FF,Pure tones
11.89914914914915,130.20545333678297,PraatF0,Praat (F0),harmonicity,#11A3FF,Pure tones
11.89964964964965,130.2084573614051,PraatF0,Praat (F0),harmonicity,#11A3FF,Pure tones
11.90015015015015,130.21145818872873,PraatF0,Praat (F0),harmonicity,#11A3FF,Pure tones
11.90065065065065,130.2144632787998,PraatF0,Praat (F0),harmonicity,#11A3FF,Pure tones
11.90115115115115,130.21746451205115,PraatF0,Praat (F0),harmonicity,#11A3FF,Pure tones
11.901651651651651,130.22045284212868,PraatF0,Praat (F0),harmonicity,#11A3FF,Pure tones
11.902152152152151,130.2234982649701,PraatF0,Praat (F0),harmonicity,#11A3FF,Pure tones
11.902652652652653,130.22650059081582,PraatF0,Praat (F0),harmonicity,#11A3FF,Pure tones
11.903153153153154,130.22949889894716,PraatF0,Praat (F0),harmonicity,#11A3FF,Pure tones
11.903653653653654,130.2325000291397,PraatF0,Praat (F0),harmonicity,#11A3FF,Pure tones
11.904154154154154,130.235500206499,PraatF0,Praat (F0),harmonicity,#11A3FF,Pure tones
11.904654654654655,130.23850474464757,PraatF0,Praat (F0),harmonicity,#11A3FF,Pure tones
11.905155155155155,130.24152913430308,PraatF0,Praat (F0),harmonicity,#11A3FF,Pure tones
11.905655655655655,130.24453428335212,PraatF0,Praat (F0),harmonicity,#11A3FF,Pure tones
11.906156156156156,130.2475344310585,PraatF0,Praat (F0),harmonicity,#11A3FF,Pure tones
11.906656656656656,130.25053556518571,PraatF0,Praat (F0),harmonicity,#11A3FF,Pure tones
11.907157157157156,130.25357614400207,PraatF0,Praat (F0),harmonicity,#11A3FF,Pure tones
11.907657657657658,130.2565888885877,PraatF0,Praat (F0),harmonicity,#11A3FF,Pure tones
11.908158158158159,130.259594481948,PraatF0,Praat (F0),harmonicity,#11A3FF,Pure tones
11.90865865865866,130.26260632497429,PraatF0,Praat (F0),harmonicity,#11A3FF,Pure tones
11.90915915915916,130.2656140607241,PraatF0,Praat (F0),harmonicity,#11A3FF,Pure tones
11.90965965965966,130.2686278893279,PraatF0,Praat (F0),harmonicity,#11A3FF,Pure tones
11.91016016016016,130.27163458567446,PraatF0,Praat (F0),harmonicity,#11A3FF,Pure tones
11.91066066066066,130.2746465145612,PraatF0,Praat (F0),harmonicity,#11A3FF,Pure tones
11.91116116116116,130.27765378516597,PraatF0,Praat (F0),harmonicity,#11A3FF,Pure tones
11.911661661661661,130.28066323531175,PraatF0,Praat (F0),harmonicity,#11A3FF,Pure tones
11.912162162162161,130.283669245123,PraatF0,Praat (F0),harmonicity,#11A3FF,Pure tones
11.912662662662663,130.28668355588724,PraatF0,Praat (F0),harmonicity,#11A3FF,Pure tones
11.913163163163164,130.28969220163862,PraatF0,Praat (F0),harmonicity,#11A3FF,Pure tones
11.913663663663664,130.29270664904175,PraatF0,Praat (F0),harmonicity,#11A3FF,Pure tones
11.914164164164164,130.29571558115387,PraatF0,Praat (F0),harmonicity,#11A3FF,Pure tones
11.914664664664665,130.29872955515543,PraatF0,Praat (F0),harmonicity,#11A3FF,Pure tones
11.915165165165165,130.30173712693687,PraatF0,Praat (F0),harmonicity,#11A3FF,Pure tones
11.915665665665665,130.3047525452297,PraatF0,Praat (F0),harmonicity,#11A3FF,Pure tones
11.916166166166166,130.3077585897774,PraatF0,Praat (F0),harmonicity,#11A3FF,Pure tones
11.916666666666666,130.31079924720697,PraatF0,Praat (F0),harmonicity,#11A3FF,Pure tones
11.917167167167166,130.31380207693246,PraatF0,Praat (F0),harmonicity,#11A3FF,Pure tones
11.917667667667668,130.31680954194854,PraatF0,Praat (F0),harmonicity,#11A3FF,Pure tones
11.918168168168169,130.31981342871245,PraatF0,Praat (F0),harmonicity,#11A3FF,Pure tones
11.91866866866867,130.32284975351934,PraatF0,Praat (F0),harmonicity,#11A3FF,Pure tones
11.91916916916917,130.3258520052412,PraatF0,Praat (F0),harmonicity,#11A3FF,Pure tones
11.91966966966967,130.32886122850942,PraatF0,Praat (F0),harmonicity,#11A3FF,Pure tones
11.92017017017017,130.33186358809132,PraatF0,Praat (F0),harmonicity,#11A3FF,Pure tones
11.92067067067067,130.33487247961017,PraatF0,Praat (F0),harmonicity,#11A3FF,Pure tones
11.92117117117117,130.33787462500385,PraatF0,Praat (F0),harmonicity,#11A3FF,Pure tones
11.921671671671671,130.340884400185,PraatF0,Praat (F0),harmonicity,#11A3FF,Pure tones
11.922172172172171,130.3438857751677,PraatF0,Praat (F0),harmonicity,#11A3FF,Pure tones
11.922672672672673,130.34693773331713,PraatF0,Praat (F0),harmonicity,#11A3FF,Pure tones
11.923173173173174,130.3499393704459,PraatF0,Praat (F0),harmonicity,#11A3FF,Pure tones
11.923673673673674,130.35294810742266,PraatF0,Praat (F0),harmonicity,#11A3FF,Pure tones
11.924174174174174,130.3559493952228,PraatF0,Praat (F0),harmonicity,#11A3FF,Pure tones
11.924674674674675,130.3589573554559,PraatF0,Praat (F0),harmonicity,#11A3FF,Pure tones
11.925175175175175,130.36196249751038,PraatF0,Praat (F0),harmonicity,#11A3FF,Pure tones
11.925675675675675,130.36494399399143,PraatF0,Praat (F0),harmonicity,#11A3FF,Pure tones
11.926176176176176,130.36794847126376,PraatF0,Praat (F0),harmonicity,#11A3FF,Pure tones
11.926676676676676,130.3709588495393,PraatF0,Praat (F0),harmonicity,#11A3FF,Pure tones
11.927177177177176,130.3739639948165,PraatF0,Praat (F0),harmonicity,#11A3FF,Pure tones
11.927677677677679,130.37697197962547,PraatF0,Praat (F0),harmonicity,#11A3FF,Pure tones
11.928178178178179,130.37997655222355,PraatF0,Praat (F0),harmonicity,#11A3FF,Pure tones
11.92867867867868,130.38298428502264,PraatF0,Praat (F0),harmonicity,#11A3FF,Pure tones
11.92917917917918,130.38598803022433,PraatF0,Praat (F0),harmonicity,#11A3FF,Pure tones
11.92967967967968,130.38899654939104,PraatF0,Praat (F0),harmonicity,#11A3FF,Pure tones
11.93018018018018,130.39199733226394,PraatF0,Praat (F0),harmonicity,#11A3FF,Pure tones
11.93068068068068,130.39497272667217,PraatF0,Praat (F0),harmonicity,#11A3FF,Pure tones
11.93118118118118,130.3979751386205,PraatF0,Praat (F0),harmonicity,#11A3FF,Pure tones
11.931681681681681,130.40098503808318,PraatF0,Praat (F0),harmonicity,#11A3FF,Pure tones
11.932182182182181,130.40398929712495,PraatF0,Praat (F0),harmonicity,#11A3FF,Pure tones
11.932682682682684,130.406970112077,PraatF0,Praat (F0),harmonicity,#11A3FF,Pure tones
11.933183183183184,130.40997119052324,PraatF0,Praat (F0),harmonicity,#11A3FF,Pure tones
11.933683683683684,130.4129783636804,PraatF0,Praat (F0),harmonicity,#11A3FF,Pure tones
11.934184184184184,130.4159802009907,PraatF0,Praat (F0),harmonicity,#11A3FF,Pure tones
11.934684684684685,130.41896964038594,PraatF0,Praat (F0),harmonicity,#11A3FF,Pure tones
11.935185185185185,130.42196084421408,PraatF0,Praat (F0),harmonicity,#11A3FF,Pure tones
11.935685685685685,130.42496743135587,PraatF0,Praat (F0),harmonicity,#11A3FF,Pure tones
11.936186186186186,130.4279482226395,PraatF0,Praat (F0),harmonicity,#11A3FF,Pure tones
11.936686686686686,130.43094559805044,PraatF0,Praat (F0),harmonicity,#11A3FF,Pure tones
11.937187187187186,130.43393479528842,PraatF0,Praat (F0),harmonicity,#11A3FF,Pure tones
11.937687687687689,130.436930027344,PraatF0,Praat (F0),harmonicity,#11A3FF,Pure tones
11.938188188188189,130.4399185790378,PraatF0,Praat (F0),harmonicity,#11A3FF,Pure tones
11.93868868868869,130.44291278811403,PraatF0,Praat (F0),harmonicity,#11A3FF,Pure tones
11.93918918918919,130.44590522009173,PraatF0,Praat (F0),harmonicity,#11A3FF,Pure tones
11.93968968968969,130.448907641725,PraatF0,Praat (F0),harmonicity,#11A3FF,Pure tones
11.94019019019019,130.45189266982476,PraatF0,Praat (F0),harmonicity,#11A3FF,Pure tones
11.94069069069069,130.45487457681617,PraatF0,Praat (F0),harmonicity,#11A3FF,Pure tones
11.94119119119119,130.45786495550772,PraatF0,Praat (F0),harmonicity,#11A3FF,Pure tones
11.941691691691691,130.460860147603,PraatF0,Praat (F0),harmonicity,#11A3FF,Pure tones
11.942192192192191,130.46384762664303,PraatF0,Praat (F0),harmonicity,#11A3FF,Pure tones
11.942692692692694,130.46684109547843,PraatF0,Praat (F0),harmonicity,#11A3FF,Pure tones
11.943193193193194,130.46980130885237,PraatF0,Praat (F0),harmonicity,#11A3FF,Pure tones
11.943693693693694,130.47279379708854,PraatF0,Praat (F0),harmonicity,#11A3FF,Pure tones
11.944194194194194,130.47657203736995,PraatF0,Praat (F0),harmonicity,#11A3FF,Pure tones
11.944694694694695,130.47953679600104,PraatF0,Praat (F0),harmonicity,#11A3FF,Pure tones
11.945195195195195,130.48252664953583,PraatF0,Praat (F0),harmonicity,#11A3FF,Pure tones
11.945695695695695,130.4855214438415,PraatF0,Praat (F0),harmonicity,#11A3FF,Pure tones
11.946196196196196,130.48851192795007,PraatF0,Praat (F0),harmonicity,#11A3FF,Pure tones
11.946696696696696,130.49150685348786,PraatF0,Praat (F0),harmonicity,#11A3FF,Pure tones
11.947197197197196,130.49449820255683,PraatF0,Praat (F0),harmonicity,#11A3FF,Pure tones
11.947697697697699,130.49749275547813,PraatF0,Praat (F0),harmonicity,#11A3FF,Pure tones
11.948198198198199,130.50048326936303,PraatF0,Praat (F0),harmonicity,#11A3FF,Pure tones
11.9486986986987,130.5034790996017,PraatF0,Praat (F0),harmonicity,#11A3FF,Pure tones
11.9491991991992,130.50646883873515,PraatF0,Praat (F0),harmonicity,#11A3FF,Pure tones
11.9496996996997,130.5094672120224,PraatF0,Praat (F0),harmonicity,#11A3FF,Pure tones
11.9502002002002,130.5124581746595,PraatF0,Praat (F0),harmonicity,#11A3FF,Pure tones
11.9507007007007,130.5154591390126,PraatF0,Praat (F0),harmonicity,#11A3FF,Pure tones
11.9512012012012,130.51845150235346,PraatF0,Praat (F0),harmonicity,#11A3FF,Pure tones
11.951701701701701,130.52145198558657,PraatF0,Praat (F0),harmonicity,#11A3FF,Pure tones
11.952202202202201,130.5244470307789,PraatF0,Praat (F0),harmonicity,#11A3FF,Pure tones
11.952702702702704,130.5274424906353,PraatF0,Praat (F0),harmonicity,#11A3FF,Pure tones
11.953203203203204,130.53044669616827,PraatF0,Praat (F0),harmonicity,#11A3FF,Pure tones
11.953703703703704,130.53345952771033,PraatF0,Praat (F0),harmonicity,#11A3FF,Pure tones
11.954204204204204,130.53643288624136,PraatF0,Praat (F0),harmonicity,#11A3FF,Pure tones
11.954704704704705,130.5394468902508,PraatF0,Praat (F0),harmonicity,#11A3FF,Pure tones
11.955205205205205,130.54245804421606,PraatF0,Praat (F0),harmonicity,#11A3FF,Pure tones
11.955705705705705,130.54547401927846,PraatF0,Praat (F0),harmonicity,#11A3FF,Pure tones
11.956206206206206,130.54848282583873,PraatF0,Praat (F0),harmonicity,#11A3FF,Pure tones
11.956706706706706,130.55145125800846,PraatF0,Praat (F0),harmonicity,#11A3FF,Pure tones
11.957207207207206,130.55446043802962,PraatF0,Praat (F0),harmonicity,#11A3FF,Pure tones
11.957707707707709,130.55747283122705,PraatF0,Praat (F0),harmonicity,#11A3FF,Pure tones
11.958208208208209,130.5604820391396,PraatF0,Praat (F0),harmonicity,#11A3FF,Pure tones
11.95870870870871,130.56349877641406,PraatF0,Praat (F0),harmonicity,#11A3FF,Pure tones
11.95920920920921,130.56650957792834,PraatF0,Praat (F0),harmonicity,#11A3FF,Pure tones
11.95970970970971,130.5695256133365,PraatF0,Praat (F0),harmonicity,#11A3FF,Pure tones
11.96021021021021,130.57253587866597,PraatF0,Praat (F0),harmonicity,#11A3FF,Pure tones
11.96071071071071,130.57555516438413,PraatF0,Praat (F0),harmonicity,#11A3FF,Pure tones
11.96121121121121,130.578566483661,PraatF0,Praat (F0),harmonicity,#11A3FF,Pure tones
11.961711711711711,130.58155838049157,PraatF0,Praat (F0),harmonicity,#11A3FF,Pure tones
11.962212212212211,130.58457118555015,PraatF0,Praat (F0),harmonicity,#11A3FF,Pure tones
11.962712712712714,130.58759014319764,PraatF0,Praat (F0),harmonicity,#11A3FF,Pure tones
11.963213213213214,130.59060426391162,PraatF0,Praat (F0),harmonicity,#11A3FF,Pure tones
11.963713713713714,130.59362625551285,PraatF0,Praat (F0),harmonicity,#11A3FF,Pure tones
11.964214214214214,130.5966407377029,PraatF0,Praat (F0),harmonicity,#11A3FF,Pure tones
11.964714714714715,130.59966370940901,PraatF0,Praat (F0),harmonicity,#11A3FF,Pure tones
11.965215215215215,130.60266192503002,PraatF0,Praat (F0),harmonicity,#11A3FF,Pure tones
11.965715715715715,130.60572661190216,PraatF0,Praat (F0),harmonicity,#11A3FF,Pure tones
11.966216216216216,130.6087392569466,PraatF0,Praat (F0),harmonicity,#11A3FF,Pure tones
11.966716716716716,130.61175880882655,PraatF0,Praat (F0),harmonicity,#11A3FF,Pure tones
11.967217217217216,130.614771598492,PraatF0,Praat (F0),harmonicity,#11A3FF,Pure tones
11.967717717717719,130.61779027837403,PraatF0,Praat (F0),harmonicity,#11A3FF,Pure tones
11.968218218218219,130.6208031292249,PraatF0,Praat (F0),harmonicity,#11A3FF,Pure tones
11.96871871871872,130.62382361826008,PraatF0,Praat (F0),harmonicity,#11A3FF,Pure tones
11.96921921921922,130.62686428258326,PraatF0,Praat (F0),harmonicity,#11A3FF,Pure tones
11.96971971971972,130.62988627505376,PraatF0,Praat (F0),harmonicity,#11A3FF,Pure tones
11.97022022022022,130.63289800256157,PraatF0,Praat (F0),harmonicity,#11A3FF,Pure tones
11.97072072072072,130.63591791114595,PraatF0,Praat (F0),harmonicity,#11A3FF,Pure tones
11.97122122122122,130.6389686292543,PraatF0,Praat (F0),harmonicity,#11A3FF,Pure tones
11.971721721721721,130.64199726996998,PraatF0,Praat (F0),harmonicity,#11A3FF,Pure tones
11.972222222222221,130.64501670616937,PraatF0,Praat (F0),harmonicity,#11A3FF,Pure tones
11.972722722722724,130.64804571646386,PraatF0,Praat (F0),harmonicity,#11A3FF,Pure tones
11.973223223223224,130.65106546020803,PraatF0,Praat (F0),harmonicity,#11A3FF,Pure tones
11.973723723723724,130.6540951729998,PraatF0,Praat (F0),harmonicity,#11A3FF,Pure tones
11.974224224224224,130.6571178076864,PraatF0,Praat (F0),harmonicity,#11A3FF,Pure tones
11.974724724724725,130.66014534125253,PraatF0,Praat (F0),harmonicity,#11A3FF,Pure tones
11.975225225225225,130.66316929987482,PraatF0,Praat (F0),harmonicity,#11A3FF,Pure tones
11.975725725725725,130.66619832967274,PraatF0,Praat (F0),harmonicity,#11A3FF,Pure tones
11.976226226226226,130.66921345800762,PraatF0,Praat (F0),harmonicity,#11A3FF,Pure tones
11.976726726726726,130.67224119563227,PraatF0,Praat (F0),harmonicity,#11A3FF,Pure tones
11.977227227227226,130.67526582147858,PraatF0,Praat (F0),harmonicity,#11A3FF,Pure tones
11.977727727727729,130.67829524024853,PraatF0,Praat (F0),harmonicity,#11A3FF,Pure tones
11.978228228228229,130.68131817402605,PraatF0,Praat (F0),harmonicity,#11A3FF,Pure tones
11.97872872872873,130.6843480132435,PraatF0,Praat (F0),harmonicity,#11A3FF,Pure tones
11.97922922922923,130.68737142656428,PraatF0,Praat (F0),harmonicity,#11A3FF,Pure tones
11.97972972972973,130.69040121350213,PraatF0,Praat (F0),harmonicity,#11A3FF,Pure tones
11.98023023023023,130.69342398511515,PraatF0,Praat (F0),harmonicity,#11A3FF,Pure tones
11.98073073073073,130.69648280673482,PraatF0,Praat (F0),harmonicity,#11A3FF,Pure tones
11.98123123123123,130.69949950343613,PraatF0,Praat (F0),harmonicity,#11A3FF,Pure tones
11.981731731731731,130.70252337139434,PraatF0,Praat (F0),harmonicity,#11A3FF,Pure tones
11.982232232232231,130.70554034965943,PraatF0,Praat (F0),harmonicity,#11A3FF,Pure tones
11.982732732732734,130.70859205254334,PraatF0,Praat (F0),harmonicity,#11A3FF,Pure tones
11.983233233233234,130.71160851337288,PraatF0,Praat (F0),harmonicity,#11A3FF,Pure tones
11.983733733733734,130.7146309128256,PraatF0,Praat (F0),harmonicity,#11A3FF,Pure tones
11.984234234234235,130.71764928450918,PraatF0,Praat (F0),harmonicity,#11A3FF,Pure tones
11.984734734734735,130.72067250317446,PraatF0,Praat (F0),harmonicity,#11A3FF,Pure tones
11.985235235235235,130.7236901304408,PraatF0,Praat (F0),harmonicity,#11A3FF,Pure tones
11.985735735735735,130.72671414030916,PraatF0,Praat (F0),harmonicity,#11A3FF,Pure tones
11.986236236236236,130.7297330876987,PraatF0,Praat (F0),harmonicity,#11A3FF,Pure tones
11.986736736736736,130.73280050730577,PraatF0,Praat (F0),harmonicity,#11A3FF,Pure tones
11.987237237237236,130.73581747117663,PraatF0,Praat (F0),harmonicity,#11A3FF,Pure tones
11.987737737737739,130.73883349665573,PraatF0,Praat (F0),harmonicity,#11A3FF,Pure tones
11.988238238238239,130.74185390983905,PraatF0,Praat (F0),harmonicity,#11A3FF,Pure tones
11.98873873873874,130.74488042456943,PraatF0,Praat (F0),harmonicity,#11A3FF,Pure tones
11.98923923923924,130.74790121391803,PraatF0,Praat (F0),harmonicity,#11A3FF,Pure tones
11.98973973973974,130.75092645341738,PraatF0,Praat (F0),harmonicity,#11A3FF,Pure tones
11.99024024024024,130.75394506769337,PraatF0,Praat (F0),harmonicity,#11A3FF,Pure tones
11.99074074074074,130.75694378406692,PraatF0,Praat (F0),harmonicity,#11A3FF,Pure tones
11.99124124124124,130.75996376147927,PraatF0,Praat (F0),harmonicity,#11A3FF,Pure tones
11.991741741741741,130.76298730785768,PraatF0,Praat (F0),harmonicity,#11A3FF,Pure tones
11.992242242242241,130.7660062306059,PraatF0,Praat (F0),harmonicity,#11A3FF,Pure tones
11.992742742742744,130.76903164696537,PraatF0,Praat (F0),harmonicity,#11A3FF,Pure tones
11.993243243243244,130.7720484695766,PraatF0,Praat (F0),harmonicity,#11A3FF,Pure tones
11.993743743743744,130.77507265306707,PraatF0,Praat (F0),harmonicity,#11A3FF,Pure tones
11.994244244244245,130.77809085417613,PraatF0,Praat (F0),harmonicity,#11A3FF,Pure tones
11.994744744744745,130.78111371615057,PraatF0,Praat (F0),harmonicity,#11A3FF,Pure tones
11.995245245245245,130.7840896710182,PraatF0,Praat (F0),harmonicity,#11A3FF,Pure tones
11.995745745745745,130.78711510019872,PraatF0,Praat (F0),harmonicity,#11A3FF,Pure tones
11.996246246246246,130.79013550650765,PraatF0,Praat (F0),harmonicity,#11A3FF,Pure tones
11.996746746746746,130.79316062437374,PraatF0,Praat (F0),harmonicity,#11A3FF,Pure tones
11.997247247247246,130.79614705535323,PraatF0,Praat (F0),harmonicity,#11A3FF,Pure tones
11.997747747747749,130.79917054815604,PraatF0,Praat (F0),harmonicity,#11A3FF,Pure tones
11.998248248248249,130.8021867319904,PraatF0,Praat (F0),harmonicity,#11A3FF,Pure tones
11.99874874874875,130.80519964766117,PraatF0,Praat (F0),harmonicity,#11A3FF,Pure tones
11.99924924924925,130.8082089048975,PraatF0,Praat (F0),harmonicity,#11A3FF,Pure tones
11.99974974974975,130.8112207719093,PraatF0,Praat (F0),harmonicity,#11A3FF,Pure tones
12.00025025025025,130.8142375962832,PraatF0,Praat (F0),harmonicity,#11A3FF,Pure tones
12.00075075075075,130.8172396040772,PraatF0,Praat (F0),harmonicity,#11A3FF,Pure tones
12.00125125125125,130.82024519631318,PraatF0,Praat (F0),harmonicity,#11A3FF,Pure tones
12.001751751751751,130.82325475602806,PraatF0,Praat (F0),harmonicity,#11A3FF,Pure tones
12.002252252252251,130.82625888737408,PraatF0,Praat (F0),harmonicity,#11A3FF,Pure tones
12.002752752752754,130.82926809337363,PraatF0,Praat (F0),harmonicity,#11A3FF,Pure tones
12.003253253253254,130.83227120371018,PraatF0,Praat (F0),harmonicity,#11A3FF,Pure tones
12.003753753753754,130.83528569353336,PraatF0,Praat (F0),harmonicity,#11A3FF,Pure tones
12.004254254254255,130.83829773067066,PraatF0,Praat (F0),harmonicity,#11A3FF,Pure tones
12.004754754754755,130.84129359208396,PraatF0,Praat (F0),harmonicity,#11A3FF,Pure tones
12.005255255255255,130.84429810166387,PraatF0,Praat (F0),harmonicity,#11A3FF,Pure tones
12.005755755755755,130.84730815269126,PraatF0,Praat (F0),harmonicity,#11A3FF,Pure tones
12.006256256256256,130.8503111510259,PraatF0,Praat (F0),harmonicity,#11A3FF,Pure tones
12.006756756756756,130.85332092191032,PraatF0,Praat (F0),harmonicity,#11A3FF,Pure tones
12.007257257257256,130.8562965247279,PraatF0,Praat (F0),harmonicity,#11A3FF,Pure tones
12.007757757757759,130.85930615871408,PraatF0,Praat (F0),harmonicity,#11A3FF,Pure tones
12.008258258258259,130.86309954588486,PraatF0,Praat (F0),harmonicity,#11A3FF,Pure tones
12.00875875875876,130.86607894253765,PraatF0,Praat (F0),harmonicity,#11A3FF,Pure tones
12.00925925925926,130.8690840568669,PraatF0,Praat (F0),harmonicity,#11A3FF,Pure tones
12.00975975975976,130.87209395112933,PraatF0,Praat (F0),harmonicity,#11A3FF,Pure tones
12.01026026026026,130.87509813407473,PraatF0,Praat (F0),harmonicity,#11A3FF,Pure tones
12.01076076076076,130.87811042922442,PraatF0,Praat (F0),harmonicity,#11A3FF,Pure tones
12.01126126126126,130.8811163897534,PraatF0,Praat (F0),harmonicity,#11A3FF,Pure tones
12.011761761761761,130.88412738836325,PraatF0,Praat (F0),harmonicity,#11A3FF,Pure tones
12.012262262262261,130.88713288830894,PraatF0,Praat (F0),harmonicity,#11A3FF,Pure tones
12.012762762762764,130.89014367312103,PraatF0,Praat (F0),harmonicity,#11A3FF,Pure tones
12.013263263263264,130.8931509462335,PraatF0,Praat (F0),harmonicity,#11A3FF,Pure tones
12.013763763763764,130.89616356796333,PraatF0,Praat (F0),harmonicity,#11A3FF,Pure tones
12.014264264264265,130.8991704650179,PraatF0,Praat (F0),harmonicity,#11A3FF,Pure tones
12.014764764764765,130.90218357245251,PraatF0,Praat (F0),harmonicity,#11A3FF,Pure tones
12.015265265265265,130.905192720225,PraatF0,Praat (F0),harmonicity,#11A3FF,Pure tones
12.015765765765765,130.90820800793307,PraatF0,Praat (F0),harmonicity,#11A3FF,Pure tones
12.016266266266266,130.91121923097438,PraatF0,Praat (F0),harmonicity,#11A3FF,Pure tones
12.016766766766766,130.91423649512998,PraatF0,Praat (F0),harmonicity,#11A3FF,Pure tones
12.017267267267266,130.9172479371654,PraatF0,Praat (F0),harmonicity,#11A3FF,Pure tones
12.017767767767769,130.92026801921696,PraatF0,Praat (F0),harmonicity,#11A3FF,Pure tones
12.018268268268269,130.923291192202,PraatF0,Praat (F0),harmonicity,#11A3FF,Pure tones
12.01876876876877,130.9262862741872,PraatF0,Praat (F0),harmonicity,#11A3FF,Pure tones
12.01926926926927,130.92931109376534,PraatF0,Praat (F0),harmonicity,#11A3FF,Pure tones
12.01976976976977,130.9323441128643,PraatF0,Praat (F0),harmonicity,#11A3FF,Pure tones
12.02027027027027,130.9353691788621,PraatF0,Praat (F0),harmonicity,#11A3FF,Pure tones
12.02077077077077,130.9383617350851,PraatF0,Praat (F0),harmonicity,#11A3FF,Pure tones
12.02127127127127,130.94138407349814,PraatF0,Praat (F0),harmonicity,#11A3FF,Pure tones
12.021771771771771,130.94441496539235,PraatF0,Praat (F0),harmonicity,#11A3FF,Pure tones
12.022272272272271,130.94743994722756,PraatF0,Praat (F0),harmonicity,#11A3FF,Pure tones
12.022772772772774,130.9504705601144,PraatF0,Praat (F0),harmonicity,#11A3FF,Pure tones
12.023273273273274,130.9534963051516,PraatF0,Praat (F0),harmonicity,#11A3FF,Pure tones
12.023773773773774,130.95652930062684,PraatF0,Praat (F0),harmonicity,#11A3FF,Pure tones
12.024274274274275,130.95955614079594,PraatF0,Praat (F0),harmonicity,#11A3FF,Pure tones
12.024774774774775,130.96258839963872,PraatF0,Praat (F0),harmonicity,#11A3FF,Pure tones
12.025275275275275,130.9656162619693,PraatF0,Praat (F0),harmonicity,#11A3FF,Pure tones
12.025775775775776,130.96862165066514,PraatF0,Praat (F0),harmonicity,#11A3FF,Pure tones
12.026276276276276,130.9716500315734,PraatF0,Praat (F0),harmonicity,#11A3FF,Pure tones
12.026776776776776,130.97468527697794,PraatF0,Praat (F0),harmonicity,#11A3FF,Pure tones
12.027277277277276,130.977715767841,PraatF0,Praat (F0),harmonicity,#11A3FF,Pure tones
12.027777777777779,130.98075178088226,PraatF0,Praat (F0),harmonicity,#11A3FF,Pure tones
12.028278278278279,130.98377305895298,PraatF0,Praat (F0),harmonicity,#11A3FF,Pure tones
12.02877877877878,130.98680736466906,PraatF0,Praat (F0),harmonicity,#11A3FF,Pure tones
12.02927927927928,130.98983465204725,PraatF0,Praat (F0),harmonicity,#11A3FF,Pure tones
12.02977977977978,130.9929129715558,PraatF0,Praat (F0),harmonicity,#11A3FF,Pure tones
12.03028028028028,130.995941418684,PraatF0,Praat (F0),harmonicity,#11A3FF,Pure tones
12.03078078078078,130.9989766683571,PraatF0,Praat (F0),harmonicity,#11A3FF,Pure tones
12.03128128128128,131.00200540725425,PraatF0,Praat (F0),harmonicity,#11A3FF,Pure tones
12.031781781781781,131.00504136454703,PraatF0,Praat (F0),harmonicity,#11A3FF,Pure tones
12.032282282282281,131.00806964772474,PraatF0,Praat (F0),harmonicity,#11A3FF,Pure tones
12.032782782782784,131.01110422064886,PraatF0,Praat (F0),harmonicity,#11A3FF,Pure tones
12.033283283283284,131.014163868511,PraatF0,Praat (F0),harmonicity,#11A3FF,Pure tones
12.033783783783784,131.0172007566306,PraatF0,Praat (F0),harmonicity,#11A3FF,Pure tones
12.034284284284285,131.02023150562252,PraatF0,Praat (F0),harmonicity,#11A3FF,Pure tones
12.034784784784785,131.02326505895195,PraatF0,Praat (F0),harmonicity,#11A3FF,Pure tones
12.035285285285285,131.02629630878005,PraatF0,Praat (F0),harmonicity,#11A3FF,Pure tones
12.035785785785786,131.02937089497104,PraatF0,Praat (F0),harmonicity,#11A3FF,Pure tones
12.036286286286286,131.03240825069977,PraatF0,Praat (F0),harmonicity,#11A3FF,Pure tones
12.036786786786786,131.0354500007848,PraatF0,Praat (F0),harmonicity,#11A3FF,Pure tones
12.037287287287286,131.03848855276308,PraatF0,Praat (F0),harmonicity,#11A3FF,Pure tones
12.037787787787789,131.0415341671652,PraatF0,Praat (F0),harmonicity,#11A3FF,Pure tones
12.038288288288289,131.0445704708551,PraatF0,Praat (F0),harmonicity,#11A3FF,Pure tones
12.03878878878879,131.04761598370362,PraatF0,Praat (F0),harmonicity,#11A3FF,Pure tones
12.03928928928929,131.05065388768915,PraatF0,Praat (F0),harmonicity,#11A3FF,Pure tones
12.03978978978979,131.05369927225536,PraatF0,Praat (F0),harmonicity,#11A3FF,Pure tones
12.04029029029029,131.05673006198364,PraatF0,Praat (F0),harmonicity,#11A3FF,Pure tones
12.04079079079079,131.05977456082363,PraatF0,Praat (F0),harmonicity,#11A3FF,Pure tones
12.04129129129129,131.06281525646358,PraatF0,Praat (F0),harmonicity,#11A3FF,Pure tones
12.041791791791791,131.06585936585526,PraatF0,Praat (F0),harmonicity,#11A3FF,Pure tones
12.042292292292291,131.06889815844085,PraatF0,Praat (F0),harmonicity,#11A3FF,Pure tones
12.042792792792794,131.07194379480586,PraatF0,Praat (F0),harmonicity,#11A3FF,Pure tones
12.043293293293294,131.07498288114,PraatF0,Praat (F0),harmonicity,#11A3FF,Pure tones
12.043793793793794,131.07802712049573,PraatF0,Praat (F0),harmonicity,#11A3FF,Pure tones
12.044294294294295,131.08106632467548,PraatF0,Praat (F0),harmonicity,#11A3FF,Pure tones
12.044794794794795,131.08414525540775,PraatF0,Praat (F0),harmonicity,#11A3FF,Pure tones
12.045295295295295,131.08717870355963,PraatF0,Praat (F0),harmonicity,#11A3FF,Pure tones
12.045795795795796,131.09021681339738,PraatF0,Praat (F0),harmonicity,#11A3FF,Pure tones
12.046296296296296,131.09324977257398,PraatF0,Praat (F0),harmonicity,#11A3FF,Pure tones
12.046796796796796,131.09628673758118,PraatF0,Praat (F0),harmonicity,#11A3FF,Pure tones
12.047297297297296,131.09934897073862,PraatF0,Praat (F0),harmonicity,#11A3FF,Pure tones
12.047797797797799,131.10238782670717,PraatF0,Praat (F0),harmonicity,#11A3FF,Pure tones
12.048298298298299,131.10542032571038,PraatF0,Praat (F0),harmonicity,#11A3FF,Pure tones
12.0487987987988,131.10845946629516,PraatF0,Praat (F0),harmonicity,#11A3FF,Pure tones
12.0492992992993,131.111492799527,PraatF0,Praat (F0),harmonicity,#11A3FF,Pure tones
12.0497997997998,131.1145304855109,PraatF0,Praat (F0),harmonicity,#11A3FF,Pure tones
12.0503003003003,131.11761353431493,PraatF0,Praat (F0),harmonicity,#11A3FF,Pure tones
12.0508008008008,131.1206497424912,PraatF0,Praat (F0),harmonicity,#11A3FF,Pure tones
12.0513013013013,131.1236715655084,PraatF0,Praat (F0),harmonicity,#11A3FF,Pure tones
12.051801801801801,131.12671435249425,PraatF0,Praat (F0),harmonicity,#11A3FF,Pure tones
12.052302302302301,131.12975158663156,PraatF0,Praat (F0),harmonicity,#11A3FF,Pure tones
12.052802802802804,131.13279350487198,PraatF0,Praat (F0),harmonicity,#11A3FF,Pure tones
12.053303303303304,131.1358322549599,PraatF0,Praat (F0),harmonicity,#11A3FF,Pure tones
12.053803803803804,131.13887320649462,PraatF0,Praat (F0),harmonicity,#11A3FF,Pure tones
12.054304304304305,131.1419084581555,PraatF0,Praat (F0),harmonicity,#11A3FF,Pure tones
12.054804804804805,131.14492140777543,PraatF0,Praat (F0),harmonicity,#11A3FF,Pure tones
12.055305305305305,131.14795596936148,PraatF0,Praat (F0),harmonicity,#11A3FF,Pure tones
12.055805805805806,131.15099894189956,PraatF0,Praat (F0),harmonicity,#11A3FF,Pure tones
12.056306306306306,131.15403301350597,PraatF0,Praat (F0),harmonicity,#11A3FF,Pure tones
12.056806806806806,131.1570736633401,PraatF0,Praat (F0),harmonicity,#11A3FF,Pure tones
12.057307307307306,131.16010660899371,PraatF0,Praat (F0),harmonicity,#11A3FF,Pure tones
12.057807807807809,131.1631476629983,PraatF0,Praat (F0),harmonicity,#11A3FF,Pure tones
12.058308308308309,131.16618075083477,PraatF0,Praat (F0),harmonicity,#11A3FF,Pure tones
12.05880880880881,131.16922034070777,PraatF0,Praat (F0),harmonicity,#11A3FF,Pure tones
12.05930930930931,131.17225455551522,PraatF0,Praat (F0),harmonicity,#11A3FF,Pure tones
12.05980980980981,131.17524589458372,PraatF0,Praat (F0),harmonicity,#11A3FF,Pure tones
12.06031031031031,131.17828098962224,PraatF0,Praat (F0),harmonicity,#11A3FF,Pure tones
12.06081081081081,131.1813224788657,PraatF0,Praat (F0),harmonicity,#11A3FF,Pure tones
12.06131131131131,131.18435852298808,PraatF0,Praat (F0),harmonicity,#11A3FF,Pure tones
12.061811811811811,131.18740152919827,PraatF0,Praat (F0),harmonicity,#11A3FF,Pure tones
12.062312312312311,131.1903979462416,PraatF0,Praat (F0),harmonicity,#11A3FF,Pure tones
12.062812812812814,131.1934383704924,PraatF0,Praat (F0),harmonicity,#11A3FF,Pure tones
12.063313313313314,131.19646964028206,PraatF0,Praat (F0),harmonicity,#11A3FF,Pure tones
12.063813813813814,131.19949069098357,PraatF0,Praat (F0),harmonicity,#11A3FF,Pure tones
12.064314314314315,131.20251378057463,PraatF0,Praat (F0),harmonicity,#11A3FF,Pure tones
12.064814814814815,131.20555236103837,PraatF0,Praat (F0),harmonicity,#11A3FF,Pure tones
12.065315315315315,131.20856384179194,PraatF0,Praat (F0),harmonicity,#11A3FF,Pure tones
12.065815815815816,131.2115903442059,PraatF0,Praat (F0),harmonicity,#11A3FF,Pure tones
12.066316316316316,131.21461051143012,PraatF0,Praat (F0),harmonicity,#11A3FF,Pure tones
12.066816816816816,131.2176369326496,PraatF0,Praat (F0),harmonicity,#11A3FF,Pure tones
12.067317317317316,131.22065606452975,PraatF0,Praat (F0),harmonicity,#11A3FF,Pure tones
12.067817817817819,131.2236812743351,PraatF0,Praat (F0),harmonicity,#11A3FF,Pure tones
12.068318318318319,131.2267039834042,PraatF0,Praat (F0),harmonicity,#11A3FF,Pure tones
12.06881881881882,131.22972568643323,PraatF0,Praat (F0),harmonicity,#11A3FF,Pure tones
12.06931931931932,131.23274640824485,PraatF0,Praat (F0),harmonicity,#11A3FF,Pure tones
12.06981981981982,131.23577306923033,PraatF0,Praat (F0),harmonicity,#11A3FF,Pure tones
12.07032032032032,131.2387929258904,PraatF0,Praat (F0),harmonicity,#11A3FF,Pure tones
12.07082082082082,131.24181851287682,PraatF0,Praat (F0),harmonicity,#11A3FF,Pure tones
12.07132132132132,131.24481022956763,PraatF0,Praat (F0),harmonicity,#11A3FF,Pure tones
12.071821821821821,131.2478346926316,PraatF0,Praat (F0),harmonicity,#11A3FF,Pure tones
12.072322322322321,131.25164616513774,PraatF0,Praat (F0),harmonicity,#11A3FF,Pure tones
12.072822822822824,131.25467076769192,PraatF0,Praat (F0),harmonicity,#11A3FF,Pure tones
12.073323323323324,131.25766074751925,PraatF0,Praat (F0),harmonicity,#11A3FF,Pure tones
12.073823823823824,131.26068847238201,PraatF0,Praat (F0),harmonicity,#11A3FF,Pure tones
12.074324324324325,131.2637076030819,PraatF0,Praat (F0),harmonicity,#11A3FF,Pure tones
12.074824824824825,131.2667359181739,PraatF0,Praat (F0),harmonicity,#11A3FF,Pure tones
12.075325325325325,131.26975758197267,PraatF0,Praat (F0),harmonicity,#11A3FF,Pure tones
12.075825825825826,131.27278609579875,PraatF0,Praat (F0),harmonicity,#11A3FF,Pure tones
12.076326326326326,131.27580602560204,PraatF0,Praat (F0),harmonicity,#11A3FF,Pure tones
12.076826826826826,131.27883329891287,PraatF0,Praat (F0),harmonicity,#11A3FF,Pure tones
12.077327327327327,131.2818565065449,PraatF0,Praat (F0),harmonicity,#11A3FF,Pure tones
12.077827827827829,131.28488441300664,PraatF0,Praat (F0),harmonicity,#11A3FF,Pure tones
12.078328328328329,131.28790755891418,PraatF0,Praat (F0),harmonicity,#11A3FF,Pure tones
12.07882882882883,131.29093741745675,PraatF0,Praat (F0),harmonicity,#11A3FF,Pure tones
12.07932932932933,131.2939629907172,PraatF0,Praat (F0),harmonicity,#11A3FF,Pure tones
12.07982982982983,131.29699488181151,PraatF0,Praat (F0),harmonicity,#11A3FF,Pure tones
12.08033033033033,131.30002232048196,PraatF0,Praat (F0),harmonicity,#11A3FF,Pure tones
12.08083083083083,131.30305530827724,PraatF0,Praat (F0),harmonicity,#11A3FF,Pure tones
12.08133133133133,131.30608310403363,PraatF0,Praat (F0),harmonicity,#11A3FF,Pure tones
12.081831831831831,131.30911237216338,PraatF0,Praat (F0),harmonicity,#11A3FF,Pure tones
12.082332332332332,131.31214804667178,PraatF0,Praat (F0),harmonicity,#11A3FF,Pure tones
12.082832832832834,131.31518969378493,PraatF0,Praat (F0),harmonicity,#11A3FF,Pure tones
12.083333333333334,131.31822722947535,PraatF0,Praat (F0),harmonicity,#11A3FF,Pure tones
12.083833833833834,131.3212455694885,PraatF0,Praat (F0),harmonicity,#11A3FF,Pure tones
12.084334334334335,131.32428837495564,PraatF0,Praat (F0),harmonicity,#11A3FF,Pure tones
12.084834834834835,131.32733564709588,PraatF0,Praat (F0),harmonicity,#11A3FF,Pure tones
12.085335335335335,131.33034776386006,PraatF0,Praat (F0),harmonicity,#11A3FF,Pure tones
12.085835835835836,131.33339218525208,PraatF0,Praat (F0),harmonicity,#11A3FF,Pure tones
12.086336336336336,131.33643321300144,PraatF0,Praat (F0),harmonicity,#11A3FF,Pure tones
12.086836836836836,131.33947890230803,PraatF0,Praat (F0),harmonicity,#11A3FF,Pure tones
12.087337337337337,131.34252067585206,PraatF0,Praat (F0),harmonicity,#11A3FF,Pure tones
12.087837837837839,131.3455693244818,PraatF0,Praat (F0),harmonicity,#11A3FF,Pure tones
12.088338338338339,131.348611206729,PraatF0,Praat (F0),harmonicity,#11A3FF,Pure tones
12.08883883883884,131.35166161561926,PraatF0,Praat (F0),harmonicity,#11A3FF,Pure tones
12.08933933933934,131.354705382987,PraatF0,Praat (F0),harmonicity,#11A3FF,Pure tones
12.08983983983984,131.35775567910343,PraatF0,Praat (F0),harmonicity,#11A3FF,Pure tones
12.09034034034034,131.36077231513252,PraatF0,Praat (F0),harmonicity,#11A3FF,Pure tones
12.09084084084084,131.3638222868497,PraatF0,Praat (F0),harmonicity,#11A3FF,Pure tones
12.09134134134134,131.36686812411563,PraatF0,Praat (F0),harmonicity,#11A3FF,Pure tones
12.091841841841841,131.36991838719666,PraatF0,Praat (F0),harmonicity,#11A3FF,Pure tones
12.092342342342342,131.37296072432179,PraatF0,Praat (F0),harmonicity,#11A3FF,Pure tones
12.092842842842844,131.3760084807423,PraatF0,Praat (F0),harmonicity,#11A3FF,Pure tones
12.093343343343344,131.37909338006187,PraatF0,Praat (F0),harmonicity,#11A3FF,Pure tones
12.093843843843844,131.38214539786537,PraatF0,Praat (F0),harmonicity,#11A3FF,Pure tones
12.094344344344345,131.38519101038315,PraatF0,Praat (F0),harmonicity,#11A3FF,Pure tones
12.094844844844845,131.38824181579486,PraatF0,Praat (F0),harmonicity,#11A3FF,Pure tones
12.095345345345345,131.39128865632495,PraatF0,Praat (F0),harmonicity,#11A3FF,Pure tones
12.095845845845846,131.39434140887028,PraatF0,Praat (F0),harmonicity,#11A3FF,Pure tones
12.096346346346346,131.39738619684584,PraatF0,Praat (F0),harmonicity,#11A3FF,Pure tones
12.096846846846846,131.40043830617765,PraatF0,Praat (F0),harmonicity,#11A3FF,Pure tones
12.097347347347347,131.40351579304382,PraatF0,Praat (F0),harmonicity,#11A3FF,Pure tones
12.097847847847849,131.40656667410897,PraatF0,Praat (F0),harmonicity,#11A3FF,Pure tones
12.098348348348349,131.40961438060157,PraatF0,Praat (F0),harmonicity,#11A3FF,Pure tones
12.09884884884885,131.41266624148398,PraatF0,Praat (F0),harmonicity,#11A3FF,Pure tones
12.09934934934935,131.41571570348714,PraatF0,Praat (F0),harmonicity,#11A3FF,Pure tones
12.09984984984985,131.41880028853558,PraatF0,Praat (F0),harmonicity,#11A3FF,Pure tones
12.10035035035035,131.42185391882992,PraatF0,Praat (F0),harmonicity,#11A3FF,Pure tones
12.10085085085085,131.42491219407265,PraatF0,Praat (F0),harmonicity,#11A3FF,Pure tones
12.10135135135135,131.42796727024142,PraatF0,Praat (F0),harmonicity,#11A3FF,Pure tones
12.101851851851851,131.43102843702738,PraatF0,Praat (F0),harmonicity,#11A3FF,Pure tones
12.102352352352352,131.43408304050814,PraatF0,Praat (F0),harmonicity,#11A3FF,Pure tones
12.102852852852854,131.4371446741157,PraatF0,Praat (F0),harmonicity,#11A3FF,Pure tones
12.103353353353354,131.440199262267,PraatF0,Praat (F0),harmonicity,#11A3FF,Pure tones
12.103853853853854,131.44326044225267,PraatF0,Praat (F0),harmonicity,#11A3FF,Pure tones
12.104354354354355,131.44630798303444,PraatF0,Praat (F0),harmonicity,#11A3FF,Pure tones
12.104854854854855,131.44936902211612,PraatF0,Praat (F0),harmonicity,#11A3FF,Pure tones
12.105355355355355,131.4524248346379,PraatF0,Praat (F0),harmonicity,#11A3FF,Pure tones
12.105855855855856,131.45548754310636,PraatF0,Praat (F0),harmonicity,#11A3FF,Pure tones
12.106356356356356,131.45854158401698,PraatF0,Praat (F0),harmonicity,#11A3FF,Pure tones
12.106856856856856,131.461601853427,PraatF0,Praat (F0),harmonicity,#11A3FF,Pure tones
12.107357357357357,131.464659473552,PraatF0,Praat (F0),harmonicity,#11A3FF,Pure tones
12.107857857857859,131.46772013004804,PraatF0,Praat (F0),harmonicity,#11A3FF,Pure tones
12.108358358358359,131.47077479416464,PraatF0,Praat (F0),harmonicity,#11A3FF,Pure tones
12.10885885885886,131.47383837488923,PraatF0,Praat (F0),harmonicity,#11A3FF,Pure tones
12.10935935935936,131.47692480639765,PraatF0,Praat (F0),harmonicity,#11A3FF,Pure tones
12.10985985985986,131.47997831686519,PraatF0,Praat (F0),harmonicity,#11A3FF,Pure tones
12.11036036036036,131.48302754433064,PraatF0,Praat (F0),harmonicity,#11A3FF,Pure tones
12.11086086086086,131.48608245737336,PraatF0,Praat (F0),harmonicity,#11A3FF,Pure tones
12.11136136136136,131.48915990426917,PraatF0,Praat (F0),harmonicity,#11A3FF,Pure tones
12.111861861861861,131.49221426581596,PraatF0,Praat (F0),harmonicity,#11A3FF,Pure tones
12.112362362362362,131.49526302807516,PraatF0,Praat (F0),harmonicity,#11A3FF,Pure tones
12.112862862862864,131.49831742470303,PraatF0,Praat (F0),harmonicity,#11A3FF,Pure tones
12.113363363363364,131.50136813166847,PraatF0,Praat (F0),harmonicity,#11A3FF,Pure tones
12.113863863863864,131.50442216498755,PraatF0,Praat (F0),harmonicity,#11A3FF,Pure tones
12.114364364364365,131.5075199015952,PraatF0,Praat (F0),harmonicity,#11A3FF,Pure tones
12.114864864864865,131.51055893623368,PraatF0,Praat (F0),harmonicity,#11A3FF,Pure tones
12.115365365365365,131.5136119668622,PraatF0,Praat (F0),harmonicity,#11A3FF,Pure tones
12.115865865865866,131.51667345586878,PraatF0,Praat (F0),harmonicity,#11A3FF,Pure tones
12.116366366366366,131.5197278892282,PraatF0,Praat (F0),harmonicity,#11A3FF,Pure tones
12.116866866866866,131.52278642376703,PraatF0,Praat (F0),harmonicity,#11A3FF,Pure tones
12.117367367367367,131.52583974526885,PraatF0,Praat (F0),harmonicity,#11A3FF,Pure tones
12.117867867867869,131.52889818891012,PraatF0,Praat (F0),harmonicity,#11A3FF,Pure tones
12.118368368368369,131.53195065629313,PraatF0,Praat (F0),harmonicity,#11A3FF,Pure tones
12.11886886886887,131.5350107625278,PraatF0,Praat (F0),harmonicity,#11A3FF,Pure tones
12.11936936936937,131.5380332902257,PraatF0,Praat (F0),harmonicity,#11A3FF,Pure tones
12.11986986986987,131.54109133208493,PraatF0,Praat (F0),harmonicity,#11A3FF,Pure tones
12.12037037037037,131.5441438319109,PraatF0,Praat (F0),harmonicity,#11A3FF,Pure tones
12.12087087087087,131.5472005846841,PraatF0,Praat (F0),harmonicity,#11A3FF,Pure tones
12.121371371371371,131.5502511199727,PraatF0,Praat (F0),harmonicity,#11A3FF,Pure tones
12.121871871871871,131.55330673824142,PraatF0,Praat (F0),harmonicity,#11A3FF,Pure tones
12.122372372372372,131.55635712384512,PraatF0,Praat (F0),harmonicity,#11A3FF,Pure tones
12.122872872872874,131.5593871438362,PraatF0,Praat (F0),harmonicity,#11A3FF,Pure tones
12.123373373373374,131.56243698481717,PraatF0,Praat (F0),harmonicity,#11A3FF,Pure tones
12.123873873873874,131.56552192039254,PraatF0,Praat (F0),harmonicity,#11A3FF,Pure tones
12.124374374374375,131.56851625566975,PraatF0,Praat (F0),harmonicity,#11A3FF,Pure tones
12.124874874874875,131.5715759602841,PraatF0,Praat (F0),harmonicity,#11A3FF,Pure tones
12.125375375375375,131.57462817211263,PraatF0,Praat (F0),harmonicity,#11A3FF,Pure tones
12.125875875875876,131.57768533239843,PraatF0,Praat (F0),harmonicity,#11A3FF,Pure tones
12.126376376376376,131.58073787471056,PraatF0,Praat (F0),harmonicity,#11A3FF,Pure tones
12.126876876876876,131.5837685407441,PraatF0,Praat (F0),harmonicity,#11A3FF,Pure tones
12.127377377377377,131.58681042146247,PraatF0,Praat (F0),harmonicity,#11A3FF,Pure tones
12.127877877877879,131.58986083827241,PraatF0,Praat (F0),harmonicity,#11A3FF,Pure tones
12.128378378378379,131.59288209666067,PraatF0,Praat (F0),harmonicity,#11A3FF,Pure tones
12.12887887887888,131.5959411872787,PraatF0,Praat (F0),harmonicity,#11A3FF,Pure tones
12.12937937937938,131.59897899199373,PraatF0,Praat (F0),harmonicity,#11A3FF,Pure tones
12.12987987987988,131.60202277224093,PraatF0,Praat (F0),harmonicity,#11A3FF,Pure tones
12.13038038038038,131.60505892522986,PraatF0,Praat (F0),harmonicity,#11A3FF,Pure tones
12.13088088088088,131.60810437844884,PraatF0,Praat (F0),harmonicity,#11A3FF,Pure tones
12.131381381381381,131.61114026178876,PraatF0,Praat (F0),harmonicity,#11A3FF,Pure tones
12.131881881881881,131.61418377708085,PraatF0,Praat (F0),harmonicity,#11A3FF,Pure tones
12.132382382382382,131.61721643269613,PraatF0,Praat (F0),harmonicity,#11A3FF,Pure tones
12.132882882882884,131.62026026578695,PraatF0,Praat (F0),harmonicity,#11A3FF,Pure tones
12.133383383383384,131.62329496889154,PraatF0,Praat (F0),harmonicity,#11A3FF,Pure tones
12.133883883883884,131.62633989547513,PraatF0,Praat (F0),harmonicity,#11A3FF,Pure tones
12.134384384384385,131.62937623118165,PraatF0,Praat (F0),harmonicity,#11A3FF,Pure tones
12.134884884884885,131.63242152131977,PraatF0,Praat (F0),harmonicity,#11A3FF,Pure tones
12.135385385385385,131.63545738246165,PraatF0,Praat (F0),harmonicity,#11A3FF,Pure tones
12.135885885885886,131.6384694891167,PraatF0,Praat (F0),harmonicity,#11A3FF,Pure tones
12.136386386386386,131.64229639170338,PraatF0,Praat (F0),harmonicity,#11A3FF,Pure tones
12.136886886886886,131.64533797382293,PraatF0,Praat (F0),harmonicity,#11A3FF,Pure tones
12.137387387387387,131.64834722158085,PraatF0,Praat (F0),harmonicity,#11A3FF,Pure tones
12.137887887887889,131.65138866243518,PraatF0,Praat (F0),harmonicity,#11A3FF,Pure tones
12.138388388388389,131.65442630976844,PraatF0,Praat (F0),harmonicity,#11A3FF,Pure tones
12.13888888888889,131.65746933149836,PraatF0,Praat (F0),harmonicity,#11A3FF,Pure tones
12.13938938938939,131.66051043723684,PraatF0,Praat (F0),harmonicity,#11A3FF,Pure tones
12.13988988988989,131.6635554100036,PraatF0,Praat (F0),harmonicity,#11A3FF,Pure tones
12.14039039039039,131.66659089826737,PraatF0,Praat (F0),harmonicity,#11A3FF,Pure tones
12.14089089089089,131.66963634809377,PraatF0,Praat (F0),harmonicity,#11A3FF,Pure tones
12.141391391391391,131.672674668198,PraatF0,Praat (F0),harmonicity,#11A3FF,Pure tones
12.141891891891891,131.67572078790454,PraatF0,Praat (F0),harmonicity,#11A3FF,Pure tones
12.142392392392392,131.67876180955744,PraatF0,Praat (F0),harmonicity,#11A3FF,Pure tones
12.142892892892894,131.68180814650412,PraatF0,Praat (F0),harmonicity,#11A3FF,Pure tones
12.143393393393394,131.68484974776044,PraatF0,Praat (F0),harmonicity,#11A3FF,Pure tones
12.143893893893894,131.68789685804563,PraatF0,Praat (F0),harmonicity,#11A3FF,Pure tones
12.144394394394395,131.69094052079038,PraatF0,Praat (F0),harmonicity,#11A3FF,Pure tones
12.144894894894895,131.6939893441908,PraatF0,Praat (F0),harmonicity,#11A3FF,Pure tones
12.145395395395395,131.6970361377227,PraatF0,Praat (F0),harmonicity,#11A3FF,Pure tones
12.145895895895896,131.70008715246695,PraatF0,Praat (F0),harmonicity,#11A3FF,Pure tones
12.146396396396396,131.70314805786745,PraatF0,Praat (F0),harmonicity,#11A3FF,Pure tones
12.146896896896896,131.70618714377423,PraatF0,Praat (F0),harmonicity,#11A3FF,Pure tones
12.147397397397397,131.70923469782542,PraatF0,Praat (F0),harmonicity,#11A3FF,Pure tones
12.147897897897899,131.712297945452,PraatF0,Praat (F0),harmonicity,#11A3FF,Pure tones
12.148398398398399,131.7153286720589,PraatF0,Praat (F0),harmonicity,#11A3FF,Pure tones
12.1488988988989,131.71839468795002,PraatF0,Praat (F0),harmonicity,#11A3FF,Pure tones
12.1493993993994,131.7214525021394,PraatF0,Praat (F0),harmonicity,#11A3FF,Pure tones
12.1498998998999,131.72451801599658,PraatF0,Praat (F0),harmonicity,#11A3FF,Pure tones
12.1504004004004,131.72754937029413,PraatF0,Praat (F0),harmonicity,#11A3FF,Pure tones
12.1509009009009,131.73061490571996,PraatF0,Praat (F0),harmonicity,#11A3FF,Pure tones
12.151401401401401,131.73367267874747,PraatF0,Praat (F0),harmonicity,#11A3FF,Pure tones
12.151901901901901,131.73673735191483,PraatF0,Praat (F0),harmonicity,#11A3FF,Pure tones
12.152402402402402,131.73979685055286,PraatF0,Praat (F0),harmonicity,#11A3FF,Pure tones
12.152902902902904,131.74286309731133,PraatF0,Praat (F0),harmonicity,#11A3FF,Pure tones
12.153403403403404,131.7459228820079,PraatF0,Praat (F0),harmonicity,#11A3FF,Pure tones
12.153903903903904,131.7489881620421,PraatF0,Praat (F0),harmonicity,#11A3FF,Pure tones
12.154404404404405,131.75205169919246,PraatF0,Praat (F0),harmonicity,#11A3FF,Pure tones
12.154904904904905,131.75509177259252,PraatF0,Praat (F0),harmonicity,#11A3FF,Pure tones
12.155405405405405,131.75815497042066,PraatF0,Praat (F0),harmonicity,#11A3FF,Pure tones
12.155905905905906,131.76121898742713,PraatF0,Praat (F0),harmonicity,#11A3FF,Pure tones
12.156406406406406,131.76427805680396,PraatF0,Praat (F0),harmonicity,#11A3FF,Pure tones
12.156906906906906,131.76738176662997,PraatF0,Praat (F0),harmonicity,#11A3FF,Pure tones
12.157407407407407,131.77044353915068,PraatF0,Praat (F0),harmonicity,#11A3FF,Pure tones
12.157907907907909,131.77351392678742,PraatF0,Praat (F0),harmonicity,#11A3FF,Pure tones
12.158408408408409,131.77657706988361,PraatF0,Praat (F0),harmonicity,#11A3FF,Pure tones
12.15890890890891,131.77964427096038,PraatF0,Praat (F0),harmonicity,#11A3FF,Pure tones
12.15940940940941,131.78270876136276,PraatF0,Praat (F0),harmonicity,#11A3FF,Pure tones
12.15990990990991,131.78577744278536,PraatF0,Praat (F0),harmonicity,#11A3FF,Pure tones
12.16041041041041,131.78884232730945,PraatF0,Praat (F0),harmonicity,#11A3FF,Pure tones
12.16091091091091,131.79190809772564,PraatF0,Praat (F0),harmonicity,#11A3FF,Pure tones
12.161411411411411,131.79497737455284,PraatF0,Praat (F0),harmonicity,#11A3FF,Pure tones
12.161911911911911,131.79807648322247,PraatF0,Praat (F0),harmonicity,#11A3FF,Pure tones
12.162412412412412,131.80113867353626,PraatF0,Praat (F0),harmonicity,#11A3FF,Pure tones
12.162912912912914,131.8042100008688,PraatF0,Praat (F0),harmonicity,#11A3FF,Pure tones
12.163413413413414,131.80727383672019,PraatF0,Praat (F0),harmonicity,#11A3FF,Pure tones
12.163913913913914,131.81034756527802,PraatF0,Praat (F0),harmonicity,#11A3FF,Pure tones
12.164414414414415,131.81344415927103,PraatF0,Praat (F0),harmonicity,#11A3FF,Pure tones
12.164914914914915,131.81652001711367,PraatF0,Praat (F0),harmonicity,#11A3FF,Pure tones
12.165415415415415,131.8195931491089,PraatF0,Praat (F0),harmonicity,#11A3FF,Pure tones
12.165915915915916,131.8226696287319,PraatF0,Praat (F0),harmonicity,#11A3FF,Pure tones
12.166416416416416,131.82573853089178,PraatF0,Praat (F0),harmonicity,#11A3FF,Pure tones
12.166916916916916,131.82881879813925,PraatF0,Praat (F0),harmonicity,#11A3FF,Pure tones
12.167417417417417,131.8318904540984,PraatF0,Praat (F0),harmonicity,#11A3FF,Pure tones
12.167917917917919,131.83496993208837,PraatF0,Praat (F0),harmonicity,#11A3FF,Pure tones
12.168418418418419,131.83804316135786,PraatF0,Praat (F0),harmonicity,#11A3FF,Pure tones
12.16891891891892,131.8411137916571,PraatF0,Praat (F0),harmonicity,#11A3FF,Pure tones
12.16941941941942,131.8441846151282,PraatF0,Praat (F0),harmonicity,#11A3FF,Pure tones
12.16991991991992,131.84726351816676,PraatF0,Praat (F0),harmonicity,#11A3FF,Pure tones
12.17042042042042,131.85033512529986,PraatF0,Praat (F0),harmonicity,#11A3FF,Pure tones
12.17092092092092,131.85341557656562,PraatF0,Praat (F0),harmonicity,#11A3FF,Pure tones
12.171421421421421,131.85648639519678,PraatF0,Praat (F0),harmonicity,#11A3FF,Pure tones
12.171921921921921,131.85959463237265,PraatF0,Praat (F0),harmonicity,#11A3FF,Pure tones
12.172422422422422,131.86263829622857,PraatF0,Praat (F0),harmonicity,#11A3FF,Pure tones
12.172922922922924,131.86571717529728,PraatF0,Praat (F0),harmonicity,#11A3FF,Pure tones
12.173423423423424,131.86882945788614,PraatF0,Praat (F0),harmonicity,#11A3FF,Pure tones
12.173923923923924,131.87189997643458,PraatF0,Praat (F0),harmonicity,#11A3FF,Pure tones
12.174424424424425,131.87496457475424,PraatF0,Praat (F0),harmonicity,#11A3FF,Pure tones
12.174924924924925,131.87803754818952,PraatF0,Praat (F0),harmonicity,#11A3FF,Pure tones
12.175425425425425,131.88113008049115,PraatF0,Praat (F0),harmonicity,#11A3FF,Pure tones
12.175925925925926,131.88419970242524,PraatF0,Praat (F0),harmonicity,#11A3FF,Pure tones
12.176426426426426,131.88726613123333,PraatF0,Praat (F0),harmonicity,#11A3FF,Pure tones
12.176926926926926,131.8903383239512,PraatF0,Praat (F0),harmonicity,#11A3FF,Pure tones
12.177427427427427,131.89343387768926,PraatF0,Praat (F0),harmonicity,#11A3FF,Pure tones
12.177927927927929,131.89647386520033,PraatF0,Praat (F0),harmonicity,#11A3FF,Pure tones
12.178428428428429,131.89959242912738,PraatF0,Praat (F0),harmonicity,#11A3FF,Pure tones
12.17892892892893,131.90264704661973,PraatF0,Praat (F0),harmonicity,#11A3FF,Pure tones
12.17942942942943,131.90571867003024,PraatF0,Praat (F0),harmonicity,#11A3FF,Pure tones
12.17992992992993,131.9087959205475,PraatF0,Praat (F0),harmonicity,#11A3FF,Pure tones
12.18043043043043,131.91186971887709,PraatF0,Praat (F0),harmonicity,#11A3FF,Pure tones
12.18093093093093,131.91494477472276,PraatF0,Praat (F0),harmonicity,#11A3FF,Pure tones
12.181431431431431,131.9180150245641,PraatF0,Praat (F0),harmonicity,#11A3FF,Pure tones
12.181931931931931,131.92109109615114,PraatF0,Praat (F0),harmonicity,#11A3FF,Pure tones
12.182432432432432,131.92415968142234,PraatF0,Praat (F0),harmonicity,#11A3FF,Pure tones
12.182932932932934,131.92723787566376,PraatF0,Praat (F0),harmonicity,#11A3FF,Pure tones
12.183433433433434,131.93027749579733,PraatF0,Praat (F0),harmonicity,#11A3FF,Pure tones
12.183933933933934,131.93335513920437,PraatF0,Praat (F0),harmonicity,#11A3FF,Pure tones
12.184434434434435,131.93642464465273,PraatF0,Praat (F0),harmonicity,#11A3FF,Pure tones
12.184934934934935,131.93949872222942,PraatF0,Praat (F0),harmonicity,#11A3FF,Pure tones
12.185435435435435,131.94256731449735,PraatF0,Praat (F0),harmonicity,#11A3FF,Pure tones
12.185935935935936,131.94564042391838,PraatF0,Praat (F0),harmonicity,#11A3FF,Pure tones
12.186436436436436,131.94871245989475,PraatF0,Praat (F0),harmonicity,#11A3FF,Pure tones
12.186936936936936,131.95178717353713,PraatF0,Praat (F0),harmonicity,#11A3FF,Pure tones
12.187437437437438,131.9548242801382,PraatF0,Praat (F0),harmonicity,#11A3FF,Pure tones
12.187937937937939,131.95789638407024,PraatF0,Praat (F0),harmonicity,#11A3FF,Pure tones
12.188438438438439,131.96096353987107,PraatF0,Praat (F0),harmonicity,#11A3FF,Pure tones
12.18893893893894,131.96403183513587,PraatF0,Praat (F0),harmonicity,#11A3FF,Pure tones
12.18943943943944,131.96709905194894,PraatF0,Praat (F0),harmonicity,#11A3FF,Pure tones
12.18993993993994,131.9701496501129,PraatF0,Praat (F0),harmonicity,#11A3FF,Pure tones
12.19044044044044,131.9732173043526,PraatF0,Praat (F0),harmonicity,#11A3FF,Pure tones
12.19094094094094,131.97626566453545,PraatF0,Praat (F0),harmonicity,#11A3FF,Pure tones
12.191441441441441,131.97932248564564,PraatF0,Praat (F0),harmonicity,#11A3FF,Pure tones
12.191941941941941,131.98239530236788,PraatF0,Praat (F0),harmonicity,#11A3FF,Pure tones
12.192442442442442,131.98546332772378,PraatF0,Praat (F0),harmonicity,#11A3FF,Pure tones
12.192942942942944,131.988523732159,PraatF0,Praat (F0),harmonicity,#11A3FF,Pure tones
12.193443443443444,131.9915784310171,PraatF0,Praat (F0),harmonicity,#11A3FF,Pure tones
12.193943943943944,131.99464073758799,PraatF0,Praat (F0),harmonicity,#11A3FF,Pure tones
12.194444444444445,131.997695370673,PraatF0,Praat (F0),harmonicity,#11A3FF,Pure tones
12.194944944944945,132.000756929714,PraatF0,Praat (F0),harmonicity,#11A3FF,Pure tones
12.195445445445445,132.0038097905604,PraatF0,Praat (F0),harmonicity,#11A3FF,Pure tones
12.195945945945946,132.0068702215234,PraatF0,Praat (F0),harmonicity,#11A3FF,Pure tones
12.196446446446446,132.00992280490118,PraatF0,Praat (F0),harmonicity,#11A3FF,Pure tones
12.196946946946946,132.0129837054193,PraatF0,Praat (F0),harmonicity,#11A3FF,Pure tones
12.197447447447448,132.01603833661716,PraatF0,Praat (F0),harmonicity,#11A3FF,Pure tones
12.197947947947949,132.01909916182166,PraatF0,Praat (F0),harmonicity,#11A3FF,Pure tones
12.198448448448449,132.02215405057464,PraatF0,Praat (F0),harmonicity,#11A3FF,Pure tones
12.19894894894895,132.02521141708812,PraatF0,Praat (F0),harmonicity,#11A3FF,Pure tones
12.19944944944945,132.02826660592208,PraatF0,Praat (F0),harmonicity,#11A3FF,Pure tones
12.19994994994995,132.03129921847216,PraatF0,Praat (F0),harmonicity,#11A3FF,Pure tones
12.20045045045045,132.0343532404191,PraatF0,Praat (F0),harmonicity,#11A3FF,Pure tones
12.20095095095095,132.03820263373927,PraatF0,Praat (F0),harmonicity,#11A3FF,Pure tones
12.201451451451451,132.04123100052743,PraatF0,Praat (F0),harmonicity,#11A3FF,Pure tones
12.201951951951951,132.04428874200215,PraatF0,Praat (F0),harmonicity,#11A3FF,Pure tones
12.202452452452452,132.04734309267275,PraatF0,Praat (F0),harmonicity,#11A3FF,Pure tones
12.202952952952954,132.0504021501876,PraatF0,Praat (F0),harmonicity,#11A3FF,Pure tones
12.203453453453454,132.053460401902,PraatF0,Praat (F0),harmonicity,#11A3FF,Pure tones
12.203953953953954,132.05652370623528,PraatF0,Praat (F0),harmonicity,#11A3FF,Pure tones
12.204454454454455,132.0595802640957,PraatF0,Praat (F0),harmonicity,#11A3FF,Pure tones
12.204954954954955,132.06264086084846,PraatF0,Praat (F0),harmonicity,#11A3FF,Pure tones
12.205455455455455,132.0656957870154,PraatF0,Praat (F0),harmonicity,#11A3FF,Pure tones
12.205955955955956,132.0687600503885,PraatF0,Praat (F0),harmonicity,#11A3FF,Pure tones
12.206456456456456,132.07181566455245,PraatF0,Praat (F0),harmonicity,#11A3FF,Pure tones
12.206956956956956,132.07488084231238,PraatF0,Praat (F0),harmonicity,#11A3FF,Pure tones
12.207457457457458,132.0779371087035,PraatF0,Praat (F0),harmonicity,#11A3FF,Pure tones
12.207957957957959,132.0810045760927,PraatF0,Praat (F0),harmonicity,#11A3FF,Pure tones
12.208458458458459,132.08406564537773,PraatF0,Praat (F0),harmonicity,#11A3FF,Pure tones
12.20895895895896,132.08713276507808,PraatF0,Praat (F0),harmonicity,#11A3FF,Pure tones
12.20945945945946,132.09019191356754,PraatF0,Praat (F0),harmonicity,#11A3FF,Pure tones
12.20995995995996,132.09326151821608,PraatF0,Praat (F0),harmonicity,#11A3FF,Pure tones
12.21046046046046,132.09632536696174,PraatF0,Praat (F0),harmonicity,#11A3FF,Pure tones
12.21096096096096,132.09940904566628,PraatF0,Praat (F0),harmonicity,#11A3FF,Pure tones
12.211461461461461,132.10244915493536,PraatF0,Praat (F0),harmonicity,#11A3FF,Pure tones
12.211961961961961,132.10553225860355,PraatF0,Praat (F0),harmonicity,#11A3FF,Pure tones
12.212462462462462,132.10860936603598,PraatF0,Praat (F0),harmonicity,#11A3FF,Pure tones
12.212962962962964,132.1116602155467,PraatF0,Praat (F0),harmonicity,#11A3FF,Pure tones
12.213463463463464,132.11473927199754,PraatF0,Praat (F0),harmonicity,#11A3FF,Pure tones
12.213963963963964,132.11782103950083,PraatF0,Praat (F0),harmonicity,#11A3FF,Pure tones
12.214464464464465,132.120897776069,PraatF0,Praat (F0),harmonicity,#11A3FF,Pure tones
12.214964964964965,132.12398246539516,PraatF0,Praat (F0),harmonicity,#11A3FF,Pure tones
12.215465465465465,132.1270284514623,PraatF0,Praat (F0),harmonicity,#11A3FF,Pure tones
12.215965965965966,132.1301168520491,PraatF0,Praat (F0),harmonicity,#11A3FF,Pure tones
12.216466466466466,132.13319113633105,PraatF0,Praat (F0),harmonicity,#11A3FF,Pure tones
12.216966966966966,132.13627545798246,PraatF0,Praat (F0),harmonicity,#11A3FF,Pure tones
12.217467467467468,132.13935516701866,PraatF0,Praat (F0),harmonicity,#11A3FF,Pure tones
12.217967967967969,132.1424413507885,PraatF0,Praat (F0),harmonicity,#11A3FF,Pure tones
12.218468468468469,132.14551860012935,PraatF0,Praat (F0),harmonicity,#11A3FF,Pure tones
12.21896896896897,132.14860407968553,PraatF0,Praat (F0),harmonicity,#11A3FF,Pure tones
12.21946946946947,132.15168343782952,PraatF0,Praat (F0),harmonicity,#11A3FF,Pure tones
12.21996996996997,132.1547696632367,PraatF0,Praat (F0),harmonicity,#11A3FF,Pure tones
12.22047047047047,132.1578504549076,PraatF0,Praat (F0),harmonicity,#11A3FF,Pure tones
12.22097097097097,132.1609341076392,PraatF0,Praat (F0),harmonicity,#11A3FF,Pure tones
12.221471471471471,132.1640142504528,PraatF0,Praat (F0),harmonicity,#11A3FF,Pure tones
12.221971971971971,132.16710271566023,PraatF0,Praat (F0),harmonicity,#11A3FF,Pure tones
12.222472472472472,132.17018165130293,PraatF0,Praat (F0),harmonicity,#11A3FF,Pure tones
12.222972972972974,132.17326972638202,PraatF0,Praat (F0),harmonicity,#11A3FF,Pure tones
12.223473473473474,132.17635001797845,PraatF0,Praat (F0),harmonicity,#11A3FF,Pure tones
12.223973973973974,132.1794381166386,PraatF0,Praat (F0),harmonicity,#11A3FF,Pure tones
12.224474474474475,132.18252030239464,PraatF0,Praat (F0),harmonicity,#11A3FF,Pure tones
12.224974974974975,132.18560571836727,PraatF0,Praat (F0),harmonicity,#11A3FF,Pure tones
12.225475475475475,132.18869190754646,PraatF0,Praat (F0),harmonicity,#11A3FF,Pure tones
12.225975975975976,132.19180739581577,PraatF0,Praat (F0),harmonicity,#11A3FF,Pure tones
12.226476476476476,132.19489289376136,PraatF0,Praat (F0),harmonicity,#11A3FF,Pure tones
12.226976976976976,132.1979795336116,PraatF0,Praat (F0),harmonicity,#11A3FF,Pure tones
12.227477477477478,132.20106530907321,PraatF0,Praat (F0),harmonicity,#11A3FF,Pure tones
12.227977977977979,132.20415422164078,PraatF0,Praat (F0),harmonicity,#11A3FF,Pure tones
12.228478478478479,132.20723888076523,PraatF0,Praat (F0),harmonicity,#11A3FF,Pure tones
12.22897897897898,132.21035868696634,PraatF0,Praat (F0),harmonicity,#11A3FF,Pure tones
12.22947947947948,132.21344672454512,PraatF0,Praat (F0),harmonicity,#11A3FF,Pure tones
12.22997997997998,132.2165432205588,PraatF0,Praat (F0),harmonicity,#11A3FF,Pure tones
12.23048048048048,132.21963414541236,PraatF0,Praat (F0),harmonicity,#11A3FF,Pure tones
12.23098098098098,132.22272867215284,PraatF0,Praat (F0),harmonicity,#11A3FF,Pure tones
12.231481481481481,132.22581697165083,PraatF0,Praat (F0),harmonicity,#11A3FF,Pure tones
12.231981981981981,132.22891456405185,PraatF0,Praat (F0),harmonicity,#11A3FF,Pure tones
12.232482482482482,132.23200527188794,PraatF0,Praat (F0),harmonicity,#11A3FF,Pure tones
12.232982982982984,132.23509550807557,PraatF0,Praat (F0),harmonicity,#11A3FF,Pure tones
12.233483483483484,132.238185553714,PraatF0,Praat (F0),harmonicity,#11A3FF,Pure tones
12.233983983983984,132.24128167055838,PraatF0,Praat (F0),harmonicity,#11A3FF,Pure tones
12.234484484484485,132.24437023689103,PraatF0,Praat (F0),harmonicity,#11A3FF,Pure tones
12.234984984984985,132.24746734003628,PraatF0,Praat (F0),harmonicity,#11A3FF,Pure tones
12.235485485485485,132.2505904503584,PraatF0,Praat (F0),harmonicity,#11A3FF,Pure tones
12.235985985985986,132.25368474269283,PraatF0,Praat (F0),harmonicity,#11A3FF,Pure tones
12.236486486486486,132.25677431957962,PraatF0,Praat (F0),harmonicity,#11A3FF,Pure tones
12.236986986986986,132.259839816619,PraatF0,Praat (F0),harmonicity,#11A3FF,Pure tones
12.237487487487488,132.26293258644165,PraatF0,Praat (F0),harmonicity,#11A3FF,Pure tones
12.237987987987989,132.26606801187228,PraatF0,Praat (F0),harmonicity,#11A3FF,Pure tones
12.238488488488489,132.26914917748536,PraatF0,Praat (F0),harmonicity,#11A3FF,Pure tones
12.23898898898899,132.27223542608226,PraatF0,Praat (F0),harmonicity,#11A3FF,Pure tones
12.23948948948949,132.2753187706412,PraatF0,Praat (F0),harmonicity,#11A3FF,Pure tones
12.23998998998999,132.2784350826331,PraatF0,Praat (F0),harmonicity,#11A3FF,Pure tones
12.24049049049049,132.28151723361313,PraatF0,Praat (F0),harmonicity,#11A3FF,Pure tones
12.24099099099099,132.28461027726803,PraatF0,Praat (F0),harmonicity,#11A3FF,Pure tones
12.241491491491491,132.28771817857802,PraatF0,Praat (F0),harmonicity,#11A3FF,Pure tones
12.241991991991991,132.2907826221106,PraatF0,Praat (F0),harmonicity,#11A3FF,Pure tones
12.242492492492492,132.2939156904585,PraatF0,Praat (F0),harmonicity,#11A3FF,Pure tones
12.242992992992994,132.2969909430646,PraatF0,Praat (F0),harmonicity,#11A3FF,Pure tones
12.243493493493494,132.3000753706125,PraatF0,Praat (F0),harmonicity,#11A3FF,Pure tones
12.243993993993994,132.30317609700694,PraatF0,Praat (F0),harmonicity,#11A3FF,Pure tones
12.244494494494495,132.30625712032136,PraatF0,Praat (F0),harmonicity,#11A3FF,Pure tones
12.244994994994995,132.30935752826434,PraatF0,Praat (F0),harmonicity,#11A3FF,Pure tones
12.245495495495495,132.31244734840482,PraatF0,Praat (F0),harmonicity,#11A3FF,Pure tones
12.245995995995996,132.31554144678546,PraatF0,Praat (F0),harmonicity,#11A3FF,Pure tones
12.246496496496496,132.31862609808428,PraatF0,Praat (F0),harmonicity,#11A3FF,Pure tones
12.246996996996996,132.32172489197745,PraatF0,Praat (F0),harmonicity,#11A3FF,Pure tones
12.247497497497498,132.32481077978989,PraatF0,Praat (F0),harmonicity,#11A3FF,Pure tones
12.247997997997999,132.32787688700864,PraatF0,Praat (F0),harmonicity,#11A3FF,Pure tones
12.248498498498499,132.33096395849952,PraatF0,Praat (F0),harmonicity,#11A3FF,Pure tones
12.248998998999,132.3340566297846,PraatF0,Praat (F0),harmonicity,#11A3FF,Pure tones
12.2494994994995,132.33714284647584,PraatF0,Praat (F0),harmonicity,#11A3FF,Pure tones
12.25,132.3402368291662,PraatF0,Praat (F0),harmonicity,#11A3FF,Pure tones
