interval,output,model_id,model_label,model_theory,model_colour,timbre_label
0,-0.33616243299842696,Seth93,Sethares (1993),interference,#B50000,Bonang
0.015015015015015015,-0.3469537321192777,Seth93,Sethares (1993),interference,#B50000,Bonang
0.03003003003003003,-0.34835703477106494,Seth93,Sethares (1993),interference,#B50000,Bonang
0.04504504504504504,-0.34943507532480034,Seth93,Sethares (1993),interference,#B50000,Bonang
0.06006006006006006,-0.3501785080224525,Seth93,Sethares (1993),interference,#B50000,Bonang
0.07507507507507508,-0.3505774200950672,Seth93,Sethares (1993),interference,#B50000,Bonang
0.09009009009009009,-0.35062165053978367,Seth93,Sethares (1993),interference,#B50000,Bonang
0.10510510510510511,-0.35030055738412824,Seth93,Sethares (1993),interference,#B50000,Bonang
0.12012012012012012,-0.3496030587141718,Seth93,Sethares (1993),interference,#B50000,Bonang
0.13513513513513514,-0.3485176186866202,Seth93,Sethares (1993),interference,#B50000,Bonang
0.15015015015015015,-0.3470322330806919,Seth93,Sethares (1993),interference,#B50000,Bonang
0.16516516516516516,-0.3451344143755989,Seth93,Sethares (1993),interference,#B50000,Bonang
0.18018018018018017,-0.3428111763390478,Seth93,Sethares (1993),interference,#B50000,Bonang
0.19519519519519518,-0.3400490181114872,Seth93,Sethares (1993),interference,#B50000,Bonang
0.21021021021021022,-0.33683390777069405,Seth93,Sethares (1993),interference,#B50000,Bonang
0.22522522522522523,-0.33315126536047324,Seth93,Sethares (1993),interference,#B50000,Bonang
0.24024024024024024,-0.32898594536697306,Seth93,Sethares (1993),interference,#B50000,Bonang
0.2552552552552553,-0.3243222186255485,Seth93,Sethares (1993),interference,#B50000,Bonang
0.2702702702702703,-0.319143753640512,Seth93,Sethares (1993),interference,#B50000,Bonang
0.2852852852852853,-0.31343359729955006,Seth93,Sethares (1993),interference,#B50000,Bonang
0.3003003003003003,-0.3071741549642482,Seth93,Sethares (1993),interference,#B50000,Bonang
0.3153153153153153,-0.3003471699172086,Seth93,Sethares (1993),interference,#B50000,Bonang
0.3303303303303303,-0.29293370214602066,Seth93,Sethares (1993),interference,#B50000,Bonang
0.34534534534534533,-0.2849141064434667,Seth93,Sethares (1993),interference,#B50000,Bonang
0.36036036036036034,-0.29316730022423443,Seth93,Sethares (1993),interference,#B50000,Bonang
0.37537537537537535,-0.30784002460077675,Seth93,Sethares (1993),interference,#B50000,Bonang
0.39039039039039036,-0.32192573127242147,Seth93,Sethares (1993),interference,#B50000,Bonang
0.40540540540540543,-0.335444657364902,Seth93,Sethares (1993),interference,#B50000,Bonang
0.42042042042042044,-0.34841643248106646,Seth93,Sethares (1993),interference,#B50000,Bonang
0.43543543543543545,-0.3608600954707402,Seth93,Sethares (1993),interference,#B50000,Bonang
0.45045045045045046,-0.3727941107421194,Seth93,Sethares (1993),interference,#B50000,Bonang
0.46546546546546547,-0.38423638412601485,Seth93,Sethares (1993),interference,#B50000,Bonang
0.4804804804804805,-0.39520427830353844,Seth93,Sethares (1993),interference,#B50000,Bonang
0.4954954954954955,-0.4057146278076889,Seth93,Sethares (1993),interference,#B50000,Bonang
0.5105105105105106,-0.4157839144019244,Seth93,Sethares (1993),interference,#B50000,Bonang
0.5255255255255256,-0.42542763408820516,Seth93,Sethares (1993),interference,#B50000,Bonang
0.5405405405405406,-0.4346612877097065,Seth93,Sethares (1993),interference,#B50000,Bonang
0.5555555555555556,-0.4434997390532275,Seth93,Sethares (1993),interference,#B50000,Bonang
0.5705705705705706,-0.45195739272281776,Seth93,Sethares (1993),interference,#B50000,Bonang
0.5855855855855856,-0.4600482067903701,Seth93,Sethares (1993),interference,#B50000,Bonang
0.6006006006006006,-0.46778570508619877,Seth93,Sethares (1993),interference,#B50000,Bonang
0.6156156156156156,-0.4751829891380742,Seth93,Sethares (1993),interference,#B50000,Bonang
0.6306306306306306,-0.4822527612173182,Seth93,Sethares (1993),interference,#B50000,Bonang
0.6456456456456456,-0.4890072900886243,Seth93,Sethares (1993),interference,#B50000,Bonang
0.6606606606606606,-0.49545866382329806,Seth93,Sethares (1993),interference,#B50000,Bonang
0.6756756756756757,-0.501618042052561,Seth93,Sethares (1993),interference,#B50000,Bonang
0.6906906906906907,-0.5074967741049352,Seth93,Sethares (1993),interference,#B50000,Bonang
0.7057057057057057,-0.5131056597170771,Seth93,Sethares (1993),interference,#B50000,Bonang
0.7207207207207207,-0.5184551507195105,Seth93,Sethares (1993),interference,#B50000,Bonang
0.7357357357357357,-0.5235553604419658,Seth93,Sethares (1993),interference,#B50000,Bonang
0.7507507507507507,-0.528416072833676,Seth93,Sethares (1993),interference,#B50000,Bonang
0.7657657657657657,-0.5330467513050021,Seth93,Sethares (1993),interference,#B50000,Bonang
0.7807807807807807,-0.5374565472965409,Seth93,Sethares (1993),interference,#B50000,Bonang
0.7957957957957957,-0.5416543085817647,Seth93,Sethares (1993),interference,#B50000,Bonang
0.8108108108108109,-0.5456485873089556,Seth93,Sethares (1993),interference,#B50000,Bonang
0.8258258258258259,-0.5494476477881177,Seth93,Sethares (1993),interference,#B50000,Bonang
0.8408408408408409,-0.5530594740283161,Seth93,Sethares (1993),interference,#B50000,Bonang
0.8558558558558559,-0.5564917770307163,Seth93,Sethares (1993),interference,#B50000,Bonang
0.8708708708708709,-0.5597520018424826,Seth93,Sethares (1993),interference,#B50000,Bonang
0.8858858858858859,-0.5628473343764511,Seth93,Sethares (1993),interference,#B50000,Bonang
0.9009009009009009,-0.5657847080013936,Seth93,Sethares (1993),interference,#B50000,Bonang
0.9159159159159159,-0.5685708099075031,Seth93,Sethares (1993),interference,#B50000,Bonang
0.9309309309309309,-0.5712120872515287,Seth93,Sethares (1993),interference,#B50000,Bonang
0.9459459459459459,-0.5737147530859366,Seth93,Sethares (1993),interference,#B50000,Bonang
0.960960960960961,-0.5760847920762089,Seth93,Sethares (1993),interference,#B50000,Bonang
0.975975975975976,-0.5783279660102838,Seth93,Sethares (1993),interference,#B50000,Bonang
0.990990990990991,-0.5804498191040326,Seth93,Sethares (1993),interference,#B50000,Bonang
1.006006006006006,-0.5824556831064238,Seth93,Sethares (1993),interference,#B50000,Bonang
1.021021021021021,-0.5843506822079911,Seth93,Sethares (1993),interference,#B50000,Bonang
1.0360360360360361,-0.5861397377559837,Seth93,Sethares (1993),interference,#B50000,Bonang
1.0510510510510511,-0.5878277130664269,Seth93,Sethares (1993),interference,#B50000,Bonang
1.0660660660660661,-0.5894188574796677,Seth93,Sethares (1993),interference,#B50000,Bonang
1.0810810810810811,-0.5909176496074396,Seth93,Sethares (1993),interference,#B50000,Bonang
1.0960960960960962,-0.5923282428190045,Seth93,Sethares (1993),interference,#B50000,Bonang
1.1111111111111112,-0.5936546084260133,Seth93,Sethares (1993),interference,#B50000,Bonang
1.1261261261261262,-0.5949005393016435,Seth93,Sethares (1993),interference,#B50000,Bonang
1.1411411411411412,-0.5960696533264065,Seth93,Sethares (1993),interference,#B50000,Bonang
1.1561561561561562,-0.5971653966629765,Seth93,Sethares (1993),interference,#B50000,Bonang
1.1711711711711712,-0.5981910468621592,Seth93,Sethares (1993),interference,#B50000,Bonang
1.1861861861861862,-0.5991497158021356,Seth93,Sethares (1993),interference,#B50000,Bonang
1.2012012012012012,-0.6000443524628152,Seth93,Sethares (1993),interference,#B50000,Bonang
1.2162162162162162,-0.6008777455371432,Seth93,Sethares (1993),interference,#B50000,Bonang
1.2312312312312312,-0.6016525258809935,Seth93,Sethares (1993),interference,#B50000,Bonang
1.2462462462462462,-0.6023711688031902,Seth93,Sethares (1993),interference,#B50000,Bonang
1.2612612612612613,-0.6030359961970612,Seth93,Sethares (1993),interference,#B50000,Bonang
1.2762762762762763,-0.603649178514796,Seth93,Sethares (1993),interference,#B50000,Bonang
1.2912912912912913,-0.6042127365857284,Seth93,Sethares (1993),interference,#B50000,Bonang
1.3063063063063063,-0.6047285432796353,Seth93,Sethares (1993),interference,#B50000,Bonang
1.3213213213213213,-0.6051983250158611,Seth93,Sethares (1993),interference,#B50000,Bonang
1.3363363363363363,-0.6056236631190838,Seth93,Sethares (1993),interference,#B50000,Bonang
1.3513513513513513,-0.606005995022346,Seth93,Sethares (1993),interference,#B50000,Bonang
1.3663663663663663,-0.606346615317868,Seth93,Sethares (1993),interference,#B50000,Bonang
1.3813813813813813,-0.6066466766560081,Seth93,Sethares (1993),interference,#B50000,Bonang
1.3963963963963963,-0.6069071904926593,Seth93,Sethares (1993),interference,#B50000,Bonang
1.4114114114114114,-0.6071290276851468,Seth93,Sethares (1993),interference,#B50000,Bonang
1.4264264264264264,-0.6073129189367129,Seth93,Sethares (1993),interference,#B50000,Bonang
1.4414414414414414,-0.6074594550893655,Seth93,Sethares (1993),interference,#B50000,Bonang
1.4564564564564564,-0.6075690872648813,Seth93,Sethares (1993),interference,#B50000,Bonang
1.4714714714714714,-0.6076421268535557,Seth93,Sethares (1993),interference,#B50000,Bonang
1.4864864864864864,-0.6076787453501611,Seth93,Sethares (1993),interference,#B50000,Bonang
1.5015015015015014,-0.6076789717592316,Seth93,Sethares (1993),interference,#B50000,Bonang
1.5165165165165164,-0.6076426999548237,Seth93,Sethares (1993),interference,#B50000,Bonang
1.5315315315315314,-0.6075696782483304,Seth93,Sethares (1993),interference,#B50000,Bonang
1.5465465465465464,-0.6074595138300328,Seth93,Sethares (1993),interference,#B50000,Bonang
1.5615615615615615,-0.6073116708548452,Seth93,Sethares (1993),interference,#B50000,Bonang
1.5765765765765765,-0.6071254693429202,Seth93,Sethares (1993),interference,#B50000,Bonang
1.5915915915915915,-0.6069000839199561,Seth93,Sethares (1993),interference,#B50000,Bonang
1.6066066066066067,-0.6066345423955724,Seth93,Sethares (1993),interference,#B50000,Bonang
1.6216216216216217,-0.6063277585753938,Seth93,Sethares (1993),interference,#B50000,Bonang
1.6366366366366367,-0.6059783933261702,Seth93,Sethares (1993),interference,#B50000,Bonang
1.6516516516516517,-0.605584885821147,Seth93,Sethares (1993),interference,#B50000,Bonang
1.6666666666666667,-0.6051460034677099,Seth93,Sethares (1993),interference,#B50000,Bonang
1.6816816816816818,-0.6046598405416106,Seth93,Sethares (1993),interference,#B50000,Bonang
1.6966966966966968,-0.6041245047878396,Seth93,Sethares (1993),interference,#B50000,Bonang
1.7117117117117118,-0.6035379424813585,Seth93,Sethares (1993),interference,#B50000,Bonang
1.7267267267267268,-0.6028979356331243,Seth93,Sethares (1993),interference,#B50000,Bonang
1.7417417417417418,-0.6022020990126001,Seth93,Sethares (1993),interference,#B50000,Bonang
1.7567567567567568,-0.6014478769835919,Seth93,Sethares (1993),interference,#B50000,Bonang
1.7717717717717718,-0.6006325401499388,Seth93,Sethares (1993),interference,#B50000,Bonang
1.7867867867867868,-0.5997531818075932,Seth93,Sethares (1993),interference,#B50000,Bonang
1.8018018018018018,-0.5988067141992994,Seth93,Sethares (1993),interference,#B50000,Bonang
1.8168168168168168,-0.5977898645679467,Seth93,Sethares (1993),interference,#B50000,Bonang
1.8318318318318318,-0.5966991710045403,Seth93,Sethares (1993),interference,#B50000,Bonang
1.8468468468468469,-0.5955309780864502,Seth93,Sethares (1993),interference,#B50000,Bonang
1.8618618618618619,-0.5942814323014143,Seth93,Sethares (1993),interference,#B50000,Bonang
1.8768768768768769,-0.592946477252701,Seth93,Sethares (1993),interference,#B50000,Bonang
1.8918918918918919,-0.5915218486404066,Seth93,Sethares (1993),interference,#B50000,Bonang
1.906906906906907,-0.5900030690138776,Seth93,Sethares (1993),interference,#B50000,Bonang
1.921921921921922,-0.58838544228988,Seth93,Sethares (1993),interference,#B50000,Bonang
1.936936936936937,-0.5866640480309732,Seth93,Sethares (1993),interference,#B50000,Bonang
1.951951951951952,-0.5848337354783524,Seth93,Sethares (1993),interference,#B50000,Bonang
1.966966966966967,-0.5828891173331321,Seth93,Sethares (1993),interference,#B50000,Bonang
1.981981981981982,-0.580824563279816,Seth93,Sethares (1993),interference,#B50000,Bonang
1.996996996996997,-0.5786341932455442,Seth93,Sethares (1993),interference,#B50000,Bonang
2.012012012012012,-0.5763118703883013,Seth93,Sethares (1993),interference,#B50000,Bonang
2.027027027027027,-0.57385119380718,Seth93,Sethares (1993),interference,#B50000,Bonang
2.042042042042042,-0.5712454909674137,Seth93,Sethares (1993),interference,#B50000,Bonang
2.057057057057057,-0.5684877599788882,Seth93,Sethares (1993),interference,#B50000,Bonang
2.0720720720720722,-0.5655708490681135,Seth93,Sethares (1993),interference,#B50000,Bonang
2.0870870870870872,-0.5624871837718435,Seth93,Sethares (1993),interference,#B50000,Bonang
2.1021021021021022,-0.5592289232777156,Seth93,Sethares (1993),interference,#B50000,Bonang
2.1171171171171173,-0.555787912713079,Seth93,Sethares (1993),interference,#B50000,Bonang
2.1321321321321323,-0.55215567369106,Seth93,Sethares (1993),interference,#B50000,Bonang
2.1471471471471473,-0.5483233945128206,Seth93,Sethares (1993),interference,#B50000,Bonang
2.1621621621621623,-0.5442819200163601,Seth93,Sethares (1993),interference,#B50000,Bonang
2.1771771771771773,-0.5400217410619358,Seth93,Sethares (1993),interference,#B50000,Bonang
2.1921921921921923,-0.53553298364389,Seth93,Sethares (1993),interference,#B50000,Bonang
2.2072072072072073,-0.5308053976181626,Seth93,Sethares (1993),interference,#B50000,Bonang
2.2222222222222223,-0.5258283450345891,Seth93,Sethares (1993),interference,#B50000,Bonang
2.2372372372372373,-0.5205907880626022,Seth93,Sethares (1993),interference,#B50000,Bonang
2.2522522522522523,-0.515081276498571,Seth93,Sethares (1993),interference,#B50000,Bonang
2.2672672672672673,-0.5092879348427288,Seth93,Sethares (1993),interference,#B50000,Bonang
2.2822822822822824,-0.5031984489330945,Seth93,Sethares (1993),interference,#B50000,Bonang
2.2972972972972974,-0.4968000521234267,Seth93,Sethares (1993),interference,#B50000,Bonang
2.3123123123123124,-0.49007951099197966,Seth93,Sethares (1993),interference,#B50000,Bonang
2.3273273273273274,-0.4830231105670429,Seth93,Sethares (1993),interference,#B50000,Bonang
2.3423423423423424,-0.47561663905521306,Seth93,Sethares (1993),interference,#B50000,Bonang
2.3573573573573574,-0.467845372057542,Seth93,Sethares (1993),interference,#B50000,Bonang
2.3723723723723724,-0.4596940562583698,Seth93,Sethares (1993),interference,#B50000,Bonang
2.3873873873873874,-0.45114689257127244,Seth93,Sethares (1993),interference,#B50000,Bonang
2.4024024024024024,-0.4421875187257747,Seth93,Sethares (1993),interference,#B50000,Bonang
2.4174174174174174,-0.43279899127815125,Seth93,Sethares (1993),interference,#B50000,Bonang
2.4324324324324325,-0.42296376702920485,Seth93,Sethares (1993),interference,#B50000,Bonang
2.4474474474474475,-0.41266368383095375,Seth93,Sethares (1993),interference,#B50000,Bonang
2.4624624624624625,-0.40187994076412553,Seth93,Sethares (1993),interference,#B50000,Bonang
2.4774774774774775,-0.3905930776673259,Seth93,Sethares (1993),interference,#B50000,Bonang
2.4924924924924925,-0.37878295399834294,Seth93,Sethares (1993),interference,#B50000,Bonang
2.5075075075075075,-0.36642868179259963,Seth93,Sethares (1993),interference,#B50000,Bonang
2.5225225225225225,-0.37229434023239266,Seth93,Sethares (1993),interference,#B50000,Bonang
2.5375375375375375,-0.38275784873796836,Seth93,Sethares (1993),interference,#B50000,Bonang
2.5525525525525525,-0.39269616608868396,Seth93,Sethares (1993),interference,#B50000,Bonang
2.5675675675675675,-0.40212836010561476,Seth93,Sethares (1993),interference,#B50000,Bonang
2.5825825825825826,-0.4110728977817498,Seth93,Sethares (1993),interference,#B50000,Bonang
2.5975975975975976,-0.41954766213585737,Seth93,Sethares (1993),interference,#B50000,Bonang
2.6126126126126126,-0.4275699686089929,Seth93,Sethares (1993),interference,#B50000,Bonang
2.6276276276276276,-0.435156641664991,Seth93,Sethares (1993),interference,#B50000,Bonang
2.6426426426426426,-0.4423237879730193,Seth93,Sethares (1993),interference,#B50000,Bonang
2.6576576576576576,-0.44908706385668234,Seth93,Sethares (1993),interference,#B50000,Bonang
2.6726726726726726,-0.4554618919904963,Seth93,Sethares (1993),interference,#B50000,Bonang
2.6876876876876876,-0.46146286904799533,Seth93,Sethares (1993),interference,#B50000,Bonang
2.7027027027027026,-0.46710422512676275,Seth93,Sethares (1993),interference,#B50000,Bonang
2.7177177177177176,-0.4723997256430177,Seth93,Sethares (1993),interference,#B50000,Bonang
2.7327327327327327,-0.477362684458165,Seth93,Sethares (1993),interference,#B50000,Bonang
2.7477477477477477,-0.48200597664117506,Seth93,Sethares (1993),interference,#B50000,Bonang
2.7627627627627627,-0.486342050876094,Seth93,Sethares (1993),interference,#B50000,Bonang
2.7777777777777777,-0.49038294152339823,Seth93,Sethares (1993),interference,#B50000,Bonang
2.7927927927927927,-0.4941402803439778,Seth93,Sethares (1993),interference,#B50000,Bonang
2.8078078078078077,-0.49762530789419646,Seth93,Sethares (1993),interference,#B50000,Bonang
2.8228228228228227,-0.5008488846001921,Seth93,Sethares (1993),interference,#B50000,Bonang
2.8378378378378377,-0.5038215015195672,Seth93,Sethares (1993),interference,#B50000,Bonang
2.8528528528528527,-0.5065532907982597,Seth93,Sethares (1993),interference,#B50000,Bonang
2.8678678678678677,-0.5090540358301658,Seth93,Sethares (1993),interference,#B50000,Bonang
2.8828828828828827,-0.5113331811271347,Seth93,Sethares (1993),interference,#B50000,Bonang
2.8978978978978978,-0.513399841906391,Seth93,Sethares (1993),interference,#B50000,Bonang
2.9129129129129128,-0.515262813402623,Seth93,Sethares (1993),interference,#B50000,Bonang
2.9279279279279278,-0.5169305799115603,Seth93,Sethares (1993),interference,#B50000,Bonang
2.942942942942943,-0.518411323571736,Seth93,Sethares (1993),interference,#B50000,Bonang
2.957957957957958,-0.5197129328910614,Seth93,Sethares (1993),interference,#B50000,Bonang
2.972972972972973,-0.5208430110245357,Seth93,Sethares (1993),interference,#B50000,Bonang
2.987987987987988,-0.521808883809297,Seth93,Sethares (1993),interference,#B50000,Bonang
3.003003003003003,-0.5226176075631392,Seth93,Sethares (1993),interference,#B50000,Bonang
3.018018018018018,-0.5232759766523015,Seth93,Sethares (1993),interference,#B50000,Bonang
3.033033033033033,-0.5237905308343674,Seth93,Sethares (1993),interference,#B50000,Bonang
3.048048048048048,-0.5241676579710541,Seth93,Sethares (1993),interference,#B50000,Bonang
3.063063063063063,-0.5244132095042005,Seth93,Sethares (1993),interference,#B50000,Bonang
3.078078078078078,-0.5245331083309273,Seth93,Sethares (1993),interference,#B50000,Bonang
3.093093093093093,-0.5245329448830277,Seth93,Sethares (1993),interference,#B50000,Bonang
3.108108108108108,-0.5244180885152859,Seth93,Sethares (1993),interference,#B50000,Bonang
3.123123123123123,-0.5241936936112735,Seth93,Sethares (1993),interference,#B50000,Bonang
3.138138138138138,-0.5238647055004151,Seth93,Sethares (1993),interference,#B50000,Bonang
3.153153153153153,-0.5234358661909724,Seth93,Sethares (1993),interference,#B50000,Bonang
3.168168168168168,-0.522911719923468,Seth93,Sethares (1993),interference,#B50000,Bonang
3.183183183183183,-0.5222966185489308,Seth93,Sethares (1993),interference,#B50000,Bonang
3.198198198198198,-0.5215947267362337,Seth93,Sethares (1993),interference,#B50000,Bonang
3.2132132132132134,-0.5208100270126984,Seth93,Sethares (1993),interference,#B50000,Bonang
3.2282282282282284,-0.5199463246419737,Seth93,Sethares (1993),interference,#B50000,Bonang
3.2432432432432434,-0.519007252343158,Seth93,Sethares (1993),interference,#B50000,Bonang
3.2582582582582584,-0.517996274854956,Seth93,Sethares (1993),interference,#B50000,Bonang
3.2732732732732734,-0.5169166933485971,Seth93,Sethares (1993),interference,#B50000,Bonang
3.2882882882882885,-0.5157716496931288,Seth93,Sethares (1993),interference,#B50000,Bonang
3.3033033033033035,-0.5145641305765779,Seth93,Sethares (1993),interference,#B50000,Bonang
3.3183183183183185,-0.5132969714864081,Seth93,Sethares (1993),interference,#B50000,Bonang
3.3333333333333335,-0.5119728605525715,Seth93,Sethares (1993),interference,#B50000,Bonang
3.3483483483483485,-0.510594342256367,Seth93,Sethares (1993),interference,#B50000,Bonang
3.3633633633633635,-0.5091638210082428,Seth93,Sethares (1993),interference,#B50000,Bonang
3.3783783783783785,-0.5076835645975523,Seth93,Sethares (1993),interference,#B50000,Bonang
3.3933933933933935,-0.5061557075172273,Seth93,Sethares (1993),interference,#B50000,Bonang
3.4084084084084085,-0.504582254166204,Seth93,Sethares (1993),interference,#B50000,Bonang
3.4234234234234235,-0.502965081932371,Seth93,Sethares (1993),interference,#B50000,Bonang
3.4384384384384385,-0.5013059441587442,Seth93,Sethares (1993),interference,#B50000,Bonang
3.4534534534534536,-0.4996064729954414,Seth93,Sethares (1993),interference,#B50000,Bonang
3.4684684684684686,-0.4978681821399943,Seth93,Sethares (1993),interference,#B50000,Bonang
3.4834834834834836,-0.49609246946845,Seth93,Sethares (1993),interference,#B50000,Bonang
3.4984984984984986,-0.49428061955959846,Seth93,Sethares (1993),interference,#B50000,Bonang
3.5135135135135136,-0.49243376337867795,Seth93,Sethares (1993),interference,#B50000,Bonang
3.5285285285285286,-0.49055305171310515,Seth93,Sethares (1993),interference,#B50000,Bonang
3.5435435435435436,-0.48863940045242393,Seth93,Sethares (1993),interference,#B50000,Bonang
3.5585585585585586,-0.48669366417026294,Seth93,Sethares (1993),interference,#B50000,Bonang
3.5735735735735736,-0.4847165952389758,Seth93,Sethares (1993),interference,#B50000,Bonang
3.5885885885885886,-0.4827088457583129,Seth93,Sethares (1993),interference,#B50000,Bonang
3.6036036036036037,-0.4806709693917812,Seth93,Sethares (1993),interference,#B50000,Bonang
3.6186186186186187,-0.4786034539627408,Seth93,Sethares (1993),interference,#B50000,Bonang
3.6336336336336337,-0.4765065978354425,Seth93,Sethares (1993),interference,#B50000,Bonang
3.6486486486486487,-0.4743806294766837,Seth93,Sethares (1993),interference,#B50000,Bonang
3.6636636636636637,-0.47222587103543845,Seth93,Sethares (1993),interference,#B50000,Bonang
3.6786786786786787,-0.4700423354303783,Seth93,Sethares (1993),interference,#B50000,Bonang
3.6936936936936937,-0.4678300193181085,Seth93,Sethares (1993),interference,#B50000,Bonang
3.7087087087087087,-0.46558883133193624,Seth93,Sethares (1993),interference,#B50000,Bonang
3.7237237237237237,-0.4633185932393262,Seth93,Sethares (1993),interference,#B50000,Bonang
3.7387387387387387,-0.4610190410210419,Seth93,Sethares (1993),interference,#B50000,Bonang
3.7537537537537538,-0.45868982587325147,Seth93,Sethares (1993),interference,#B50000,Bonang
3.7687687687687688,-0.4563305151338085,Seth93,Sethares (1993),interference,#B50000,Bonang
3.7837837837837838,-0.45394059313385127,Seth93,Sethares (1993),interference,#B50000,Bonang
3.798798798798799,-0.45151946197584136,Seth93,Sethares (1993),interference,#B50000,Bonang
3.813813813813814,-0.4490664422390915,Seth93,Sethares (1993),interference,#B50000,Bonang
3.828828828828829,-0.4465807736137758,Seth93,Sethares (1993),interference,#B50000,Bonang
3.843843843843844,-0.44406161546438544,Seth93,Sethares (1993),interference,#B50000,Bonang
3.858858858858859,-0.44150804732352167,Seth93,Sethares (1993),interference,#B50000,Bonang
3.873873873873874,-0.4389190693168885,Seth93,Sethares (1993),interference,#B50000,Bonang
3.888888888888889,-0.43629360252028543,Seth93,Sethares (1993),interference,#B50000,Bonang
3.903903903903904,-0.43363048924935305,Seth93,Sethares (1993),interference,#B50000,Bonang
3.918918918918919,-0.43092849328279353,Seth93,Sethares (1993),interference,#B50000,Bonang
3.933933933933934,-0.428186300019723,Seth93,Sethares (1993),interference,#B50000,Bonang
3.948948948948949,-0.42540251657177186,Seth93,Sethares (1993),interference,#B50000,Bonang
3.963963963963964,-0.4225756717905189,Seth93,Sethares (1993),interference,#B50000,Bonang
3.978978978978979,-0.41970421623076826,Seth93,Sethares (1993),interference,#B50000,Bonang
3.993993993993994,-0.41678652205018024,Seth93,Sethares (1993),interference,#B50000,Bonang
4.009009009009009,-0.4138208828456775,Seth93,Sethares (1993),interference,#B50000,Bonang
4.024024024024024,-0.4108055134270249,Seth93,Sethares (1993),interference,#B50000,Bonang
4.039039039039039,-0.40773854952795724,Seth93,Sethares (1993),interference,#B50000,Bonang
4.054054054054054,-0.4046180008944835,Seth93,Sethares (1993),interference,#B50000,Bonang
4.069069069069069,-0.4014419379648021,Seth93,Sethares (1993),interference,#B50000,Bonang
4.084084084084084,-0.39820820949817975,Seth93,Sethares (1993),interference,#B50000,Bonang
4.099099099099099,-0.39491463079487327,Seth93,Sethares (1993),interference,#B50000,Bonang
4.114114114114114,-0.39155893570732264,Seth93,Sethares (1993),interference,#B50000,Bonang
4.129129129129129,-0.38813877598161484,Seth93,Sethares (1993),interference,#B50000,Bonang
4.1441441441441444,-0.3846517205377983,Seth93,Sethares (1993),interference,#B50000,Bonang
4.1591591591591595,-0.3810952546890979,Seth93,Sethares (1993),interference,#B50000,Bonang
4.1741741741741745,-0.37746677930000155,Seth93,Sethares (1993),interference,#B50000,Bonang
4.1891891891891895,-0.3737636098831485,Seth93,Sethares (1993),interference,#B50000,Bonang
4.2042042042042045,-0.36998297563498145,Seth93,Sethares (1993),interference,#B50000,Bonang
4.2192192192192195,-0.3661220184099513,Seth93,Sethares (1993),interference,#B50000,Bonang
4.2342342342342345,-0.3621777916331763,Seth93,Sethares (1993),interference,#B50000,Bonang
4.2492492492492495,-0.3581472591513007,Seth93,Sethares (1993),interference,#B50000,Bonang
4.2642642642642645,-0.3540272940213045,Seth93,Sethares (1993),interference,#B50000,Bonang
4.2792792792792795,-0.3498146772370036,Seth93,Sethares (1993),interference,#B50000,Bonang
4.2942942942942945,-0.3455060963928838,Seth93,Sethares (1993),interference,#B50000,Bonang
4.3093093093093096,-0.3410981442848878,Seth93,Sethares (1993),interference,#B50000,Bonang
4.324324324324325,-0.3365873174478169,Seth93,Sethares (1993),interference,#B50000,Bonang
4.33933933933934,-0.3319700146287974,Seth93,Sethares (1993),interference,#B50000,Bonang
4.354354354354355,-0.32724253519641944,Seth93,Sethares (1993),interference,#B50000,Bonang
4.36936936936937,-0.3224010774849751,Seth93,Sethares (1993),interference,#B50000,Bonang
4.384384384384385,-0.31744173707321716,Seth93,Sethares (1993),interference,#B50000,Bonang
4.3993993993994,-0.3123605049970967,Seth93,Sethares (1993),interference,#B50000,Bonang
4.414414414414415,-0.3071532658957661,Seth93,Sethares (1993),interference,#B50000,Bonang
4.42942942942943,-0.30181579609018133,Seth93,Sethares (1993),interference,#B50000,Bonang
4.444444444444445,-0.2963437615936408,Seth93,Sethares (1993),interference,#B50000,Bonang
4.45945945945946,-0.29073271605337075,Seth93,Sethares (1993),interference,#B50000,Bonang
4.474474474474475,-0.28497809862248885,Seth93,Sethares (1993),interference,#B50000,Bonang
4.48948948948949,-0.27907523176140203,Seth93,Sethares (1993),interference,#B50000,Bonang
4.504504504504505,-0.27301929032155253,Seth93,Sethares (1993),interference,#B50000,Bonang
4.51951951951952,-0.26680541401588886,Seth93,Sethares (1993),interference,#B50000,Bonang
4.534534534534535,-0.2604285324418705,Seth93,Sethares (1993),interference,#B50000,Bonang
4.54954954954955,-0.25388347786038096,Seth93,Sethares (1993),interference,#B50000,Bonang
4.564564564564565,-0.2471649537560526,Seth93,Sethares (1993),interference,#B50000,Bonang
4.57957957957958,-0.2402675321952968,Seth93,Sethares (1993),interference,#B50000,Bonang
4.594594594594595,-0.23318565110677159,Seth93,Sethares (1993),interference,#B50000,Bonang
4.60960960960961,-0.22591361148296282,Seth93,Sethares (1993),interference,#B50000,Bonang
4.624624624624625,-0.21844516670395106,Seth93,Sethares (1993),interference,#B50000,Bonang
4.63963963963964,-0.21077513585861687,Seth93,Sethares (1993),interference,#B50000,Bonang
4.654654654654655,-0.20289693906550998,Seth93,Sethares (1993),interference,#B50000,Bonang
4.66966966966967,-0.194804418421537,Seth93,Sethares (1993),interference,#B50000,Bonang
4.684684684684685,-0.18649108611624765,Seth93,Sethares (1993),interference,#B50000,Bonang
4.6996996996997,-0.17795035817309776,Seth93,Sethares (1993),interference,#B50000,Bonang
4.714714714714715,-0.16917549177386132,Seth93,Sethares (1993),interference,#B50000,Bonang
4.72972972972973,-0.16015958178140194,Seth93,Sethares (1993),interference,#B50000,Bonang
4.744744744744745,-0.15089555717081596,Seth93,Sethares (1993),interference,#B50000,Bonang
4.75975975975976,-0.15075656220991646,Seth93,Sethares (1993),interference,#B50000,Bonang
4.774774774774775,-0.1573362309332315,Seth93,Sethares (1993),interference,#B50000,Bonang
4.78978978978979,-0.163675969848825,Seth93,Sethares (1993),interference,#B50000,Bonang
4.804804804804805,-0.16978170223295333,Seth93,Sethares (1993),interference,#B50000,Bonang
4.81981981981982,-0.17565922752393634,Seth93,Sethares (1993),interference,#B50000,Bonang
4.834834834834835,-0.18131422369126968,Seth93,Sethares (1993),interference,#B50000,Bonang
4.84984984984985,-0.18675224956180939,Seth93,Sethares (1993),interference,#B50000,Bonang
4.864864864864865,-0.19197874710388135,Seth93,Sethares (1993),interference,#B50000,Bonang
4.87987987987988,-0.19699904367004123,Seth93,Sethares (1993),interference,#B50000,Bonang
4.894894894894895,-0.20181835419914818,Seth93,Sethares (1993),interference,#B50000,Bonang
4.90990990990991,-0.20644178337860264,Seth93,Sethares (1993),interference,#B50000,Bonang
4.924924924924925,-0.2108743277673077,Seth93,Sethares (1993),interference,#B50000,Bonang
4.93993993993994,-0.21512087788019,Seth93,Sethares (1993),interference,#B50000,Bonang
4.954954954954955,-0.21918622023489484,Seth93,Sethares (1993),interference,#B50000,Bonang
4.96996996996997,-0.22307503936127965,Seth93,Sethares (1993),interference,#B50000,Bonang
4.984984984984985,-0.22679191977448188,Seth93,Sethares (1993),interference,#B50000,Bonang
5,-0.23034134791212768,Seth93,Sethares (1993),interference,#B50000,Bonang
5.015015015015015,-0.2337277140362934,Seth93,Sethares (1993),interference,#B50000,Bonang
5.03003003003003,-0.23695531410096282,Seth93,Sethares (1993),interference,#B50000,Bonang
5.045045045045045,-0.24002835158542685,Seth93,Sethares (1993),interference,#B50000,Bonang
5.06006006006006,-0.24295095230656835,Seth93,Sethares (1993),interference,#B50000,Bonang
5.075075075075075,-0.2457271147917069,Seth93,Sethares (1993),interference,#B50000,Bonang
5.09009009009009,-0.2483607881146559,Seth93,Sethares (1993),interference,#B50000,Bonang
5.105105105105105,-0.25085582353196134,Seth93,Sethares (1993),interference,#B50000,Bonang
5.12012012012012,-0.2532159885038889,Seth93,Sethares (1993),interference,#B50000,Bonang
5.135135135135135,-0.25544496833630076,Seth93,Sethares (1993),interference,#B50000,Bonang
5.15015015015015,-0.25754636779260676,Seth93,Sethares (1993),interference,#B50000,Bonang
5.165165165165165,-0.25952371267622093,Seth93,Sethares (1993),interference,#B50000,Bonang
5.18018018018018,-0.26138045138413074,Seth93,Sethares (1993),interference,#B50000,Bonang
5.195195195195195,-0.263119956432051,Seth93,Sethares (1993),interference,#B50000,Bonang
5.21021021021021,-0.26474552595164474,Seth93,Sethares (1993),interference,#B50000,Bonang
5.225225225225225,-0.2662603851603579,Seth93,Sethares (1993),interference,#B50000,Bonang
5.24024024024024,-0.26766768780431793,Seth93,Sethares (1993),interference,#B50000,Bonang
5.255255255255255,-0.2689705175747602,Seth93,Sethares (1993),interference,#B50000,Bonang
5.27027027027027,-0.2701718894985053,Seth93,Sethares (1993),interference,#B50000,Bonang
5.285285285285285,-0.271274751302871,Seth93,Sethares (1993),interference,#B50000,Bonang
5.3003003003003,-0.2722819847555456,Seth93,Sethares (1993),interference,#B50000,Bonang
5.315315315315315,-0.27319640697981584,Seth93,Sethares (1993),interference,#B50000,Bonang
5.33033033033033,-0.2740207717456006,Seth93,Sethares (1993),interference,#B50000,Bonang
5.345345345345345,-0.27475777073672425,Seth93,Sethares (1993),interference,#B50000,Bonang
5.36036036036036,-0.2754100347948466,Seth93,Sethares (1993),interference,#B50000,Bonang
5.375375375375375,-0.2759801351404544,Seth93,Sethares (1993),interference,#B50000,Bonang
5.39039039039039,-0.2764705845713416,Seth93,Sethares (1993),interference,#B50000,Bonang
5.405405405405405,-0.27688383863894206,Seth93,Sethares (1993),interference,#B50000,Bonang
5.42042042042042,-0.2772222968029535,Seth93,Sethares (1993),interference,#B50000,Bonang
5.435435435435435,-0.27748830356459364,Seth93,Sethares (1993),interference,#B50000,Bonang
5.45045045045045,-0.2776841495788925,Seth93,Sethares (1993),interference,#B50000,Bonang
5.465465465465465,-0.277812072746384,Seth93,Sethares (1993),interference,#B50000,Bonang
5.48048048048048,-0.2778742592845669,Seth93,Sethares (1993),interference,#B50000,Bonang
5.495495495495495,-0.2778728447794838,Seth93,Sethares (1993),interference,#B50000,Bonang
5.51051051051051,-0.27780990111551074,Seth93,Sethares (1993),interference,#B50000,Bonang
5.525525525525525,-0.277687494099906,Seth93,Sethares (1993),interference,#B50000,Bonang
5.54054054054054,-0.27750759923508717,Seth93,Sethares (1993),interference,#B50000,Bonang
5.555555555555555,-0.27727215971182195,Seth93,Sethares (1993),interference,#B50000,Bonang
5.57057057057057,-0.27698307306133596,Seth93,Sethares (1993),interference,#B50000,Bonang
5.585585585585585,-0.27664219209483487,Seth93,Sethares (1993),interference,#B50000,Bonang
5.6006006006006,-0.27625132582549206,Seth93,Sethares (1993),interference,#B50000,Bonang
5.615615615615615,-0.2758122403732164,Seth93,Sethares (1993),interference,#B50000,Bonang
5.63063063063063,-0.27532666109479914,Seth93,Sethares (1993),interference,#B50000,Bonang
5.645645645645645,-0.27479626496150994,Seth93,Sethares (1993),interference,#B50000,Bonang
5.66066066066066,-0.2742226452059779,Seth93,Sethares (1993),interference,#B50000,Bonang
5.675675675675675,-0.2736075138348176,Seth93,Sethares (1993),interference,#B50000,Bonang
5.6906906906906904,-0.2729523810903992,Seth93,Sethares (1993),interference,#B50000,Bonang
5.7057057057057055,-0.2722587738040871,Seth93,Sethares (1993),interference,#B50000,Bonang
5.7207207207207205,-0.27152818179026267,Seth93,Sethares (1993),interference,#B50000,Bonang
5.7357357357357355,-0.2707620586239012,Seth93,Sethares (1993),interference,#B50000,Bonang
5.7507507507507505,-0.2699618224035121,Seth93,Sethares (1993),interference,#B50000,Bonang
5.7657657657657655,-0.2691288564996719,Seth93,Sethares (1993),interference,#B50000,Bonang
5.7807807807807805,-0.2682645102894457,Seth93,Sethares (1993),interference,#B50000,Bonang
5.7957957957957955,-0.26737009987691684,Seth93,Sethares (1993),interference,#B50000,Bonang
5.8108108108108105,-0.26644690880008753,Seth93,Sethares (1993),interference,#B50000,Bonang
5.8258258258258255,-0.26549618872440073,Seth93,Sethares (1993),interference,#B50000,Bonang
5.8408408408408405,-0.26451916012310706,Seth93,Sethares (1993),interference,#B50000,Bonang
5.8558558558558556,-0.263517012944721,Seth93,Sethares (1993),interference,#B50000,Bonang
5.870870870870871,-0.26249090726780805,Seth93,Sethares (1993),interference,#B50000,Bonang
5.885885885885886,-0.261441973943297,Seth93,Sethares (1993),interference,#B50000,Bonang
5.900900900900901,-0.26037131522458967,Seth93,Sethares (1993),interference,#B50000,Bonang
5.915915915915916,-0.25928000538564283,Seth93,Sethares (1993),interference,#B50000,Bonang
5.930930930930931,-0.2581690913272596,Seth93,Sethares (1993),interference,#B50000,Bonang
5.945945945945946,-0.2570395931718089,Seth93,Sethares (1993),interference,#B50000,Bonang
5.960960960960961,-0.25589250484655884,Seth93,Sethares (1993),interference,#B50000,Bonang
5.975975975975976,-0.2547287946558484,Seth93,Sethares (1993),interference,#B50000,Bonang
5.990990990990991,-0.2535494058422978,Seth93,Sethares (1993),interference,#B50000,Bonang
6.006006006006006,-0.25235525713723234,Seth93,Sethares (1993),interference,#B50000,Bonang
6.021021021021021,-0.2511472433005538,Seth93,Sethares (1993),interference,#B50000,Bonang
6.036036036036036,-0.24992623565021033,Seth93,Sethares (1993),interference,#B50000,Bonang
6.051051051051051,-0.24869312198738616,Seth93,Sethares (1993),interference,#B50000,Bonang
6.066066066066066,-0.24744864967965788,Seth93,Sethares (1993),interference,#B50000,Bonang
6.081081081081081,-0.24619366199907608,Seth93,Sethares (1993),interference,#B50000,Bonang
6.096096096096096,-0.2449289415894379,Seth93,Sethares (1993),interference,#B50000,Bonang
6.111111111111111,-0.24365525015066938,Seth93,Sethares (1993),interference,#B50000,Bonang
6.126126126126126,-0.24237332890982496,Seth93,Sethares (1993),interference,#B50000,Bonang
6.141141141141141,-0.24108389908296124,Seth93,Sethares (1993),interference,#B50000,Bonang
6.156156156156156,-0.23978766232803034,Seth93,Sethares (1993),interference,#B50000,Bonang
6.171171171171171,-0.2384853011889679,Seth93,Sethares (1993),interference,#B50000,Bonang
6.186186186186186,-0.2371774795311446,Seth93,Sethares (1993),interference,#B50000,Bonang
6.201201201201201,-0.23586484296831084,Seth93,Sethares (1993),interference,#B50000,Bonang
6.216216216216216,-0.23454801928122876,Seth93,Sethares (1993),interference,#B50000,Bonang
6.231231231231231,-0.23322761882810564,Seth93,Sethares (1993),interference,#B50000,Bonang
6.246246246246246,-0.23190423494699958,Seth93,Sethares (1993),interference,#B50000,Bonang
6.261261261261261,-0.2305784443503487,Seth93,Sethares (1993),interference,#B50000,Bonang
6.276276276276276,-0.22925080751174623,Seth93,Sethares (1993),interference,#B50000,Bonang
6.291291291291291,-0.22792186904512574,Seth93,Sethares (1993),interference,#B50000,Bonang
6.306306306306306,-0.22659215807648708,Seth93,Sethares (1993),interference,#B50000,Bonang
6.321321321321321,-0.22526218860829073,Seth93,Sethares (1993),interference,#B50000,Bonang
6.336336336336336,-0.22393245987667992,Seth93,Sethares (1993),interference,#B50000,Bonang
6.351351351351351,-0.22260345670163206,Seth93,Sethares (1993),interference,#B50000,Bonang
6.366366366366366,-0.22127564983019193,Seth93,Sethares (1993),interference,#B50000,Bonang
6.381381381381381,-0.21994949627291,Seth93,Sethares (1993),interference,#B50000,Bonang
6.396396396396396,-0.21862543963360168,Seth93,Sethares (1993),interference,#B50000,Bonang
6.411411411411412,-0.21730391043256192,Seth93,Sethares (1993),interference,#B50000,Bonang
6.426426426426427,-0.21598532642335339,Seth93,Sethares (1993),interference,#B50000,Bonang
6.441441441441442,-0.21467009290327818,Seth93,Sethares (1993),interference,#B50000,Bonang
6.456456456456457,-0.21335860301767043,Seth93,Sethares (1993),interference,#B50000,Bonang
6.471471471471472,-0.2120512380581016,Seth93,Sethares (1993),interference,#B50000,Bonang
6.486486486486487,-0.21074836775462166,Seth93,Sethares (1993),interference,#B50000,Bonang
6.501501501501502,-0.20945034923516254,Seth93,Sethares (1993),interference,#B50000,Bonang
6.516516516516517,-0.2081575328052146,Seth93,Sethares (1993),interference,#B50000,Bonang
6.531531531531532,-0.2068702536878897,Seth93,Sethares (1993),interference,#B50000,Bonang
6.546546546546547,-0.2055888381741911,Seth93,Sethares (1993),interference,#B50000,Bonang
6.561561561561562,-0.2043136023691804,Seth93,Sethares (1993),interference,#B50000,Bonang
6.576576576576577,-0.20304485245070447,Seth93,Sethares (1993),interference,#B50000,Bonang
6.591591591591592,-0.2017828849228912,Seth93,Sethares (1993),interference,#B50000,Bonang
6.606606606606607,-0.2005279868645084,Seth93,Sethares (1993),interference,#B50000,Bonang
6.621621621621622,-0.19928036054442178,Seth93,Sethares (1993),interference,#B50000,Bonang
6.636636636636637,-0.19804042638313096,Seth93,Sethares (1993),interference,#B50000,Bonang
6.651651651651652,-0.19680831699675272,Seth93,Sethares (1993),interference,#B50000,Bonang
6.666666666666667,-0.19558438779216802,Seth93,Sethares (1993),interference,#B50000,Bonang
6.681681681681682,-0.1943688304339915,Seth93,Sethares (1993),interference,#B50000,Bonang
6.696696696696697,-0.19316188038863558,Seth93,Sethares (1993),interference,#B50000,Bonang
6.711711711711712,-0.19196376529998438,Seth93,Sethares (1993),interference,#B50000,Bonang
6.726726726726727,-0.1907747052000443,Seth93,Sethares (1993),interference,#B50000,Bonang
6.741741741741742,-0.18959491271527176,Seth93,Sethares (1993),interference,#B50000,Bonang
6.756756756756757,-0.18842459326867456,Seth93,Sethares (1993),interference,#B50000,Bonang
6.771771771771772,-0.18726394527772633,Seth93,Sethares (1993),interference,#B50000,Bonang
6.786786786786787,-0.18611316034822786,Seth93,Sethares (1993),interference,#B50000,Bonang
6.801801801801802,-0.18497242346414267,Seth93,Sethares (1993),interference,#B50000,Bonang
6.816816816816817,-0.1838419131735153,Seth93,Sethares (1993),interference,#B50000,Bonang
6.831831831831832,-0.18272180177053354,Seth93,Sethares (1993),interference,#B50000,Bonang
6.846846846846847,-0.18161225547380916,Seth93,Sethares (1993),interference,#B50000,Bonang
6.861861861861862,-0.18051343460094998,Seth93,Sethares (1993),interference,#B50000,Bonang
6.876876876876877,-0.1794254937395027,Seth93,Sethares (1993),interference,#B50000,Bonang
6.891891891891892,-0.1783485819143085,Seth93,Sethares (1993),interference,#B50000,Bonang
6.906906906906907,-0.1772828427513841,Seth93,Sethares (1993),interference,#B50000,Bonang
6.921921921921922,-0.17622841463834746,Seth93,Sethares (1993),interference,#B50000,Bonang
6.936936936936937,-0.17518543088148725,Seth93,Sethares (1993),interference,#B50000,Bonang
6.951951951951952,-0.17415401985952816,Seth93,Sethares (1993),interference,#B50000,Bonang
6.966966966966967,-0.1731343051741517,Seth93,Sethares (1993),interference,#B50000,Bonang
6.981981981981982,-0.17212640579734223,Seth93,Sethares (1993),interference,#B50000,Bonang
6.996996996996997,-0.171130436215619,Seth93,Sethares (1993),interference,#B50000,Bonang
7.012012012012012,-0.17014650657119795,Seth93,Sethares (1993),interference,#B50000,Bonang
7.027027027027027,-0.1691747228001735,Seth93,Sethares (1993),interference,#B50000,Bonang
7.042042042042042,-0.16821518676774339,Seth93,Sethares (1993),interference,#B50000,Bonang
7.057057057057057,-0.16726804239229068,Seth93,Sethares (1993),interference,#B50000,Bonang
7.072072072072072,-0.1663332918382368,Seth93,Sethares (1993),interference,#B50000,Bonang
7.087087087087087,-0.16541107150113216,Seth93,Sethares (1993),interference,#B50000,Bonang
7.102102102102102,-0.16450146825803438,Seth93,Sethares (1993),interference,#B50000,Bonang
7.117117117117117,-0.16360456554906924,Seth93,Sethares (1993),interference,#B50000,Bonang
7.132132132132132,-0.16272044349615328,Seth93,Sethares (1993),interference,#B50000,Bonang
7.147147147147147,-0.1618491790191585,Seth93,Sethares (1993),interference,#B50000,Bonang
7.162162162162162,-0.16099084594954244,Seth93,Sethares (1993),interference,#B50000,Bonang
7.177177177177177,-0.16014551514152187,Seth93,Sethares (1993),interference,#B50000,Bonang
7.192192192192192,-0.15931325458080942,Seth93,Sethares (1993),interference,#B50000,Bonang
7.207207207207207,-0.15849412949097885,Seth93,Sethares (1993),interference,#B50000,Bonang
7.222222222222222,-0.15768820243749299,Seth93,Sethares (1993),interference,#B50000,Bonang
7.237237237237237,-0.1568955334294491,Seth93,Sethares (1993),interference,#B50000,Bonang
7.252252252252252,-0.15611618001906863,Seth93,Sethares (1993),interference,#B50000,Bonang
7.267267267267267,-0.1553501973989982,Seth93,Sethares (1993),interference,#B50000,Bonang
7.282282282282282,-0.15459763849743363,Seth93,Sethares (1993),interference,#B50000,Bonang
7.297297297297297,-0.15385855407113996,Seth93,Sethares (1993),interference,#B50000,Bonang
7.312312312312312,-0.15313299279637826,Seth93,Sethares (1993),interference,#B50000,Bonang
7.327327327327327,-0.1524210013577988,Seth93,Sethares (1993),interference,#B50000,Bonang
7.342342342342342,-0.15172262453532706,Seth93,Sethares (1993),interference,#B50000,Bonang
7.357357357357357,-0.15103790528909006,Seth93,Sethares (1993),interference,#B50000,Bonang
7.372372372372372,-0.15036688484240462,Seth93,Sethares (1993),interference,#B50000,Bonang
7.387387387387387,-0.14970960276288442,Seth93,Sethares (1993),interference,#B50000,Bonang
7.402402402402402,-0.14906609704167734,Seth93,Sethares (1993),interference,#B50000,Bonang
7.4174174174174174,-0.1484364041708876,Seth93,Sethares (1993),interference,#B50000,Bonang
7.4324324324324325,-0.14782055921920365,Seth93,Sethares (1993),interference,#B50000,Bonang
7.4474474474474475,-0.1472185959057686,Seth93,Sethares (1993),interference,#B50000,Bonang
7.4624624624624625,-0.1466305466723234,Seth93,Sethares (1993),interference,#B50000,Bonang
7.4774774774774775,-0.1460564427536608,Seth93,Sethares (1993),interference,#B50000,Bonang
7.4924924924924925,-0.145496314246406,Seth93,Sethares (1993),interference,#B50000,Bonang
7.5075075075075075,-0.14495020275724724,Seth93,Sethares (1993),interference,#B50000,Bonang
7.5225225225225225,-0.14441811138079216,Seth93,Sethares (1993),interference,#B50000,Bonang
7.5375375375375375,-0.14390007954137327,Seth93,Sethares (1993),interference,#B50000,Bonang
7.5525525525525525,-0.14339613343856214,Seth93,Sethares (1993),interference,#B50000,Bonang
7.5675675675675675,-0.1429062984537353,Seth93,Sethares (1993),interference,#B50000,Bonang
7.5825825825825826,-0.14243059920947065,Seth93,Sethares (1993),interference,#B50000,Bonang
7.597597597597598,-0.14196905962747247,Seth93,Sethares (1993),interference,#B50000,Bonang
7.612612612612613,-0.14152170298504219,Seth93,Sethares (1993),interference,#B50000,Bonang
7.627627627627628,-0.14108851242587594,Seth93,Sethares (1993),interference,#B50000,Bonang
7.642642642642643,-0.14066958986459296,Seth93,Sethares (1993),interference,#B50000,Bonang
7.657657657657658,-0.1402648670057302,Seth93,Sethares (1993),interference,#B50000,Bonang
7.672672672672673,-0.1398744646085205,Seth93,Sethares (1993),interference,#B50000,Bonang
7.687687687687688,-0.1394983537501074,Seth93,Sethares (1993),interference,#B50000,Bonang
7.702702702702703,-0.1391365549491569,Seth93,Sethares (1993),interference,#B50000,Bonang
7.717717717717718,-0.1387890884366467,Seth93,Sethares (1993),interference,#B50000,Bonang
7.732732732732733,-0.13845597420155736,Seth93,Sethares (1993),interference,#B50000,Bonang
7.747747747747748,-0.138137232035307,Seth93,Sethares (1993),interference,#B50000,Bonang
7.762762762762763,-0.13783288157495815,Seth93,Sethares (1993),interference,#B50000,Bonang
7.777777777777778,-0.13754294234518172,Seth93,Sethares (1993),interference,#B50000,Bonang
7.792792792792793,-0.1372674337990371,Seth93,Sethares (1993),interference,#B50000,Bonang
7.807807807807808,-0.1370063753575506,Seth93,Sethares (1993),interference,#B50000,Bonang
7.822822822822823,-0.13675978644811387,Seth93,Sethares (1993),interference,#B50000,Bonang
7.837837837837838,-0.1365276865417383,Seth93,Sethares (1993),interference,#B50000,Bonang
7.852852852852853,-0.13631009518915022,Seth93,Sethares (1993),interference,#B50000,Bonang
7.867867867867868,-0.13610703205575583,Seth93,Sethares (1993),interference,#B50000,Bonang
7.882882882882883,-0.13591851695549267,Seth93,Sethares (1993),interference,#B50000,Bonang
7.897897897897898,-0.13574456988355763,Seth93,Sethares (1993),interference,#B50000,Bonang
7.912912912912913,-0.13558521104805715,Seth93,Sethares (1993),interference,#B50000,Bonang
7.927927927927928,-0.1354404609005589,Seth93,Sethares (1993),interference,#B50000,Bonang
7.942942942942943,-0.1353103401655636,Seth93,Sethares (1993),interference,#B50000,Bonang
7.957957957957958,-0.13519486986892365,Seth93,Sethares (1993),interference,#B50000,Bonang
7.972972972972973,-0.13509407136519225,Seth93,Sethares (1993),interference,#B50000,Bonang
7.987987987987988,-0.13500796636392437,Seth93,Sethares (1993),interference,#B50000,Bonang
8.003003003003004,-0.13493657695494118,Seth93,Sethares (1993),interference,#B50000,Bonang
8.018018018018019,-0.13487992563254458,Seth93,Sethares (1993),interference,#B50000,Bonang
8.033033033033034,-0.13483803531872088,Seth93,Sethares (1993),interference,#B50000,Bonang
8.048048048048049,-0.13481097562691324,Seth93,Sethares (1993),interference,#B50000,Bonang
8.063063063063064,-0.134798677903396,Seth93,Sethares (1993),interference,#B50000,Bonang
8.078078078078079,-0.1348012127367888,Seth93,Sethares (1993),interference,#B50000,Bonang
8.093093093093094,-0.13481860497131345,Seth93,Sethares (1993),interference,#B50000,Bonang
8.108108108108109,-0.13485087997955078,Seth93,Sethares (1993),interference,#B50000,Bonang
8.123123123123124,-0.13489806367955148,Seth93,Sethares (1993),interference,#B50000,Bonang
8.138138138138139,-0.1349601825509273,Seth93,Sethares (1993),interference,#B50000,Bonang
8.153153153153154,-0.1350372636499478,Seth93,Sethares (1993),interference,#B50000,Bonang
8.168168168168169,-0.13512933462362203,Seth93,Sethares (1993),interference,#B50000,Bonang
8.183183183183184,-0.13523642372278072,Seth93,Sethares (1993),interference,#B50000,Bonang
8.198198198198199,-0.1353585598141459,Seth93,Sethares (1993),interference,#B50000,Bonang
8.213213213213214,-0.13549577239139424,Seth93,Sethares (1993),interference,#B50000,Bonang
8.228228228228229,-0.1356480915852022,Seth93,Sethares (1993),interference,#B50000,Bonang
8.243243243243244,-0.13581554817227934,Seth93,Sethares (1993),interference,#B50000,Bonang
8.258258258258259,-0.13599817358337674,Seth93,Sethares (1993),interference,#B50000,Bonang
8.273273273273274,-0.13619599991027231,Seth93,Sethares (1993),interference,#B50000,Bonang
8.288288288288289,-0.13640905991171887,Seth93,Sethares (1993),interference,#B50000,Bonang
8.303303303303304,-0.13663738701835718,Seth93,Sethares (1993),interference,#B50000,Bonang
8.318318318318319,-0.1368810153365796,Seth93,Sethares (1993),interference,#B50000,Bonang
8.333333333333334,-0.13713997965134217,Seth93,Sethares (1993),interference,#B50000,Bonang
8.348348348348349,-0.13741431542790516,Seth93,Sethares (1993),interference,#B50000,Bonang
8.363363363363364,-0.1377040588125082,Seth93,Sethares (1993),interference,#B50000,Bonang
8.378378378378379,-0.13800924663195274,Seth93,Sethares (1993),interference,#B50000,Bonang
8.393393393393394,-0.13832991639209477,Seth93,Sethares (1993),interference,#B50000,Bonang
8.408408408408409,-0.13866610627522014,Seth93,Sethares (1993),interference,#B50000,Bonang
8.423423423423424,-0.139017855136305,Seth93,Sethares (1993),interference,#B50000,Bonang
8.438438438438439,-0.13938520249813235,Seth93,Sethares (1993),interference,#B50000,Bonang
8.453453453453454,-0.13976818854526413,Seth93,Sethares (1993),interference,#B50000,Bonang
8.468468468468469,-0.14016685411683472,Seth93,Sethares (1993),interference,#B50000,Bonang
8.483483483483484,-0.14058124069816957,Seth93,Sethares (1993),interference,#B50000,Bonang
8.498498498498499,-0.14101139041119248,Seth93,Sethares (1993),interference,#B50000,Bonang
8.513513513513514,-0.14145737787048804,Seth93,Sethares (1993),interference,#B50000,Bonang
8.528528528528529,-0.1419191830525496,Seth93,Sethares (1993),interference,#B50000,Bonang
8.543543543543544,-0.14239688143919715,Seth93,Sethares (1993),interference,#B50000,Bonang
8.558558558558559,-0.14289051757809465,Seth93,Sethares (1993),interference,#B50000,Bonang
8.573573573573574,-0.14340013658680342,Seth93,Sethares (1993),interference,#B50000,Bonang
8.588588588588589,-0.1439257841355368,Seth93,Sethares (1993),interference,#B50000,Bonang
8.603603603603604,-0.14446750642855818,Seth93,Sethares (1993),interference,#B50000,Bonang
8.618618618618619,-0.14502535585620507,Seth93,Sethares (1993),interference,#B50000,Bonang
8.633633633633634,-0.14559936899450063,Seth93,Sethares (1993),interference,#B50000,Bonang
8.64864864864865,-0.14618955063707037,Seth93,Sethares (1993),interference,#B50000,Bonang
8.663663663663664,-0.14679604464176213,Seth93,Sethares (1993),interference,#B50000,Bonang
8.67867867867868,-0.14741885167479085,Seth93,Sethares (1993),interference,#B50000,Bonang
8.693693693693694,-0.14805802067457738,Seth93,Sethares (1993),interference,#B50000,Bonang
8.70870870870871,-0.14871360094298264,Seth93,Sethares (1993),interference,#B50000,Bonang
8.723723723723724,-0.14938564211479213,Seth93,Sethares (1993),interference,#B50000,Bonang
8.73873873873874,-0.15007419412556675,Seth93,Sethares (1993),interference,#B50000,Bonang
8.753753753753754,-0.15077930717780572,Seth93,Sethares (1993),interference,#B50000,Bonang
8.76876876876877,-0.15150103170540502,Seth93,Sethares (1993),interference,#B50000,Bonang
8.783783783783784,-0.15223941833636007,Seth93,Sethares (1993),interference,#B50000,Bonang
8.7987987987988,-0.15299451785366092,Seth93,Sethares (1993),interference,#B50000,Bonang
8.813813813813814,-0.15376638115436134,Seth93,Sethares (1993),interference,#B50000,Bonang
8.82882882882883,-0.15455505920675036,Seth93,Sethares (1993),interference,#B50000,Bonang
8.843843843843844,-0.15536060300559884,Seth93,Sethares (1993),interference,#B50000,Bonang
8.85885885885886,-0.15618306352542746,Seth93,Sethares (1993),interference,#B50000,Bonang
8.873873873873874,-0.1570224916717386,Seth93,Sethares (1993),interference,#B50000,Bonang
8.88888888888889,-0.1578789382301743,Seth93,Sethares (1993),interference,#B50000,Bonang
8.903903903903904,-0.15875245381354075,Seth93,Sethares (1993),interference,#B50000,Bonang
8.91891891891892,-0.15964308880663813,Seth93,Sethares (1993),interference,#B50000,Bonang
8.933933933933934,-0.16055089330885458,Seth93,Sethares (1993),interference,#B50000,Bonang
8.94894894894895,-0.1614759170744516,Seth93,Sethares (1993),interference,#B50000,Bonang
8.963963963963964,-0.16241820945048616,Seth93,Sethares (1993),interference,#B50000,Bonang
8.97897897897898,-0.16337781931231377,Seth93,Sethares (1993),interference,#B50000,Bonang
8.993993993993994,-0.16435479499659306,Seth93,Sethares (1993),interference,#B50000,Bonang
9.00900900900901,-0.16534918423174105,Seth93,Sethares (1993),interference,#B50000,Bonang
9.024024024024024,-0.1663610340657673,Seth93,Sethares (1993),interference,#B50000,Bonang
9.03903903903904,-0.16739039079140364,Seth93,Sethares (1993),interference,#B50000,Bonang
9.054054054054054,-0.16843734481109077,Seth93,Sethares (1993),interference,#B50000,Bonang
9.06906906906907,-0.16950185076305346,Seth93,Sethares (1993),interference,#B50000,Bonang
9.084084084084084,-0.17058399716253983,Seth93,Sethares (1993),interference,#B50000,Bonang
9.0990990990991,-0.17168382647608596,Seth93,Sethares (1993),interference,#B50000,Bonang
9.114114114114114,-0.17280137999760617,Seth93,Sethares (1993),interference,#B50000,Bonang
9.12912912912913,-0.17393669775576298,Seth93,Sethares (1993),interference,#B50000,Bonang
9.144144144144144,-0.17508981841809185,Seth93,Sethares (1993),interference,#B50000,Bonang
9.15915915915916,-0.17626077919177258,Seth93,Sethares (1993),interference,#B50000,Bonang
9.174174174174174,-0.17744961572098086,Seth93,Sethares (1993),interference,#B50000,Bonang
9.18918918918919,-0.17865636198071225,Seth93,Sethares (1993),interference,#B50000,Bonang
9.204204204204204,-0.17988105016697126,Seth93,Sethares (1993),interference,#B50000,Bonang
9.21921921921922,-0.18112371058325122,Seth93,Sethares (1993),interference,#B50000,Bonang
9.234234234234235,-0.18238437152317175,Seth93,Sethares (1993),interference,#B50000,Bonang
9.24924924924925,-0.18366305914919037,Seth93,Sethares (1993),interference,#B50000,Bonang
9.264264264264265,-0.18495979736727192,Seth93,Sethares (1993),interference,#B50000,Bonang
9.27927927927928,-0.18627460769738963,Seth93,Sethares (1993),interference,#B50000,Bonang
9.294294294294295,-0.1876075091397652,Seth93,Sethares (1993),interference,#B50000,Bonang
9.30930930930931,-0.18895851803671537,Seth93,Sethares (1993),interference,#B50000,Bonang
9.324324324324325,-0.19032764792997245,Seth93,Sethares (1993),interference,#B50000,Bonang
9.33933933933934,-0.19171490941338143,Seth93,Sethares (1993),interference,#B50000,Bonang
9.354354354354355,-0.1931203099808091,Seth93,Sethares (1993),interference,#B50000,Bonang
9.36936936936937,-0.1945438538691575,Seth93,Sethares (1993),interference,#B50000,Bonang
9.384384384384385,-0.1959855418963381,Seth93,Sethares (1993),interference,#B50000,Bonang
9.3993993993994,-0.1974453712940497,Seth93,Sethares (1993),interference,#B50000,Bonang
9.414414414414415,-0.19892333553523892,Seth93,Sethares (1993),interference,#B50000,Bonang
9.42942942942943,-0.200419424156082,Seth93,Sethares (1993),interference,#B50000,Bonang
9.444444444444445,-0.20193362257232103,Seth93,Sethares (1993),interference,#B50000,Bonang
9.45945945945946,-0.20346591188982874,Seth93,Sethares (1993),interference,#B50000,Bonang
9.474474474474475,-0.20501626870920187,Seth93,Sethares (1993),interference,#B50000,Bonang
9.48948948948949,-0.20658466492424604,Seth93,Sethares (1993),interference,#B50000,Bonang
9.504504504504505,-0.20817112509934427,Seth93,Sethares (1993),interference,#B50000,Bonang
9.51951951951952,-0.20977549630008543,Seth93,Sethares (1993),interference,#B50000,Bonang
9.534534534534535,-0.21139779222388777,Seth93,Sethares (1993),interference,#B50000,Bonang
9.54954954954955,-0.21303796379350212,Seth93,Sethares (1993),interference,#B50000,Bonang
9.564564564564565,-0.2146959561192961,Seth93,Sethares (1993),interference,#B50000,Bonang
9.57957957957958,-0.21637170825723537,Seth93,Sethares (1993),interference,#B50000,Bonang
9.594594594594595,-0.21806515295942125,Seth93,Sethares (1993),interference,#B50000,Bonang
9.60960960960961,-0.21977621641700895,Seth93,Sethares (1993),interference,#B50000,Bonang
9.624624624624625,-0.22150487512081796,Seth93,Sethares (1993),interference,#B50000,Bonang
9.63963963963964,-0.22325092788303852,Seth93,Sethares (1993),interference,#B50000,Bonang
9.654654654654655,-0.2250142899250549,Seth93,Sethares (1993),interference,#B50000,Bonang
9.66966966966967,-0.2267949504721324,Seth93,Sethares (1993),interference,#B50000,Bonang
9.684684684684685,-0.22859275275291838,Seth93,Sethares (1993),interference,#B50000,Bonang
9.6996996996997,-0.23040757773816303,Seth93,Sethares (1993),interference,#B50000,Bonang
9.714714714714715,-0.2322392978053856,Seth93,Sethares (1993),interference,#B50000,Bonang
9.72972972972973,-0.23408777641244816,Seth93,Sethares (1993),interference,#B50000,Bonang
9.744744744744745,-0.23595286776133031,Seth93,Sethares (1993),interference,#B50000,Bonang
9.75975975975976,-0.23783441645184014,Seth93,Sethares (1993),interference,#B50000,Bonang
9.774774774774775,-0.239732257124968,Seth93,Sethares (1993),interference,#B50000,Bonang
9.78978978978979,-0.24164621409561396,Seth93,Sethares (1993),interference,#B50000,Bonang
9.804804804804805,-0.2435761009743637,Seth93,Sethares (1993),interference,#B50000,Bonang
9.81981981981982,-0.24552172027803415,Seth93,Sethares (1993),interference,#B50000,Bonang
9.834834834834835,-0.2474828630286573,Seth93,Sethares (1993),interference,#B50000,Bonang
9.84984984984985,-0.24945930834059574,Seth93,Sethares (1993),interference,#B50000,Bonang
9.864864864864865,-0.2514508229954349,Seth93,Sethares (1993),interference,#B50000,Bonang
9.87987987987988,-0.25345716100434273,Seth93,Sethares (1993),interference,#B50000,Bonang
9.894894894894895,-0.25547806315751354,Seth93,Sethares (1993),interference,#B50000,Bonang
9.90990990990991,-0.2575132565603758,Seth93,Sethares (1993),interference,#B50000,Bonang
9.924924924924925,-0.2595624541561511,Seth93,Sethares (1993),interference,#B50000,Bonang
9.93993993993994,-0.2616253542344241,Seth93,Sethares (1993),interference,#B50000,Bonang
9.954954954954955,-0.2637016399253112,Seth93,Sethares (1993),interference,#B50000,Bonang
9.96996996996997,-0.26579097867883555,Seth93,Sethares (1993),interference,#B50000,Bonang
9.984984984984985,-0.26789302172909607,Seth93,Sethares (1993),interference,#B50000,Bonang
10,-0.270007403542814,Seth93,Sethares (1993),interference,#B50000,Bonang
10.015015015015015,-0.27213374125180617,Seth93,Sethares (1993),interference,#B50000,Bonang
10.03003003003003,-0.27427163406897015,Seth93,Sethares (1993),interference,#B50000,Bonang
10.045045045045045,-0.27642066268728654,Seth93,Sethares (1993),interference,#B50000,Bonang
10.06006006006006,-0.278580431998587,Seth93,Sethares (1993),interference,#B50000,Bonang
10.075075075075075,-0.2807503970840965,Seth93,Sethares (1993),interference,#B50000,Bonang
10.09009009009009,-0.28293012265592454,Seth93,Sethares (1993),interference,#B50000,Bonang
10.105105105105105,-0.2851191089615177,Seth93,Sethares (1993),interference,#B50000,Bonang
10.12012012012012,-0.28731683445211326,Seth93,Sethares (1993),interference,#B50000,Bonang
10.135135135135135,-0.28952275506962566,Seth93,Sethares (1993),interference,#B50000,Bonang
10.15015015015015,-0.29173630351303026,Seth93,Sethares (1993),interference,#B50000,Bonang
10.165165165165165,-0.2939568884836126,Seth93,Sethares (1993),interference,#B50000,Bonang
10.18018018018018,-0.2961838939085585,Seth93,Sethares (1993),interference,#B50000,Bonang
10.195195195195195,-0.29841667814226186,Seth93,Sethares (1993),interference,#B50000,Bonang
10.21021021021021,-0.3006545731447191,Seth93,Sethares (1993),interference,#B50000,Bonang
10.225225225225225,-0.30289688363641354,Seth93,Sethares (1993),interference,#B50000,Bonang
10.24024024024024,-0.30514288622902913,Seth93,Sethares (1993),interference,#B50000,Bonang
10.255255255255255,-0.3073918285313005,Seth93,Sethares (1993),interference,#B50000,Bonang
10.27027027027027,-0.30964292822937234,Seth93,Sethares (1993),interference,#B50000,Bonang
10.285285285285285,-0.31189537214090296,Seth93,Sethares (1993),interference,#B50000,Bonang
10.3003003003003,-0.31414831524224085,Seth93,Sethares (1993),interference,#B50000,Bonang
10.315315315315315,-0.31640087966791464,Seth93,Sethares (1993),interference,#B50000,Bonang
10.33033033033033,-0.3186521536816572,Seth93,Sethares (1993),interference,#B50000,Bonang
10.345345345345345,-0.320901190618222,Seth93,Sethares (1993),interference,#B50000,Bonang
10.36036036036036,-0.323147007795165,Seth93,Sethares (1993),interference,#B50000,Bonang
10.375375375375375,-0.325388585393755,Seth93,Sethares (1993),interference,#B50000,Bonang
10.39039039039039,-0.3276248653082103,Seth93,Sethares (1993),interference,#B50000,Bonang
10.405405405405405,-0.3298547499623423,Seth93,Sethares (1993),interference,#B50000,Bonang
10.42042042042042,-0.3320771010927497,Seth93,Sethares (1993),interference,#B50000,Bonang
10.435435435435435,-0.33429073849763974,Seth93,Sethares (1993),interference,#B50000,Bonang
10.45045045045045,-0.33649443875030893,Seth93,Sethares (1993),interference,#B50000,Bonang
10.465465465465465,-0.3386869338763584,Seth93,Sethares (1993),interference,#B50000,Bonang
10.48048048048048,-0.3408669099936289,Seth93,Sethares (1993),interference,#B50000,Bonang
10.495495495495495,-0.34303300591382063,Seth93,Sethares (1993),interference,#B50000,Bonang
10.51051051051051,-0.34518387439180453,Seth93,Sethares (1993),interference,#B50000,Bonang
10.525525525525525,-0.3473179292807935,Seth93,Sethares (1993),interference,#B50000,Bonang
10.54054054054054,-0.34943372195282335,Seth93,Sethares (1993),interference,#B50000,Bonang
10.555555555555555,-0.35152968720706196,Seth93,Sethares (1993),interference,#B50000,Bonang
10.57057057057057,-0.3536042049325654,Seth93,Sethares (1993),interference,#B50000,Bonang
10.585585585585585,-0.3556555984571204,Seth93,Sethares (1993),interference,#B50000,Bonang
10.6006006006006,-0.35768213284985534,Seth93,Sethares (1993),interference,#B50000,Bonang
10.615615615615615,-0.3596820131763278,Seth93,Sethares (1993),interference,#B50000,Bonang
10.63063063063063,-0.36165345822130046,Seth93,Sethares (1993),interference,#B50000,Bonang
10.645645645645645,-0.36359439543930655,Seth93,Sethares (1993),interference,#B50000,Bonang
10.66066066066066,-0.3655028713034823,Seth93,Sethares (1993),interference,#B50000,Bonang
10.675675675675675,-0.36737692081723683,Seth93,Sethares (1993),interference,#B50000,Bonang
10.69069069069069,-0.3692143768826346,Seth93,Sethares (1993),interference,#B50000,Bonang
10.705705705705705,-0.37101304506953986,Seth93,Sethares (1993),interference,#B50000,Bonang
10.72072072072072,-0.3727706572863946,Seth93,Sethares (1993),interference,#B50000,Bonang
10.735735735735735,-0.37448486960560273,Seth93,Sethares (1993),interference,#B50000,Bonang
10.75075075075075,-0.3761532600284346,Seth93,Sethares (1993),interference,#B50000,Bonang
10.765765765765765,-0.3777733261877833,Seth93,Sethares (1993),interference,#B50000,Bonang
10.78078078078078,-0.3793424829871,Seth93,Sethares (1993),interference,#B50000,Bonang
10.795795795795796,-0.3808580601737754,Seth93,Sethares (1993),interference,#B50000,Bonang
10.81081081081081,-0.3823172998451683,Seth93,Sethares (1993),interference,#B50000,Bonang
10.825825825825826,-0.38371735388548317,Seth93,Sethares (1993),interference,#B50000,Bonang
10.84084084084084,-0.3850552813316032,Seth93,Sethares (1993),interference,#B50000,Bonang
10.855855855855856,-0.38632804566593754,Seth93,Sethares (1993),interference,#B50000,Bonang
10.87087087087087,-0.38753251203434363,Seth93,Sethares (1993),interference,#B50000,Bonang
10.885885885885886,-0.38866544438704914,Seth93,Sethares (1993),interference,#B50000,Bonang
10.9009009009009,-0.38972350254051613,Seth93,Sethares (1993),interference,#B50000,Bonang
10.915915915915916,-0.3907032391581003,Seth93,Sethares (1993),interference,#B50000,Bonang
10.93093093093093,-0.39160109664728543,Seth93,Sethares (1993),interference,#B50000,Bonang
10.945945945945946,-0.3924134039712672,Seth93,Sethares (1993),interference,#B50000,Bonang
10.96096096096096,-0.3931363733725422,Seth93,Sethares (1993),interference,#B50000,Bonang
10.975975975975976,-0.3937660970061212,Seth93,Sethares (1993),interference,#B50000,Bonang
10.99099099099099,-0.3942985434799454,Seth93,Sethares (1993),interference,#B50000,Bonang
11.006006006006006,-0.39472955429995804,Seth93,Sethares (1993),interference,#B50000,Bonang
11.02102102102102,-0.39505484021728704,Seth93,Sethares (1993),interference,#B50000,Bonang
11.036036036036036,-0.3952699774748715,Seth93,Sethares (1993),interference,#B50000,Bonang
11.05105105105105,-0.3953704456875474,Seth93,Sethares (1993),interference,#B50000,Bonang
11.066066066066066,-0.39535145690842133,Seth93,Sethares (1993),interference,#B50000,Bonang
11.08108108108108,-0.39520820204964213,Seth93,Sethares (1993),interference,#B50000,Bonang
11.096096096096096,-0.39493567967995724,Seth93,Sethares (1993),interference,#B50000,Bonang
11.11111111111111,-0.39452873348706496,Seth93,Sethares (1993),interference,#B50000,Bonang
11.126126126126126,-0.3939820478612365,Seth93,Sethares (1993),interference,#B50000,Bonang
11.14114114114114,-0.3932901433577603,Seth93,Sethares (1993),interference,#B50000,Bonang
11.156156156156156,-0.3924473720349358,Seth93,Sethares (1993),interference,#B50000,Bonang
11.17117117117117,-0.3914479126642573,Seth93,Sethares (1993),interference,#B50000,Bonang
11.186186186186186,-0.3902857658093527,Seth93,Sethares (1993),interference,#B50000,Bonang
11.2012012012012,-0.38895474877011593,Seth93,Sethares (1993),interference,#B50000,Bonang
11.216216216216216,-0.38744849038841855,Seth93,Sethares (1993),interference,#B50000,Bonang
11.23123123123123,-0.38576042571165226,Seth93,Sethares (1993),interference,#B50000,Bonang
11.246246246246246,-0.38388379051027277,Seth93,Sethares (1993),interference,#B50000,Bonang
11.26126126126126,-0.3818116156454274,Seth93,Sethares (1993),interference,#B50000,Bonang
11.276276276276276,-0.3795367212825976,Seth93,Sethares (1993),interference,#B50000,Bonang
11.29129129129129,-0.37705171094712797,Seth93,Sethares (1993),interference,#B50000,Bonang
11.306306306306306,-0.37434896541738594,Seth93,Sethares (1993),interference,#B50000,Bonang
11.32132132132132,-0.3714206364511518,Seth93,Sethares (1993),interference,#B50000,Bonang
11.336336336336336,-0.3682586403407878,Seth93,Sethares (1993),interference,#B50000,Bonang
11.35135135135135,-0.3648546512925499,Seth93,Sethares (1993),interference,#B50000,Bonang
11.366366366366366,-0.3612000946252994,Seth93,Sethares (1993),interference,#B50000,Bonang
11.381381381381381,-0.35728613978380347,Seth93,Sethares (1993),interference,#B50000,Bonang
11.396396396396396,-0.3531036931615672,Seth93,Sethares (1993),interference,#B50000,Bonang
11.411411411411411,-0.34864339072812717,Seth93,Sethares (1993),interference,#B50000,Bonang
11.426426426426426,-0.3438955904555367,Seth93,Sethares (1993),interference,#B50000,Bonang
11.441441441441441,-0.33885036453859657,Seth93,Sethares (1993),interference,#B50000,Bonang
11.456456456456456,-0.3334974914033671,Seth93,Sethares (1993),interference,#B50000,Bonang
11.471471471471471,-0.32782644749820267,Seth93,Sethares (1993),interference,#B50000,Bonang
11.486486486486486,-0.32182639886146086,Seth93,Sethares (1993),interference,#B50000,Bonang
11.501501501501501,-0.3154860531667741,Seth93,Sethares (1993),interference,#B50000,Bonang
11.516516516516516,-0.3087942004895007,Seth93,Sethares (1993),interference,#B50000,Bonang
11.531531531531531,-0.30173889071662663,Seth93,Sethares (1993),interference,#B50000,Bonang
11.546546546546546,-0.294307959238921,Seth93,Sethares (1993),interference,#B50000,Bonang
11.561561561561561,-0.28648888531040967,Seth93,Sethares (1993),interference,#B50000,Bonang
11.576576576576576,-0.27826878214452133,Seth93,Sethares (1993),interference,#B50000,Bonang
11.591591591591591,-0.26963438674137824,Seth93,Sethares (1993),interference,#B50000,Bonang
11.606606606606606,-0.26057204943900575,Seth93,Sethares (1993),interference,#B50000,Bonang
11.621621621621621,-0.25106728268657313,Seth93,Sethares (1993),interference,#B50000,Bonang
11.636636636636636,-0.24110649053847577,Seth93,Sethares (1993),interference,#B50000,Bonang
11.651651651651651,-0.23067433554187283,Seth93,Sethares (1993),interference,#B50000,Bonang
11.666666666666666,-0.21975559605466724,Seth93,Sethares (1993),interference,#B50000,Bonang
11.681681681681681,-0.2083344796640263,Seth93,Sethares (1993),interference,#B50000,Bonang
11.696696696696696,-0.19639478086980336,Seth93,Sethares (1993),interference,#B50000,Bonang
11.711711711711711,-0.18391982599025988,Seth93,Sethares (1993),interference,#B50000,Bonang
11.726726726726726,-0.17089246022075658,Seth93,Sethares (1993),interference,#B50000,Bonang
11.741741741741741,-0.15729503434219005,Seth93,Sethares (1993),interference,#B50000,Bonang
11.756756756756756,-0.14310939106968948,Seth93,Sethares (1993),interference,#B50000,Bonang
11.771771771771771,-0.12980443944518694,Seth93,Sethares (1993),interference,#B50000,Bonang
11.786786786786786,-0.1351165842627237,Seth93,Sethares (1993),interference,#B50000,Bonang
11.801801801801801,-0.13982219744456315,Seth93,Sethares (1993),interference,#B50000,Bonang
11.816816816816816,-0.14392877616139732,Seth93,Sethares (1993),interference,#B50000,Bonang
11.831831831831831,-0.14744335576243747,Seth93,Sethares (1993),interference,#B50000,Bonang
11.846846846846846,-0.1503725148074315,Seth93,Sethares (1993),interference,#B50000,Bonang
11.861861861861861,-0.1527223798500527,Seth93,Sethares (1993),interference,#B50000,Bonang
11.876876876876876,-0.15449862997509672,Seth93,Sethares (1993),interference,#B50000,Bonang
11.891891891891891,-0.1557065010913238,Seth93,Sethares (1993),interference,#B50000,Bonang
11.906906906906906,-0.15635078998205384,Seth93,Sethares (1993),interference,#B50000,Bonang
11.921921921921921,-0.15643585811539812,Seth93,Sethares (1993),interference,#B50000,Bonang
11.936936936936936,-0.15596563521573933,Seth93,Sethares (1993),interference,#B50000,Bonang
11.951951951951951,-0.15494362259836233,Seth93,Sethares (1993),interference,#B50000,Bonang
11.966966966966966,-0.1533728962685798,Seth93,Sethares (1993),interference,#B50000,Bonang
11.981981981981981,-0.1512561097867871,Seth93,Sethares (1993),interference,#B50000,Bonang
11.996996996996996,-0.1485954969009931,Seth93,Sethares (1993),interference,#B50000,Bonang
12.012012012012011,-0.15847191734367813,Seth93,Sethares (1993),interference,#B50000,Bonang
12.027027027027026,-0.171096190018787,Seth93,Sethares (1993),interference,#B50000,Bonang
12.042042042042041,-0.18321436434522553,Seth93,Sethares (1993),interference,#B50000,Bonang
12.057057057057056,-0.19484076542080436,Seth93,Sethares (1993),interference,#B50000,Bonang
12.072072072072071,-0.20598925055876274,Seth93,Sethares (1993),interference,#B50000,Bonang
12.087087087087086,-0.2166734580710365,Seth93,Sethares (1993),interference,#B50000,Bonang
12.102102102102101,-0.22690665421909045,Seth93,Sethares (1993),interference,#B50000,Bonang
12.117117117117116,-0.2367017808611065,Seth93,Sethares (1993),interference,#B50000,Bonang
12.132132132132131,-0.24607146276541625,Seth93,Sethares (1993),interference,#B50000,Bonang
12.147147147147146,-0.25502801476922127,Seth93,Sethares (1993),interference,#B50000,Bonang
12.162162162162161,-0.26358344878599754,Seth93,Sethares (1993),interference,#B50000,Bonang
12.177177177177176,-0.27174948066440374,Seth93,Sethares (1993),interference,#B50000,Bonang
12.192192192192191,-0.2795375369017893,Seth93,Sethares (1993),interference,#B50000,Bonang
12.207207207207206,-0.28695876121521624,Seth93,Sethares (1993),interference,#B50000,Bonang
12.222222222222221,-0.29402402097287356,Seth93,Sethares (1993),interference,#B50000,Bonang
12.237237237237236,-0.3007439134886543,Seth93,Sethares (1993),interference,#B50000,Bonang
12.252252252252251,-0.30712877218277684,Seth93,Sethares (1993),interference,#B50000,Bonang
12.267267267267266,-0.31318867261100297,Seth93,Sethares (1993),interference,#B50000,Bonang
12.282282282282281,-0.31893343836526694,Seth93,Sethares (1993),interference,#B50000,Bonang
12.297297297297296,-0.32437264684824174,Seth93,Sethares (1993),interference,#B50000,Bonang
12.312312312312311,-0.329515634924391,Seth93,Sethares (1993),interference,#B50000,Bonang
12.327327327327327,-0.3343715044500847,Seth93,Sethares (1993),interference,#B50000,Bonang
12.342342342342342,-0.33894912768517965,Seth93,Sethares (1993),interference,#B50000,Bonang
12.357357357357357,-0.343257152588486,Seth93,Sethares (1993),interference,#B50000,Bonang
12.372372372372372,-0.3473040079995436,Seth93,Sethares (1993),interference,#B50000,Bonang
12.387387387387387,-0.3510979087089286,Seth93,Sethares (1993),interference,#B50000,Bonang
12.402402402402402,-0.35464686041946936,Seth93,Sethares (1993),interference,#B50000,Bonang
12.417417417417417,-0.35795866460054754,Seth93,Sethares (1993),interference,#B50000,Bonang
12.432432432432432,-0.36104092323766385,Seth93,Sethares (1993),interference,#B50000,Bonang
12.447447447447447,-0.3639010434794631,Seth93,Sethares (1993),interference,#B50000,Bonang
12.462462462462462,-0.3665462421842838,Seth93,Sethares (1993),interference,#B50000,Bonang
12.477477477477477,-0.36898355036829417,Seth93,Sethares (1993),interference,#B50000,Bonang
12.492492492492492,-0.37121981755727906,Seth93,Sethares (1993),interference,#B50000,Bonang
12.507507507507507,-0.3732618534878152,Seth93,Sethares (1993),interference,#B50000,Bonang
12.522522522522522,-0.37511587506550836,Seth93,Sethares (1993),interference,#B50000,Bonang
12.537537537537537,-0.37678835759946694,Seth93,Sethares (1993),interference,#B50000,Bonang
12.552552552552552,-0.37828546630824395,Seth93,Sethares (1993),interference,#B50000,Bonang
12.567567567567567,-0.3796132053013404,Seth93,Sethares (1993),interference,#B50000,Bonang
12.582582582582582,-0.3807774213930394,Seth93,Sethares (1993),interference,#B50000,Bonang
12.597597597597597,-0.3817838078329375,Seth93,Sethares (1993),interference,#B50000,Bonang
12.612612612612612,-0.3826379079549254,Seth93,Sethares (1993),interference,#B50000,Bonang
12.627627627627627,-0.38334507919959054,Seth93,Sethares (1993),interference,#B50000,Bonang
12.642642642642642,-0.3839106514564836,Seth93,Sethares (1993),interference,#B50000,Bonang
12.657657657657657,-0.38433966258297847,Seth93,Sethares (1993),interference,#B50000,Bonang
12.672672672672672,-0.38463717276266657,Seth93,Sethares (1993),interference,#B50000,Bonang
12.687687687687687,-0.3848079869301757,Seth93,Sethares (1993),interference,#B50000,Bonang
12.702702702702702,-0.3848568211907659,Seth93,Sethares (1993),interference,#B50000,Bonang
12.717717717717717,-0.3847882651314221,Seth93,Sethares (1993),interference,#B50000,Bonang
12.732732732732732,-0.38460678487556593,Seth93,Sethares (1993),interference,#B50000,Bonang
12.747747747747747,-0.3843167260702936,Seth93,Sethares (1993),interference,#B50000,Bonang
12.762762762762762,-0.383922316807547,Seth93,Sethares (1993),interference,#B50000,Bonang
12.777777777777777,-0.38342767048059584,Seth93,Sethares (1993),interference,#B50000,Bonang
12.792792792792792,-0.38283678857721465,Seth93,Sethares (1993),interference,#B50000,Bonang
12.807807807807807,-0.38215356341084794,Seth93,Sethares (1993),interference,#B50000,Bonang
12.822822822822824,-0.38138178079108503,Seth93,Sethares (1993),interference,#B50000,Bonang
12.837837837837839,-0.38052512263473665,Seth93,Sethares (1993),interference,#B50000,Bonang
12.852852852852854,-0.3795871695187307,Seth93,Sethares (1993),interference,#B50000,Bonang
12.867867867867869,-0.378571403176078,Seth93,Sethares (1993),interference,#B50000,Bonang
12.882882882882884,-0.37748120893611,Seth93,Sethares (1993),interference,#B50000,Bonang
12.897897897897899,-0.3763198781101369,Seth93,Sethares (1993),interference,#B50000,Bonang
12.912912912912914,-0.37509061032372565,Seth93,Sethares (1993),interference,#B50000,Bonang
12.927927927927929,-0.3737965157966878,Seth93,Sethares (1993),interference,#B50000,Bonang
12.942942942942944,-0.3724406175718899,Seth93,Sethares (1993),interference,#B50000,Bonang
12.957957957957959,-0.371025853694004,Seth93,Sethares (1993),interference,#B50000,Bonang
12.972972972972974,-0.36955507933921045,Seth93,Sethares (1993),interference,#B50000,Bonang
12.987987987987989,-0.3680310688969317,Seth93,Sethares (1993),interference,#B50000,Bonang
13.003003003003004,-0.36645651800460644,Seth93,Sethares (1993),interference,#B50000,Bonang
13.018018018018019,-0.3648340455364798,Seth93,Sethares (1993),interference,#B50000,Bonang
13.033033033033034,-0.36316619554743196,Seth93,Sethares (1993),interference,#B50000,Bonang
13.048048048048049,-0.36145547781910753,Seth93,Sethares (1993),interference,#B50000,Bonang
13.063063063063064,-0.35970421510883643,Seth93,Sethares (1993),interference,#B50000,Bonang
13.078078078078079,-0.35791477690941786,Seth93,Sethares (1993),interference,#B50000,Bonang
13.093093093093094,-0.35608942656978854,Seth93,Sethares (1993),interference,#B50000,Bonang
13.108108108108109,-0.35423036169663014,Seth93,Sethares (1993),interference,#B50000,Bonang
13.123123123123124,-0.35233971584770357,Seth93,Sethares (1993),interference,#B50000,Bonang
13.138138138138139,-0.350419560186482,Seth93,Sethares (1993),interference,#B50000,Bonang
13.153153153153154,-0.3484719050989462,Seth93,Sethares (1993),interference,#B50000,Bonang
13.168168168168169,-0.3464987017733172,Seth93,Sethares (1993),interference,#B50000,Bonang
13.183183183183184,-0.34450184374353415,Seth93,Sethares (1993),interference,#B50000,Bonang
13.198198198198199,-0.3424831683972616,Seth93,Sethares (1993),interference,#B50000,Bonang
13.213213213213214,-0.34044445844916715,Seth93,Sethares (1993),interference,#B50000,Bonang
13.228228228228229,-0.3383874433802214,Seth93,Sethares (1993),interference,#B50000,Bonang
13.243243243243244,-0.33631380084376317,Seth93,Sethares (1993),interference,#B50000,Bonang
13.258258258258259,-0.33422515803900305,Seth93,Sethares (1993),interference,#B50000,Bonang
13.273273273273274,-0.33212309305271087,Seth93,Sethares (1993),interference,#B50000,Bonang
13.288288288288289,-0.33000913616973293,Seth93,Sethares (1993),interference,#B50000,Bonang
13.303303303303304,-0.3278847711530122,Seth93,Sethares (1993),interference,#B50000,Bonang
13.318318318318319,-0.32575143649379135,Seth93,Sethares (1993),interference,#B50000,Bonang
13.333333333333334,-0.3236105266325928,Seth93,Sethares (1993),interference,#B50000,Bonang
13.348348348348349,-0.3214633931516391,Seth93,Sethares (1993),interference,#B50000,Bonang
13.363363363363364,-0.31931134593930804,Seth93,Sethares (1993),interference,#B50000,Bonang
13.378378378378379,-0.3171556543272165,Seth93,Sethares (1993),interference,#B50000,Bonang
13.393393393393394,-0.3149975482005282,Seth93,Sethares (1993),interference,#B50000,Bonang
13.408408408408409,-0.3128382190820572,Seth93,Sethares (1993),interference,#B50000,Bonang
13.423423423423424,-0.3106788211907009,Seth93,Sethares (1993),interference,#B50000,Bonang
13.438438438438439,-0.3085204724748,Seth93,Sethares (1993),interference,#B50000,Bonang
13.453453453453454,-0.306364255620902,Seth93,Sethares (1993),interference,#B50000,Bonang
13.468468468468469,-0.30421121903848586,Seth93,Sethares (1993),interference,#B50000,Bonang
13.483483483483484,-0.3020623778211573,Seth93,Sethares (1993),interference,#B50000,Bonang
13.498498498498499,-0.2999187146847915,Seth93,Sethares (1993),interference,#B50000,Bonang
13.513513513513514,-0.29778111023888354,Seth93,Sethares (1993),interference,#B50000,Bonang
13.528528528528529,-0.29565062598307507,Seth93,Sethares (1993),interference,#B50000,Bonang
13.543543543543544,-0.29352808277458686,Seth93,Sethares (1993),interference,#B50000,Bonang
13.558558558558559,-0.2914143427548076,Seth93,Sethares (1993),interference,#B50000,Bonang
13.573573573573574,-0.2893102400492358,Seth93,Sethares (1993),interference,#B50000,Bonang
13.588588588588589,-0.2872165815772257,Seth93,Sethares (1993),interference,#B50000,Bonang
13.603603603603604,-0.28513414784188723,Seth93,Sethares (1993),interference,#B50000,Bonang
13.618618618618619,-0.2830636308431269,Seth93,Sethares (1993),interference,#B50000,Bonang
13.633633633633634,-0.28100588734971454,Seth93,Sethares (1993),interference,#B50000,Bonang
13.64864864864865,-0.2789615200304224,Seth93,Sethares (1993),interference,#B50000,Bonang
13.663663663663664,-0.2769312896586791,Seth93,Sethares (1993),interference,#B50000,Bonang
13.67867867867868,-0.27491581661543385,Seth93,Sethares (1993),interference,#B50000,Bonang
13.693693693693694,-0.27291573843186534,Seth93,Sethares (1993),interference,#B50000,Bonang
13.70870870870871,-0.27093167122938105,Seth93,Sethares (1993),interference,#B50000,Bonang
13.723723723723724,-0.2689642103646314,Seth93,Sethares (1993),interference,#B50000,Bonang
13.73873873873874,-0.26701393105799004,Seth93,Sethares (1993),interference,#B50000,Bonang
13.753753753753754,-0.26508138900585665,Seth93,Sethares (1993),interference,#B50000,Bonang
13.76876876876877,-0.2631671209771147,Seth93,Sethares (1993),interference,#B50000,Bonang
13.783783783783784,-0.2612716453940104,Seth93,Sethares (1993),interference,#B50000,Bonang
13.7987987987988,-0.25939546289778415,Seth93,Sethares (1993),interference,#B50000,Bonang
13.813813813813814,-0.2575390568993519,Seth93,Sethares (1993),interference,#B50000,Bonang
13.82882882882883,-0.25570289411527014,Seth93,Sethares (1993),interference,#B50000,Bonang
13.843843843843844,-0.2538874250893334,Seth93,Sethares (1993),interference,#B50000,Bonang
13.85885885885886,-0.2520930847000006,Seth93,Sethares (1993),interference,#B50000,Bonang
13.873873873873874,-0.2503202926539414,Seth93,Sethares (1993),interference,#B50000,Bonang
13.88888888888889,-0.24856945396596306,Seth93,Sethares (1993),interference,#B50000,Bonang
13.903903903903904,-0.24684095942552642,Seth93,Sethares (1993),interference,#B50000,Bonang
13.91891891891892,-0.2451351860501056,Seth93,Sethares (1993),interference,#B50000,Bonang
13.933933933933934,-0.24345249752562836,Seth93,Sethares (1993),interference,#B50000,Bonang
13.94894894894895,-0.2417932446341739,Seth93,Sethares (1993),interference,#B50000,Bonang
13.963963963963964,-0.24015776566919192,Seth93,Sethares (1993),interference,#B50000,Bonang
13.97897897897898,-0.23854638683840085,Seth93,Sethares (1993),interference,#B50000,Bonang
13.993993993993994,-0.23695942265457676,Seth93,Sethares (1993),interference,#B50000,Bonang
14.00900900900901,-0.23539717631443421,Seth93,Sethares (1993),interference,#B50000,Bonang
14.024024024024024,-0.23385994006575012,Seth93,Sethares (1993),interference,#B50000,Bonang
14.03903903903904,-0.23234799556291977,Seth93,Sethares (1993),interference,#B50000,Bonang
14.054054054054054,-0.23086165138712963,Seth93,Sethares (1993),interference,#B50000,Bonang
14.06906906906907,-0.22940109465372352,Seth93,Sethares (1993),interference,#B50000,Bonang
14.084084084084084,-0.22796661445454286,Seth93,Sethares (1993),interference,#B50000,Bonang
14.0990990990991,-0.22655845340025116,Seth93,Sethares (1993),interference,#B50000,Bonang
14.114114114114114,-0.22517684511785896,Seth93,Sethares (1993),interference,#B50000,Bonang
14.12912912912913,-0.22382201454006195,Seth93,Sethares (1993),interference,#B50000,Bonang
14.144144144144144,-0.22249417818398817,Seth93,Sethares (1993),interference,#B50000,Bonang
14.15915915915916,-0.22119354441948036,Seth93,Sethares (1993),interference,#B50000,Bonang
14.174174174174174,-0.21992031372703877,Seth93,Sethares (1993),interference,#B50000,Bonang
14.18918918918919,-0.21867467894547668,Seth93,Sethares (1993),interference,#B50000,Bonang
14.204204204204204,-0.21745682550942916,Seth93,Sethares (1993),interference,#B50000,Bonang
14.21921921921922,-0.2162669316767598,Seth93,Sethares (1993),interference,#B50000,Bonang
14.234234234234235,-0.21510516874595131,Seth93,Sethares (1993),interference,#B50000,Bonang
14.24924924924925,-0.2139717012635675,Seth93,Sethares (1993),interference,#B50000,Bonang
14.264264264264265,-0.21286668722181468,Seth93,Sethares (1993),interference,#B50000,Bonang
14.27927927927928,-0.21179027824626992,Seth93,Sethares (1993),interference,#B50000,Bonang
14.294294294294295,-0.2107426197738376,Seth93,Sethares (1993),interference,#B50000,Bonang
14.30930930930931,-0.20972385122093223,Seth93,Sethares (1993),interference,#B50000,Bonang
14.324324324324325,-0.2087341061419621,Seth93,Sethares (1993),interference,#B50000,Bonang
14.33933933933934,-0.2077735123780978,Seth93,Sethares (1993),interference,#B50000,Bonang
14.354354354354355,-0.2068421921963551,Seth93,Sethares (1993),interference,#B50000,Bonang
14.36936936936937,-0.20594026241901014,Seth93,Sethares (1993),interference,#B50000,Bonang
14.384384384384385,-0.205067834543321,Seth93,Sethares (1993),interference,#B50000,Bonang
14.3993993993994,-0.20422501485155217,Seth93,Sethares (1993),interference,#B50000,Bonang
14.414414414414415,-0.2034119045113033,Seth93,Sethares (1993),interference,#B50000,Bonang
14.42942942942943,-0.20262859966608085,Seth93,Sethares (1993),interference,#B50000,Bonang
14.444444444444445,-0.20187519151611025,Seth93,Sethares (1993),interference,#B50000,Bonang
14.45945945945946,-0.20115176638932294,Seth93,Sethares (1993),interference,#B50000,Bonang
14.474474474474475,-0.20045840580246402,Seth93,Sethares (1993),interference,#B50000,Bonang
14.48948948948949,-0.1997951865122884,Seth93,Sethares (1993),interference,#B50000,Bonang
14.504504504504505,-0.1991621268441834,Seth93,Sethares (1993),interference,#B50000,Bonang
14.51951951951952,-0.19855940219512333,Seth93,Sethares (1993),interference,#B50000,Bonang
14.534534534534535,-0.19798702091779713,Seth93,Sethares (1993),interference,#B50000,Bonang
14.54954954954955,-0.19744504103933685,Seth93,Sethares (1993),interference,#B50000,Bonang
14.564564564564565,-0.19693351593102915,Seth93,Sethares (1993),interference,#B50000,Bonang
14.57957957957958,-0.19645249429811365,Seth93,Sethares (1993),interference,#B50000,Bonang
14.594594594594595,-0.19600202015893906,Seth93,Sethares (1993),interference,#B50000,Bonang
14.60960960960961,-0.19558213281337256,Seth93,Sethares (1993),interference,#B50000,Bonang
14.624624624624625,-0.19519289187685596,Seth93,Sethares (1993),interference,#B50000,Bonang
14.63963963963964,-0.1948342783166418,Seth93,Sethares (1993),interference,#B50000,Bonang
14.654654654654655,-0.1945063030042424,Seth93,Sethares (1993),interference,#B50000,Bonang
14.66966966966967,-0.19420906115808656,Seth93,Sethares (1993),interference,#B50000,Bonang
14.684684684684685,-0.1939425299481735,Seth93,Sethares (1993),interference,#B50000,Bonang
14.6996996996997,-0.1937067190773704,Seth93,Sethares (1993),interference,#B50000,Bonang
14.714714714714715,-0.1935016329938935,Seth93,Sethares (1993),interference,#B50000,Bonang
14.72972972972973,-0.1933272707674136,Seth93,Sethares (1993),interference,#B50000,Bonang
14.744744744744745,-0.19318362595268507,Seth93,Sethares (1993),interference,#B50000,Bonang
14.75975975975976,-0.19307068644041958,Seth93,Sethares (1993),interference,#B50000,Bonang
14.774774774774775,-0.19298843429517837,Seth93,Sethares (1993),interference,#B50000,Bonang
14.78978978978979,-0.19293684557997667,Seth93,Sethares (1993),interference,#B50000,Bonang
14.804804804804805,-0.1929158901673147,Seth93,Sethares (1993),interference,#B50000,Bonang
14.81981981981982,-0.19292553153635478,Seth93,Sethares (1993),interference,#B50000,Bonang
14.834834834834835,-0.19296572655588928,Seth93,Sethares (1993),interference,#B50000,Bonang
14.84984984984985,-0.19303642525279358,Seth93,Sethares (1993),interference,#B50000,Bonang
14.864864864864865,-0.19313757056561445,Seth93,Sethares (1993),interference,#B50000,Bonang
14.87987987987988,-0.19326909808290885,Seth93,Sethares (1993),interference,#B50000,Bonang
14.894894894894895,-0.19343093576598663,Seth93,Sethares (1993),interference,#B50000,Bonang
14.90990990990991,-0.1936230036556389,Seth93,Sethares (1993),interference,#B50000,Bonang
14.924924924924925,-0.1938452135624408,Seth93,Sethares (1993),interference,#B50000,Bonang
14.93993993993994,-0.19409746874022726,Seth93,Sethares (1993),interference,#B50000,Bonang
14.954954954954955,-0.19437966354225672,Seth93,Sethares (1993),interference,#B50000,Bonang
14.96996996996997,-0.19469168305962836,Seth93,Sethares (1993),interference,#B50000,Bonang
14.984984984984985,-0.19503340274146694,Seth93,Sethares (1993),interference,#B50000,Bonang
15,-0.19540468799635866,Seth93,Sethares (1993),interference,#B50000,Bonang
