interval,output,model_id,model_label,model_theory,model_colour,timbre_label
0,-0.007794156677245308,Seth93,Sethares (1993),interference,#B50000,Flute
0.015015015015015015,-0.035256579795822494,Seth93,Sethares (1993),interference,#B50000,Flute
0.03003003003003003,-0.054175677412162275,Seth93,Sethares (1993),interference,#B50000,Flute
0.04504504504504504,-0.07236920406049448,Seth93,Sethares (1993),interference,#B50000,Flute
0.06006006006006006,-0.08986004880438951,Seth93,Sethares (1993),interference,#B50000,Flute
0.07507507507507508,-0.10667041318447745,Seth93,Sethares (1993),interference,#B50000,Flute
0.09009009009009009,-0.1228218318490278,Seth93,Sethares (1993),interference,#B50000,Flute
0.10510510510510511,-0.13833519256389362,Seth93,Sethares (1993),interference,#B50000,Flute
0.12012012012012012,-0.15323075562035374,Seth93,Sethares (1993),interference,#B50000,Flute
0.13513513513513514,-0.16752817265878586,Seth93,Sethares (1993),interference,#B50000,Flute
0.15015015015015015,-0.18124650492570787,Seth93,Sethares (1993),interference,#B50000,Flute
0.16516516516516516,-0.19440424098112496,Seth93,Sethares (1993),interference,#B50000,Flute
0.18018018018018017,-0.20701931387253902,Seth93,Sethares (1993),interference,#B50000,Flute
0.19519519519519518,-0.2191091177916543,Seth93,Sethares (1993),interference,#B50000,Flute
0.21021021021021022,-0.23069052422915912,Seth93,Sethares (1993),interference,#B50000,Flute
0.22522522522522523,-0.24177989764260274,Seth93,Sethares (1993),interference,#B50000,Flute
0.24024024024024024,-0.25239311065194386,Seth93,Sethares (1993),interference,#B50000,Flute
0.2552552552552553,-0.26254555877679386,Seth93,Sethares (1993),interference,#B50000,Flute
0.2702702702702703,-0.2722521747290807,Seth93,Sethares (1993),interference,#B50000,Flute
0.2852852852852853,-0.2815274422744088,Seth93,Sethares (1993),interference,#B50000,Flute
0.3003003003003003,-0.2903854096749058,Seth93,Sethares (1993),interference,#B50000,Flute
0.3153153153153153,-0.29883970272611515,Seth93,Sethares (1993),interference,#B50000,Flute
0.3303303303303303,-0.3069035373999278,Seth93,Sethares (1993),interference,#B50000,Flute
0.34534534534534533,-0.3145897321053498,Seth93,Sethares (1993),interference,#B50000,Flute
0.36036036036036034,-0.321910719578448,Seth93,Sethares (1993),interference,#B50000,Flute
0.37537537537537535,-0.3288785814070913,Seth93,Sethares (1993),interference,#B50000,Flute
0.39039039039039036,-0.3355049648189519,Seth93,Sethares (1993),interference,#B50000,Flute
0.40540540540540543,-0.341801238849423,Seth93,Sethares (1993),interference,#B50000,Flute
0.42042042042042044,-0.3477784053998798,Seth93,Sethares (1993),interference,#B50000,Flute
0.43543543543543545,-0.3534471407240441,Seth93,Sethares (1993),interference,#B50000,Flute
0.45045045045045046,-0.35881778154663957,Seth93,Sethares (1993),interference,#B50000,Flute
0.46546546546546547,-0.36390037140849446,Seth93,Sethares (1993),interference,#B50000,Flute
0.4804804804804805,-0.3687046446791006,Seth93,Sethares (1993),interference,#B50000,Flute
0.4954954954954955,-0.37324007138487275,Seth93,Sethares (1993),interference,#B50000,Flute
0.5105105105105106,-0.37751598808264825,Seth93,Sethares (1993),interference,#B50000,Flute
0.5255255255255256,-0.381540810421603,Seth93,Sethares (1993),interference,#B50000,Flute
0.5405405405405406,-0.38532340372345403,Seth93,Sethares (1993),interference,#B50000,Flute
0.5555555555555556,-0.3888721188696889,Seth93,Sethares (1993),interference,#B50000,Flute
0.5705705705705706,-0.3921950541877709,Seth93,Sethares (1993),interference,#B50000,Flute
0.5855855855855856,-0.3953000629283519,Seth93,Sethares (1993),interference,#B50000,Flute
0.6006006006006006,-0.3981947605124233,Seth93,Sethares (1993),interference,#B50000,Flute
0.6156156156156156,-0.4008865315550209,Seth93,Sethares (1993),interference,#B50000,Flute
0.6306306306306306,-0.4033825366719003,Seth93,Sethares (1993),interference,#B50000,Flute
0.6456456456456456,-0.4056897190754287,Seth93,Sethares (1993),interference,#B50000,Flute
0.6606606606606606,-0.40781481096566036,Seth93,Sethares (1993),interference,#B50000,Flute
0.6756756756756757,-0.4097643397224509,Seth93,Sethares (1993),interference,#B50000,Flute
0.6906906906906907,-0.41154463390421475,Seth93,Sethares (1993),interference,#B50000,Flute
0.7057057057057057,-0.4131618290587618,Seth93,Sethares (1993),interference,#B50000,Flute
0.7207207207207207,-0.4146218733514865,Seth93,Sethares (1993),interference,#B50000,Flute
0.7357357357357357,-0.4159305330159757,Seth93,Sethares (1993),interference,#B50000,Flute
0.7507507507507507,-0.41709339763193753,Seth93,Sethares (1993),interference,#B50000,Flute
0.7657657657657657,-0.4181158852352202,Seth93,Sethares (1993),interference,#B50000,Flute
0.7807807807807807,-0.41900324726445626,Seth93,Sethares (1993),interference,#B50000,Flute
0.7957957957957957,-0.41976057334878797,Seth93,Sethares (1993),interference,#B50000,Flute
0.8108108108108109,-0.42039279594090595,Seth93,Sethares (1993),interference,#B50000,Flute
0.8258258258258259,-0.42090469479952825,Seth93,Sethares (1993),interference,#B50000,Flute
0.8408408408408409,-0.42130090132527304,Seth93,Sethares (1993),interference,#B50000,Flute
0.8558558558558559,-0.42158590275374674,Seth93,Sethares (1993),interference,#B50000,Flute
0.8708708708708709,-0.421764046209508,Seth93,Sethares (1993),interference,#B50000,Flute
0.8858858858858859,-0.42183954262447104,Seth93,Sethares (1993),interference,#B50000,Flute
0.9009009009009009,-0.4218164705241146,Seth93,Sethares (1993),interference,#B50000,Flute
0.9159159159159159,-0.42169877968480063,Seth93,Sethares (1993),interference,#B50000,Flute
0.9309309309309309,-0.4214902946653073,Seth93,Sethares (1993),interference,#B50000,Flute
0.9459459459459459,-0.42119471821561716,Seth93,Sethares (1993),interference,#B50000,Flute
0.960960960960961,-0.4208156345658316,Seth93,Sethares (1993),interference,#B50000,Flute
0.975975975975976,-0.4203565125979776,Seth93,Sethares (1993),interference,#B50000,Flute
0.990990990990991,-0.41982070890335804,Seth93,Sethares (1993),interference,#B50000,Flute
1.006006006006006,-0.4192114707279669,Seth93,Sethares (1993),interference,#B50000,Flute
1.021021021021021,-0.41853193880838774,Seth93,Sethares (1993),interference,#B50000,Flute
1.0360360360360361,-0.4177851501004663,Seth93,Sethares (1993),interference,#B50000,Flute
1.0510510510510511,-0.4169740404029418,Seth93,Sethares (1993),interference,#B50000,Flute
1.0660660660660661,-0.4161014468781246,Seth93,Sethares (1993),interference,#B50000,Flute
1.0810810810810811,-0.4151701104715707,Seth93,Sethares (1993),interference,#B50000,Flute
1.0960960960960962,-0.4141826782326163,Seth93,Sethares (1993),interference,#B50000,Flute
1.1111111111111112,-0.4131417055375356,Seth93,Sethares (1993),interference,#B50000,Flute
1.1261261261261262,-0.41204965821694906,Seth93,Sethares (1993),interference,#B50000,Flute
1.1411411411411412,-0.4109089145890469,Seth93,Sethares (1993),interference,#B50000,Flute
1.1561561561561562,-0.4097217674000511,Seth93,Sethares (1993),interference,#B50000,Flute
1.1711711711711712,-0.4084904256732567,Seth93,Sethares (1993),interference,#B50000,Flute
1.1861861861861862,-0.4072170164679012,Seth93,Sethares (1993),interference,#B50000,Flute
1.2012012012012012,-0.405903586548984,Seth93,Sethares (1993),interference,#B50000,Flute
1.2162162162162162,-0.4045521039690686,Seth93,Sethares (1993),interference,#B50000,Flute
1.2312312312312312,-0.4031644595630207,Seth93,Sethares (1993),interference,#B50000,Flute
1.2462462462462462,-0.4017424683564977,Seth93,Sethares (1993),interference,#B50000,Flute
1.2612612612612613,-0.40028787088893364,Seth93,Sethares (1993),interference,#B50000,Flute
1.2762762762762763,-0.39880233445165925,Seth93,Sethares (1993),interference,#B50000,Flute
1.2912912912912913,-0.39728745424168055,Seth93,Sethares (1993),interference,#B50000,Flute
1.3063063063063063,-0.3957447544315673,Seth93,Sethares (1993),interference,#B50000,Flute
1.3213213213213213,-0.3941756891557778,Seth93,Sethares (1993),interference,#B50000,Flute
1.3363363363363363,-0.39258164341365304,Seth93,Sethares (1993),interference,#B50000,Flute
1.3513513513513513,-0.3909639338892247,Seth93,Sethares (1993),interference,#B50000,Flute
1.3663663663663663,-0.38932379656606736,Seth93,Sethares (1993),interference,#B50000,Flute
1.3813813813813813,-0.3876624401004965,Seth93,Sethares (1993),interference,#B50000,Flute
1.3963963963963963,-0.38598096696776674,Seth93,Sethares (1993),interference,#B50000,Flute
1.4114114114114114,-0.3842804271234247,Seth93,Sethares (1993),interference,#B50000,Flute
1.4264264264264264,-0.38256180505633464,Seth93,Sethares (1993),interference,#B50000,Flute
1.4414414414414414,-0.38082602188993325,Seth93,Sethares (1993),interference,#B50000,Flute
1.4564564564564564,-0.3790739285254927,Seth93,Sethares (1993),interference,#B50000,Flute
1.4714714714714714,-0.3773063163443469,Seth93,Sethares (1993),interference,#B50000,Flute
1.4864864864864864,-0.3755239074383976,Seth93,Sethares (1993),interference,#B50000,Flute
1.5015015015015014,-0.3737272594448407,Seth93,Sethares (1993),interference,#B50000,Flute
1.5165165165165164,-0.37191718025755166,Seth93,Sethares (1993),interference,#B50000,Flute
1.5315315315315314,-0.37009409308748686,Seth93,Sethares (1993),interference,#B50000,Flute
1.5465465465465464,-0.36825846286376784,Seth93,Sethares (1993),interference,#B50000,Flute
1.5615615615615615,-0.36641068876742516,Seth93,Sethares (1993),interference,#B50000,Flute
1.5765765765765765,-0.36455110374715866,Seth93,Sethares (1993),interference,#B50000,Flute
1.5915915915915915,-0.36267997393928875,Seth93,Sethares (1993),interference,#B50000,Flute
1.6066066066066067,-0.360797497990078,Seth93,Sethares (1993),interference,#B50000,Flute
1.6216216216216217,-0.3589038062784858,Seth93,Sethares (1993),interference,#B50000,Flute
1.6366366366366367,-0.3569989600372879,Seth93,Sethares (1993),interference,#B50000,Flute
1.6516516516516517,-0.3550829503703101,Seth93,Sethares (1993),interference,#B50000,Flute
1.6666666666666667,-0.3531556971634374,Seth93,Sethares (1993),interference,#B50000,Flute
1.6816816816816818,-0.35121704788685365,Seth93,Sethares (1993),interference,#B50000,Flute
1.6966966966966968,-0.34926677628584957,Seth93,Sethares (1993),interference,#B50000,Flute
1.7117117117117118,-0.34730458095736766,Seth93,Sethares (1993),interference,#B50000,Flute
1.7267267267267268,-0.34533008380928404,Seth93,Sethares (1993),interference,#B50000,Flute
1.7417417417417418,-0.3433428283992533,Seth93,Sethares (1993),interference,#B50000,Flute
1.7567567567567568,-0.34134227814980544,Seth93,Sethares (1993),interference,#B50000,Flute
1.7717717717717718,-0.3393278144361446,Seth93,Sethares (1993),interference,#B50000,Flute
1.7867867867867868,-0.33729873454298,Seth93,Sethares (1993),interference,#B50000,Flute
1.8018018018018018,-0.33525424948647853,Seth93,Sethares (1993),interference,#B50000,Flute
1.8168168168168168,-0.3331934816972522,Seth93,Sethares (1993),interference,#B50000,Flute
1.8318318318318318,-0.33120262790271227,Seth93,Sethares (1993),interference,#B50000,Flute
1.8468468468468469,-0.3292745208357476,Seth93,Sethares (1993),interference,#B50000,Flute
1.8618618618618619,-0.327327852278756,Seth93,Sethares (1993),interference,#B50000,Flute
1.8768768768768769,-0.32536194192171775,Seth93,Sethares (1993),interference,#B50000,Flute
1.8918918918918919,-0.3233760105711771,Seth93,Sethares (1993),interference,#B50000,Flute
1.906906906906907,-0.32136917801051507,Seth93,Sethares (1993),interference,#B50000,Flute
1.921921921921922,-0.3193404606963777,Seth93,Sethares (1993),interference,#B50000,Flute
1.936936936936937,-0.31728876928714994,Seth93,Sethares (1993),interference,#B50000,Flute
1.951951951951952,-0.3152129059991158,Seth93,Sethares (1993),interference,#B50000,Flute
1.966966966966967,-0.3131115617856832,Seth93,Sethares (1993),interference,#B50000,Flute
1.981981981981982,-0.31098331333480356,Seth93,Sethares (1993),interference,#B50000,Flute
1.996996996996997,-0.3088266198794704,Seth93,Sethares (1993),interference,#B50000,Flute
2.012012012012012,-0.3066398198158718,Seth93,Sethares (1993),interference,#B50000,Flute
2.027027027027027,-0.30442112712354646,Seth93,Sethares (1993),interference,#B50000,Flute
2.042042042042042,-0.30227980500653795,Seth93,Sethares (1993),interference,#B50000,Flute
2.057057057057057,-0.3005594557717334,Seth93,Sethares (1993),interference,#B50000,Flute
2.0720720720720722,-0.298803402879345,Seth93,Sethares (1993),interference,#B50000,Flute
2.0870870870870872,-0.29701116556313445,Seth93,Sethares (1993),interference,#B50000,Flute
2.1021021021021022,-0.2951821274658314,Seth93,Sethares (1993),interference,#B50000,Flute
2.1171171171171173,-0.2933155350765198,Seth93,Sethares (1993),interference,#B50000,Flute
2.1321321321321323,-0.29141049594949464,Seth93,Sethares (1993),interference,#B50000,Flute
2.1471471471471473,-0.28946597670146534,Seth93,Sethares (1993),interference,#B50000,Flute
2.1621621621621623,-0.28748080078361526,Seth93,Sethares (1993),interference,#B50000,Flute
2.1771771771771773,-0.2854536460247499,Seth93,Sethares (1993),interference,#B50000,Flute
2.1921921921921923,-0.2833830419414461,Seth93,Sethares (1993),interference,#B50000,Flute
2.2072072072072073,-0.28126736681076026,Seth93,Sethares (1993),interference,#B50000,Flute
2.2222222222222223,-0.2791048445007686,Seth93,Sethares (1993),interference,#B50000,Flute
2.2372372372372373,-0.2768935410538338,Seth93,Sethares (1993),interference,#B50000,Flute
2.2522522522522523,-0.2746313610171641,Seth93,Sethares (1993),interference,#B50000,Flute
2.2672672672672673,-0.27231604351489125,Seth93,Sethares (1993),interference,#B50000,Flute
2.2822822822822824,-0.26994515805549957,Seth93,Sethares (1993),interference,#B50000,Flute
2.2972972972972974,-0.26751610006808973,Seth93,Sethares (1993),interference,#B50000,Flute
2.3123123123123124,-0.2650897179152229,Seth93,Sethares (1993),interference,#B50000,Flute
2.3273273273273274,-0.26421020756149466,Seth93,Sethares (1993),interference,#B50000,Flute
2.3423423423423424,-0.2632693047064683,Seth93,Sethares (1993),interference,#B50000,Flute
2.3573573573573574,-0.262268731243846,Seth93,Sethares (1993),interference,#B50000,Flute
2.3723723723723724,-0.2612100337848621,Seth93,Sethares (1993),interference,#B50000,Flute
2.3873873873873874,-0.2600945853155858,Seth93,Sethares (1993),interference,#B50000,Flute
2.4024024024024024,-0.2589235883744209,Seth93,Sethares (1993),interference,#B50000,Flute
2.4174174174174174,-0.2576980761168201,Seth93,Sethares (1993),interference,#B50000,Flute
2.4324324324324325,-0.2564189140855034,Seth93,Sethares (1993),interference,#B50000,Flute
2.4474474474474475,-0.25508683125264736,Seth93,Sethares (1993),interference,#B50000,Flute
2.4624624624624625,-0.25370230004725547,Seth93,Sethares (1993),interference,#B50000,Flute
2.4774774774774775,-0.25226572208922604,Seth93,Sethares (1993),interference,#B50000,Flute
2.4924924924924925,-0.2507772668891488,Seth93,Sethares (1993),interference,#B50000,Flute
2.5075075075075075,-0.24923696064032438,Seth93,Sethares (1993),interference,#B50000,Flute
2.5225225225225225,-0.24764482180586714,Seth93,Sethares (1993),interference,#B50000,Flute
2.5375375375375375,-0.24600047834680985,Seth93,Sethares (1993),interference,#B50000,Flute
2.5525525525525525,-0.24430348149188633,Seth93,Sethares (1993),interference,#B50000,Flute
2.5675675675675675,-0.24255321777049946,Seth93,Sethares (1993),interference,#B50000,Flute
2.5825825825825826,-0.24074890808862234,Seth93,Sethares (1993),interference,#B50000,Flute
2.5975975975975976,-0.2388896065520385,Seth93,Sethares (1993),interference,#B50000,Flute
2.6126126126126126,-0.2369741990350944,Seth93,Sethares (1993),interference,#B50000,Flute
2.6276276276276276,-0.23500140149278895,Seth93,Sethares (1993),interference,#B50000,Flute
2.6426426426426426,-0.23296975801372855,Seth93,Sethares (1993),interference,#B50000,Flute
2.6576576576576576,-0.23087763861111024,Seth93,Sethares (1993),interference,#B50000,Flute
2.6726726726726726,-0.2291786071828055,Seth93,Sethares (1993),interference,#B50000,Flute
2.6876876876876876,-0.22868666122360573,Seth93,Sethares (1993),interference,#B50000,Flute
2.7027027027027026,-0.22813483074856136,Seth93,Sethares (1993),interference,#B50000,Flute
2.7177177177177176,-0.2275255727796006,Seth93,Sethares (1993),interference,#B50000,Flute
2.7327327327327327,-0.22686118019665133,Seth93,Sethares (1993),interference,#B50000,Flute
2.7477477477477477,-0.2261437853762962,Seth93,Sethares (1993),interference,#B50000,Flute
2.7627627627627627,-0.22537536360187627,Seth93,Sethares (1993),interference,#B50000,Flute
2.7777777777777777,-0.2245577362491499,Seth93,Sethares (1993),interference,#B50000,Flute
2.7927927927927927,-0.22369257375137638,Seth93,Sethares (1993),interference,#B50000,Flute
2.8078078078078077,-0.22278139834740768,Seth93,Sethares (1993),interference,#B50000,Flute
2.8228228228228227,-0.22182558661611546,Seth93,Sethares (1993),interference,#B50000,Flute
2.8378378378378377,-0.22082637180024609,Seth93,Sethares (1993),interference,#B50000,Flute
2.8528528528528527,-0.2197848459225022,Seth93,Sethares (1993),interference,#B50000,Flute
2.8678678678678677,-0.21870196169644604,Seth93,Sethares (1993),interference,#B50000,Flute
2.8828828828828827,-0.2175785342345433,Seth93,Sethares (1993),interference,#B50000,Flute
2.8978978978978978,-0.21641524255542308,Seth93,Sethares (1993),interference,#B50000,Flute
2.9129129129129128,-0.21521263089219717,Seth93,Sethares (1993),interference,#B50000,Flute
2.9279279279279278,-0.21397110980343767,Seth93,Sethares (1993),interference,#B50000,Flute
2.942942942942943,-0.21269095708815505,Seth93,Sethares (1993),interference,#B50000,Flute
2.957957957957958,-0.21137231850591318,Seth93,Sethares (1993),interference,#B50000,Flute
2.972972972972973,-0.2100152083029388,Seth93,Sethares (1993),interference,#B50000,Flute
2.987987987987988,-0.20861950954488354,Seth93,Sethares (1993),interference,#B50000,Flute
3.003003003003003,-0.20718497425663013,Seth93,Sethares (1993),interference,#B50000,Flute
3.018018018018018,-0.20571122336931497,Seth93,Sethares (1993),interference,#B50000,Flute
3.033033033033033,-0.20419774647449782,Seth93,Sethares (1993),interference,#B50000,Flute
3.048048048048048,-0.20264390138516458,Seth93,Sethares (1993),interference,#B50000,Flute
3.063063063063063,-0.2010489135030196,Seth93,Sethares (1993),interference,#B50000,Flute
3.078078078078078,-0.19941187499128557,Seth93,Sethares (1993),interference,#B50000,Flute
3.093093093093093,-0.1977317437519759,Seth93,Sethares (1993),interference,#B50000,Flute
3.108108108108108,-0.1960073422063786,Seth93,Sethares (1993),interference,#B50000,Flute
3.123123123123123,-0.19423735587723442,Seth93,Sethares (1993),interference,#B50000,Flute
3.138138138138138,-0.1924203317708574,Seth93,Sethares (1993),interference,#B50000,Flute
3.153153153153153,-0.19055467655718203,Seth93,Sethares (1993),interference,#B50000,Flute
3.168168168168168,-0.1899573687531857,Seth93,Sethares (1993),interference,#B50000,Flute
3.183183183183183,-0.18967720956662384,Seth93,Sethares (1993),interference,#B50000,Flute
3.198198198198198,-0.18935080898352066,Seth93,Sethares (1993),interference,#B50000,Flute
3.2132132132132134,-0.18898021923422073,Seth93,Sethares (1993),interference,#B50000,Flute
3.2282282282282284,-0.18856736428094378,Seth93,Sethares (1993),interference,#B50000,Flute
3.2432432432432434,-0.1881140426668216,Seth93,Sethares (1993),interference,#B50000,Flute
3.2582582582582584,-0.18762193019515622,Seth93,Sethares (1993),interference,#B50000,Flute
3.2732732732732734,-0.1870925824418472,Seth93,Sethares (1993),interference,#B50000,Flute
3.2882882882882885,-0.1865274371037303,Seth93,Sethares (1993),interference,#B50000,Flute
3.3033033033033035,-0.18592781618537457,Seth93,Sethares (1993),interference,#B50000,Flute
3.3183183183183185,-0.18529492802674274,Seth93,Sethares (1993),interference,#B50000,Flute
3.3333333333333335,-0.18462986917388496,Seth93,Sethares (1993),interference,#B50000,Flute
3.3483483483483485,-0.18393362609469854,Seth93,Sethares (1993),interference,#B50000,Flute
3.3633633633633635,-0.18320709957281675,Seth93,Sethares (1993),interference,#B50000,Flute
3.3783783783783785,-0.182451013159047,Seth93,Sethares (1993),interference,#B50000,Flute
3.3933933933933935,-0.18166605640236,Seth93,Sethares (1993),interference,#B50000,Flute
3.4084084084084085,-0.1808527895746565,Seth93,Sethares (1993),interference,#B50000,Flute
3.4234234234234235,-0.18001166918278869,Seth93,Sethares (1993),interference,#B50000,Flute
3.4384384384384385,-0.17914304430559516,Seth93,Sethares (1993),interference,#B50000,Flute
3.4534534534534536,-0.17824717526598946,Seth93,Sethares (1993),interference,#B50000,Flute
3.4684684684684686,-0.1773242070509441,Seth93,Sethares (1993),interference,#B50000,Flute
3.4834834834834836,-0.1763741869600574,Seth93,Sethares (1993),interference,#B50000,Flute
3.4984984984984986,-0.17539706628597126,Seth93,Sethares (1993),interference,#B50000,Flute
3.5135135135135136,-0.1743926102907278,Seth93,Sethares (1993),interference,#B50000,Flute
3.5285285285285286,-0.1733607153206214,Seth93,Sethares (1993),interference,#B50000,Flute
3.5435435435435436,-0.17230095097908552,Seth93,Sethares (1993),interference,#B50000,Flute
3.5585585585585586,-0.1712128593243452,Seth93,Sethares (1993),interference,#B50000,Flute
3.5735735735735736,-0.17009588031790165,Seth93,Sethares (1993),interference,#B50000,Flute
3.5885885885885886,-0.16894935119361687,Seth93,Sethares (1993),interference,#B50000,Flute
3.6036036036036037,-0.16777250567962562,Seth93,Sethares (1993),interference,#B50000,Flute
3.6186186186186187,-0.1665644730719406,Seth93,Sethares (1993),interference,#B50000,Flute
3.6336336336336337,-0.16532427715847792,Seth93,Sethares (1993),interference,#B50000,Flute
3.6486486486486487,-0.16405083499203438,Seth93,Sethares (1993),interference,#B50000,Flute
3.6636636636636637,-0.1627429555105575,Seth93,Sethares (1993),interference,#B50000,Flute
3.6786786786786787,-0.16139933800286804,Seth93,Sethares (1993),interference,#B50000,Flute
3.6936936936936937,-0.16001857041782622,Seth93,Sethares (1993),interference,#B50000,Flute
3.7087087087087087,-0.15859912751468822,Seth93,Sethares (1993),interference,#B50000,Flute
3.7237237237237237,-0.15713936885227803,Seth93,Sethares (1993),interference,#B50000,Flute
3.7387387387387387,-0.15563753661433224,Seth93,Sethares (1993),interference,#B50000,Flute
3.7537537537537538,-0.15409175326821695,Seth93,Sethares (1993),interference,#B50000,Flute
3.7687687687687688,-0.15250001905400845,Seth93,Sethares (1993),interference,#B50000,Flute
3.7837837837837838,-0.15086020930069247,Seth93,Sethares (1993),interference,#B50000,Flute
3.798798798798799,-0.149170071566048,Seth93,Sethares (1993),interference,#B50000,Flute
3.813813813813814,-0.14742722259657806,Seth93,Sethares (1993),interference,#B50000,Flute
3.828828828828829,-0.14562914510357028,Seth93,Sethares (1993),interference,#B50000,Flute
3.843843843843844,-0.1437731843512211,Seth93,Sethares (1993),interference,#B50000,Flute
3.858858858858859,-0.14185654455245716,Seth93,Sethares (1993),interference,#B50000,Flute
3.873873873873874,-0.14173101745250116,Seth93,Sethares (1993),interference,#B50000,Flute
3.888888888888889,-0.14228258955497616,Seth93,Sethares (1993),interference,#B50000,Flute
3.903903903903904,-0.14277511539173396,Seth93,Sethares (1993),interference,#B50000,Flute
3.918918918918919,-0.14321106080489798,Seth93,Sethares (1993),interference,#B50000,Flute
3.933933933933934,-0.1435927617107038,Seth93,Sethares (1993),interference,#B50000,Flute
3.948948948948949,-0.14392242680165412,Seth93,Sethares (1993),interference,#B50000,Flute
3.963963963963964,-0.14420214008681093,Seth93,Sethares (1993),interference,#B50000,Flute
3.978978978978979,-0.14443386327229443,Seth93,Sethares (1993),interference,#B50000,Flute
3.993993993993994,-0.14461943798386218,Seth93,Sethares (1993),interference,#B50000,Flute
4.009009009009009,-0.1447605878332575,Seth93,Sethares (1993),interference,#B50000,Flute
4.024024024024024,-0.1448589203298662,Seth93,Sethares (1993),interference,#B50000,Flute
4.039039039039039,-0.14491592863901342,Seth93,Sethares (1993),interference,#B50000,Flute
4.054054054054054,-0.14493299318807829,Seth93,Sethares (1993),interference,#B50000,Flute
4.069069069069069,-0.14491138312141746,Seth93,Sethares (1993),interference,#B50000,Flute
4.084084084084084,-0.1448522576049181,Seth93,Sethares (1993),interference,#B50000,Flute
4.099099099099099,-0.14475666698081677,Seth93,Sethares (1993),interference,#B50000,Flute
4.114114114114114,-0.14462555377325195,Seth93,Sethares (1993),interference,#B50000,Flute
4.129129129129129,-0.1444597535448374,Seth93,Sethares (1993),interference,#B50000,Flute
4.1441441441441444,-0.14425999560435623,Seth93,Sethares (1993),interference,#B50000,Flute
4.1591591591591595,-0.14402690356551276,Seth93,Sethares (1993),interference,#B50000,Flute
4.1741741741741745,-0.14376099575648035,Seth93,Sethares (1993),interference,#B50000,Flute
4.1891891891891895,-0.14346268547980826,Seth93,Sethares (1993),interference,#B50000,Flute
4.2042042042042045,-0.14313228112207085,Seth93,Sethares (1993),interference,#B50000,Flute
4.2192192192192195,-0.14276998611244326,Seth93,Sethares (1993),interference,#B50000,Flute
4.2342342342342345,-0.14237589872920461,Seth93,Sethares (1993),interference,#B50000,Flute
4.2492492492492495,-0.14195001175298966,Seth93,Sethares (1993),interference,#B50000,Flute
4.2642642642642645,-0.14149221196538644,Seth93,Sethares (1993),interference,#B50000,Flute
4.2792792792792795,-0.1410022794913145,Seth93,Sethares (1993),interference,#B50000,Flute
4.2942942942942945,-0.14047988698339287,Seth93,Sethares (1993),interference,#B50000,Flute
4.3093093093093096,-0.13992459864630913,Seth93,Sethares (1993),interference,#B50000,Flute
4.324324324324325,-0.13933586909900567,Seth93,Sethares (1993),interference,#B50000,Flute
4.33933933933934,-0.13871304207226784,Seth93,Sethares (1993),interference,#B50000,Flute
4.354354354354355,-0.13818810608408058,Seth93,Sethares (1993),interference,#B50000,Flute
4.36936936936937,-0.13806272105165354,Seth93,Sethares (1993),interference,#B50000,Flute
4.384384384384385,-0.13790299319382177,Seth93,Sethares (1993),interference,#B50000,Flute
4.3993993993994,-0.13770964751918735,Seth93,Sethares (1993),interference,#B50000,Flute
4.414414414414415,-0.1374833010764043,Seth93,Sethares (1993),interference,#B50000,Flute
4.42942942942943,-0.13722446197577845,Seth93,Sethares (1993),interference,#B50000,Flute
4.444444444444445,-0.1369335410757755,Seth93,Sethares (1993),interference,#B50000,Flute
4.45945945945946,-0.13661080839957104,Seth93,Sethares (1993),interference,#B50000,Flute
4.474474474474475,-0.13625646131096714,Seth93,Sethares (1993),interference,#B50000,Flute
4.48948948948949,-0.13587057836179564,Seth93,Sethares (1993),interference,#B50000,Flute
4.504504504504505,-0.13545309752007817,Seth93,Sethares (1993),interference,#B50000,Flute
4.51951951951952,-0.135003954504063,Seth93,Sethares (1993),interference,#B50000,Flute
4.534534534534535,-0.13452287502713234,Seth93,Sethares (1993),interference,#B50000,Flute
4.54954954954955,-0.1340095122520202,Seth93,Sethares (1993),interference,#B50000,Flute
4.564564564564565,-0.1334634121740828,Seth93,Sethares (1993),interference,#B50000,Flute
4.57957957957958,-0.13288401302588848,Seth93,Sethares (1993),interference,#B50000,Flute
4.594594594594595,-0.13227064452124143,Seth93,Sethares (1993),interference,#B50000,Flute
4.60960960960961,-0.13162252693744597,Seth93,Sethares (1993),interference,#B50000,Flute
4.624624624624625,-0.13093877003443002,Seth93,Sethares (1993),interference,#B50000,Flute
4.63963963963964,-0.13021837180909906,Seth93,Sethares (1993),interference,#B50000,Flute
4.654654654654655,-0.1294602170831231,Seth93,Sethares (1993),interference,#B50000,Flute
4.66966966966967,-0.12866307592211337,Seth93,Sethares (1993),interference,#B50000,Flute
4.684684684684685,-0.12782560188393624,Seth93,Sethares (1993),interference,#B50000,Flute
4.6996996996997,-0.1269463300937005,Seth93,Sethares (1993),interference,#B50000,Flute
4.714714714714715,-0.12602367514271834,Seth93,Sethares (1993),interference,#B50000,Flute
4.72972972972973,-0.1250559288085078,Seth93,Sethares (1993),interference,#B50000,Flute
4.744744744744745,-0.12404125759269836,Seth93,Sethares (1993),interference,#B50000,Flute
4.75975975975976,-0.12297770007342433,Seth93,Sethares (1993),interference,#B50000,Flute
4.774774774774775,-0.12186316406858258,Seth93,Sethares (1993),interference,#B50000,Flute
4.78978978978979,-0.12069542360607738,Seth93,Sethares (1993),interference,#B50000,Flute
4.804804804804805,-0.11947211569690504,Seth93,Sethares (1993),interference,#B50000,Flute
4.81981981981982,-0.11819073690669643,Seth93,Sethares (1993),interference,#B50000,Flute
4.834834834834835,-0.11684863972106867,Seth93,Sethares (1993),interference,#B50000,Flute
4.84984984984985,-0.11544302869984344,Seth93,Sethares (1993),interference,#B50000,Flute
4.864864864864865,-0.11397095641496244,Seth93,Sethares (1993),interference,#B50000,Flute
4.87987987987988,-0.11242931916658586,Seth93,Sethares (1993),interference,#B50000,Flute
4.894894894894895,-0.11081485247162129,Seth93,Sethares (1993),interference,#B50000,Flute
4.90990990990991,-0.1091241263186163,Seth93,Sethares (1993),interference,#B50000,Flute
4.924924924924925,-0.1073535401826208,Seth93,Sethares (1993),interference,#B50000,Flute
4.93993993993994,-0.10549931779334466,Seth93,Sethares (1993),interference,#B50000,Flute
4.954954954954955,-0.103557501649603,Seth93,Sethares (1993),interference,#B50000,Flute
4.96996996996997,-0.10152394727267622,Seth93,Sethares (1993),interference,#B50000,Flute
4.984984984984985,-0.10056430722961222,Seth93,Sethares (1993),interference,#B50000,Flute
5,-0.10221178760392853,Seth93,Sethares (1993),interference,#B50000,Flute
5.015015015015015,-0.1037669342382032,Seth93,Sethares (1993),interference,#B50000,Flute
5.03003003003003,-0.10523381267524629,Seth93,Sethares (1993),interference,#B50000,Flute
5.045045045045045,-0.10661631456239004,Seth93,Sethares (1993),interference,#B50000,Flute
5.06006006006006,-0.1079181627365647,Seth93,Sethares (1993),interference,#B50000,Flute
5.075075075075075,-0.10914291609391068,Seth93,Sethares (1993),interference,#B50000,Flute
5.09009009009009,-0.11029397424925967,Seth93,Sethares (1993),interference,#B50000,Flute
5.105105105105105,-0.11137458199048632,Seth93,Sethares (1993),interference,#B50000,Flute
5.12012012012012,-0.11238783353259514,Seth93,Sethares (1993),interference,#B50000,Flute
5.135135135135135,-0.11333667657612112,Seth93,Sethares (1993),interference,#B50000,Flute
5.15015015015015,-0.11422391617420667,Seth93,Sethares (1993),interference,#B50000,Flute
5.165165165165165,-0.11505221841254538,Seth93,Sethares (1993),interference,#B50000,Flute
5.18018018018018,-0.1158241139061113,Seth93,Sethares (1993),interference,#B50000,Flute
5.195195195195195,-0.11654200111641824,Seth93,Sethares (1993),interference,#B50000,Flute
5.21021021021021,-0.11720814949284823,Seth93,Sethares (1993),interference,#B50000,Flute
5.225225225225225,-0.11782470244135894,Seth93,Sethares (1993),interference,#B50000,Flute
5.24024024024024,-0.11839368012371368,Seth93,Sethares (1993),interference,#B50000,Flute
5.255255255255255,-0.11891698209015894,Seth93,Sethares (1993),interference,#B50000,Flute
5.27027027027027,-0.11939638974827882,Seth93,Sethares (1993),interference,#B50000,Flute
5.285285285285285,-0.11983356867058215,Seth93,Sethares (1993),interference,#B50000,Flute
5.3003003003003,-0.12023007074317107,Seth93,Sethares (1993),interference,#B50000,Flute
5.315315315315315,-0.1205873361576525,Seth93,Sethares (1993),interference,#B50000,Flute
5.33033033033033,-0.1209066952482844,Seth93,Sethares (1993),interference,#B50000,Flute
5.345345345345345,-0.12118937017614001,Seth93,Sethares (1993),interference,#B50000,Flute
5.36036036036036,-0.12143647646191148,Seth93,Sethares (1993),interference,#B50000,Flute
5.375375375375375,-0.12164902033707758,Seth93,Sethares (1993),interference,#B50000,Flute
5.39039039039039,-0.12182791539892239,Seth93,Sethares (1993),interference,#B50000,Flute
5.405405405405405,-0.12197396157797197,Seth93,Sethares (1993),interference,#B50000,Flute
5.42042042042042,-0.1220878601782751,Seth93,Sethares (1993),interference,#B50000,Flute
5.435435435435435,-0.12217020957106835,Seth93,Sethares (1993),interference,#B50000,Flute
5.45045045045045,-0.12222151278214118,Seth93,Sethares (1993),interference,#B50000,Flute
5.465465465465465,-0.12224216755488812,Seth93,Sethares (1993),interference,#B50000,Flute
5.48048048048048,-0.12223247369008068,Seth93,Sethares (1993),interference,#B50000,Flute
5.495495495495495,-0.12219263715685784,Seth93,Sethares (1993),interference,#B50000,Flute
5.51051051051051,-0.12212275016453471,Seth93,Sethares (1993),interference,#B50000,Flute
5.525525525525525,-0.12202281377998292,Seth93,Sethares (1993),interference,#B50000,Flute
5.54054054054054,-0.12189273317349189,Seth93,Sethares (1993),interference,#B50000,Flute
5.555555555555555,-0.12173230996410128,Seth93,Sethares (1993),interference,#B50000,Flute
5.57057057057057,-0.12154124516932245,Seth93,Sethares (1993),interference,#B50000,Flute
5.585585585585585,-0.12131913853811088,Seth93,Sethares (1993),interference,#B50000,Flute
5.6006006006006,-0.1210654877336611,Seth93,Sethares (1993),interference,#B50000,Flute
5.615615615615615,-0.12077968736452838,Seth93,Sethares (1993),interference,#B50000,Flute
5.63063063063063,-0.12046102786238425,Seth93,Sethares (1993),interference,#B50000,Flute
5.645645645645645,-0.12010869420452759,Seth93,Sethares (1993),interference,#B50000,Flute
5.66066066066066,-0.11972176447905503,Seth93,Sethares (1993),interference,#B50000,Flute
5.675675675675675,-0.11929920829040969,Seth93,Sethares (1993),interference,#B50000,Flute
5.6906906906906904,-0.11883988500280544,Seth93,Sethares (1993),interference,#B50000,Flute
5.7057057057057055,-0.11834254181882241,Seth93,Sethares (1993),interference,#B50000,Flute
5.7207207207207205,-0.11780581169025675,Seth93,Sethares (1993),interference,#B50000,Flute
5.7357357357357355,-0.11722821105808386,Seth93,Sethares (1993),interference,#B50000,Flute
5.7507507507507505,-0.11660813741816564,Seth93,Sethares (1993),interference,#B50000,Flute
5.7657657657657655,-0.11594386670913226,Seth93,Sethares (1993),interference,#B50000,Flute
5.7807807807807805,-0.11523355051859238,Seth93,Sethares (1993),interference,#B50000,Flute
5.7957957957957955,-0.11447521310363648,Seth93,Sethares (1993),interference,#B50000,Flute
5.8108108108108105,-0.11366674822131628,Seth93,Sethares (1993),interference,#B50000,Flute
5.8258258258258255,-0.11288678377718211,Seth93,Sethares (1993),interference,#B50000,Flute
5.8408408408408405,-0.11369714165372646,Seth93,Sethares (1993),interference,#B50000,Flute
5.8558558558558556,-0.11445574568625612,Seth93,Sethares (1993),interference,#B50000,Flute
5.870870870870871,-0.11516473828050096,Seth93,Sethares (1993),interference,#B50000,Flute
5.885885885885886,-0.1158261358867193,Seth93,Sethares (1993),interference,#B50000,Flute
5.900900900900901,-0.11644183207141841,Seth93,Sethares (1993),interference,#B50000,Flute
5.915915915915916,-0.11701360042258237,Seth93,Sethares (1993),interference,#B50000,Flute
5.930930930930931,-0.11754309729175445,Seth93,Sethares (1993),interference,#B50000,Flute
5.945945945945946,-0.11803186437610916,Seth93,Sethares (1993),interference,#B50000,Flute
5.960960960960961,-0.11848133114347228,Seth93,Sethares (1993),interference,#B50000,Flute
5.975975975975976,-0.11889281710307957,Seth93,Sethares (1993),interference,#B50000,Flute
5.990990990990991,-0.11926753392466635,Seth93,Sethares (1993),interference,#B50000,Flute
6.006006006006006,-0.11960658740831656,Seth93,Sethares (1993),interference,#B50000,Flute
6.021021021021021,-0.11991097930732596,Seth93,Sethares (1993),interference,#B50000,Flute
6.036036036036036,-0.12018160900615647,Seth93,Sethares (1993),interference,#B50000,Flute
6.051051051051051,-0.12041927505539173,Seth93,Sethares (1993),interference,#B50000,Flute
6.066066066066066,-0.12062467656543661,Seth93,Sethares (1993),interference,#B50000,Flute
6.081081081081081,-0.12079841446053187,Seth93,Sethares (1993),interference,#B50000,Flute
6.096096096096096,-0.12094099259449348,Seth93,Sethares (1993),interference,#B50000,Flute
6.111111111111111,-0.12105281872941628,Seth93,Sethares (1993),interference,#B50000,Flute
6.126126126126126,-0.12113420537842291,Seth93,Sethares (1993),interference,#B50000,Flute
6.141141141141141,-0.12118537051336732,Seth93,Sethares (1993),interference,#B50000,Flute
6.156156156156156,-0.12120643813824855,Seth93,Sethares (1993),interference,#B50000,Flute
6.171171171171171,-0.12119743872891783,Seth93,Sethares (1993),interference,#B50000,Flute
6.186186186186186,-0.12128478273585089,Seth93,Sethares (1993),interference,#B50000,Flute
6.201201201201201,-0.1213837551339234,Seth93,Sethares (1993),interference,#B50000,Flute
6.216216216216216,-0.12145323887114853,Seth93,Sethares (1993),interference,#B50000,Flute
6.231231231231231,-0.1214934704772659,Seth93,Sethares (1993),interference,#B50000,Flute
6.246246246246246,-0.12150459694363074,Seth93,Sethares (1993),interference,#B50000,Flute
6.261261261261261,-0.12148667647464303,Seth93,Sethares (1993),interference,#B50000,Flute
6.276276276276276,-0.12143967911519901,Seth93,Sethares (1993),interference,#B50000,Flute
6.291291291291291,-0.12136348725522351,Seth93,Sethares (1993),interference,#B50000,Flute
6.306306306306306,-0.12125789601219367,Seth93,Sethares (1993),interference,#B50000,Flute
6.321321321321321,-0.12112261349242277,Seth93,Sethares (1993),interference,#B50000,Flute
6.336336336336336,-0.1209572609317227,Seth93,Sethares (1993),interference,#B50000,Flute
6.351351351351351,-0.12076137271592442,Seth93,Sethares (1993),interference,#B50000,Flute
6.366366366366366,-0.12053439736446045,Seth93,Sethares (1993),interference,#B50000,Flute
6.381381381381381,-0.12027569255068947,Seth93,Sethares (1993),interference,#B50000,Flute
6.396396396396396,-0.11998453258163028,Seth93,Sethares (1993),interference,#B50000,Flute
6.411411411411412,-0.11966010225272485,Seth93,Sethares (1993),interference,#B50000,Flute
6.426426426426427,-0.11930149781660772,Seth93,Sethares (1993),interference,#B50000,Flute
6.441441441441442,-0.11890772719146259,Seth93,Sethares (1993),interference,#B50000,Flute
6.456456456456457,-0.11847770539169114,Seth93,Sethares (1993),interference,#B50000,Flute
6.471471471471472,-0.1180102594051045,Seth93,Sethares (1993),interference,#B50000,Flute
6.486486486486487,-0.11750412271224951,Seth93,Sethares (1993),interference,#B50000,Flute
6.501501501501502,-0.1169579006704561,Seth93,Sethares (1993),interference,#B50000,Flute
6.516516516516517,-0.11637020858714517,Seth93,Sethares (1993),interference,#B50000,Flute
6.531531531531532,-0.1157394628566822,Seth93,Sethares (1993),interference,#B50000,Flute
6.546546546546547,-0.115064015991168,Seth93,Sethares (1993),interference,#B50000,Flute
6.561561561561562,-0.11434212125014094,Seth93,Sethares (1993),interference,#B50000,Flute
6.576576576576577,-0.1135719308182654,Seth93,Sethares (1993),interference,#B50000,Flute
6.591591591591592,-0.112751493850812,Seth93,Sethares (1993),interference,#B50000,Flute
6.606606606606607,-0.11187875438488601,Seth93,Sethares (1993),interference,#B50000,Flute
6.621621621621622,-0.11095154911421273,Seth93,Sethares (1993),interference,#B50000,Flute
6.636636636636637,-0.10996760502513678,Seth93,Sethares (1993),interference,#B50000,Flute
6.651651651651652,-0.10892453689129379,Seth93,Sethares (1993),interference,#B50000,Flute
6.666666666666667,-0.10781984462428303,Seth93,Sethares (1993),interference,#B50000,Flute
6.681681681681682,-0.1066509104774687,Seth93,Sethares (1993),interference,#B50000,Flute
6.696696696696697,-0.10541499609986878,Seth93,Sethares (1993),interference,#B50000,Flute
6.711711711711712,-0.10410923943693413,Seth93,Sethares (1993),interference,#B50000,Flute
6.726726726726727,-0.10273065147479832,Seth93,Sethares (1993),interference,#B50000,Flute
6.741741741741742,-0.10127611282442153,Seth93,Sethares (1993),interference,#B50000,Flute
6.756756756756757,-0.099742370141866,Seth93,Sethares (1993),interference,#B50000,Flute
6.771771771771772,-0.09812603238070537,Seth93,Sethares (1993),interference,#B50000,Flute
6.786786786786787,-0.09642356687243174,Seth93,Sethares (1993),interference,#B50000,Flute
6.801801801801802,-0.09463129523045953,Seth93,Sethares (1993),interference,#B50000,Flute
6.816816816816817,-0.0927453890731508,Seth93,Sethares (1993),interference,#B50000,Flute
6.831831831831832,-0.09076186556107983,Seth93,Sethares (1993),interference,#B50000,Flute
6.846846846846847,-0.08867658274349548,Seth93,Sethares (1993),interference,#B50000,Flute
6.861861861861862,-0.08648523470874099,Seth93,Sethares (1993),interference,#B50000,Flute
6.876876876876877,-0.08418334653318386,Seth93,Sethares (1993),interference,#B50000,Flute
6.891891891891892,-0.08176626902288525,Seth93,Sethares (1993),interference,#B50000,Flute
6.906906906906907,-0.07922917324211182,Seth93,Sethares (1993),interference,#B50000,Flute
6.921921921921922,-0.07656704482242722,Seth93,Sethares (1993),interference,#B50000,Flute
6.936936936936937,-0.07377467804590641,Seth93,Sethares (1993),interference,#B50000,Flute
6.951951951951952,-0.07084666969575726,Seth93,Sethares (1993),interference,#B50000,Flute
6.966966966966967,-0.06777741266729853,Seth93,Sethares (1993),interference,#B50000,Flute
6.981981981981982,-0.06456108933201046,Seth93,Sethares (1993),interference,#B50000,Flute
6.996996996996997,-0.06119166464709731,Seth93,Sethares (1993),interference,#B50000,Flute
7.012012012012012,-0.05766287900261141,Seth93,Sethares (1993),interference,#B50000,Flute
7.027027027027027,-0.05769924850803047,Seth93,Sethares (1993),interference,#B50000,Flute
7.042042042042042,-0.06133330504823742,Seth93,Sethares (1993),interference,#B50000,Flute
7.057057057057057,-0.06481046587361654,Seth93,Sethares (1993),interference,#B50000,Flute
7.072072072072072,-0.06813661563960499,Seth93,Sethares (1993),interference,#B50000,Flute
7.087087087087087,-0.07131744063387374,Seth93,Sethares (1993),interference,#B50000,Flute
7.102102102102102,-0.07435843448213439,Seth93,Sethares (1993),interference,#B50000,Flute
7.117117117117117,-0.07726490365604945,Seth93,Sethares (1993),interference,#B50000,Flute
7.132132132132132,-0.080041972788283,Seth93,Sethares (1993),interference,#B50000,Flute
7.147147147147147,-0.08269458979940723,Seth93,Sethares (1993),interference,#B50000,Flute
7.162162162162162,-0.08522753084131393,Seth93,Sethares (1993),interference,#B50000,Flute
7.177177177177177,-0.08764540506153463,Seth93,Sethares (1993),interference,#B50000,Flute
7.192192192192192,-0.08995265919267484,Seth93,Sethares (1993),interference,#B50000,Flute
7.207207207207207,-0.09215358197107612,Seth93,Sethares (1993),interference,#B50000,Flute
7.222222222222222,-0.09425230838856809,Seth93,Sethares (1993),interference,#B50000,Flute
7.237237237237237,-0.09625282378102057,Seth93,Sethares (1993),interference,#B50000,Flute
7.252252252252252,-0.09815896775729653,Seth93,Sethares (1993),interference,#B50000,Flute
7.267267267267267,-0.09997443797195132,Seth93,Sethares (1993),interference,#B50000,Flute
7.282282282282282,-0.10170279374495142,Seth93,Sethares (1993),interference,#B50000,Flute
7.297297297297297,-0.10334745953147807,Seth93,Sethares (1993),interference,#B50000,Flute
7.312312312312312,-0.10491172824472703,Seth93,Sethares (1993),interference,#B50000,Flute
7.327327327327327,-0.10639876443449581,Seth93,Sethares (1993),interference,#B50000,Flute
7.342342342342342,-0.10781160732417208,Seth93,Sethares (1993),interference,#B50000,Flute
7.357357357357357,-0.10915317370858015,Seth93,Sethares (1993),interference,#B50000,Flute
7.372372372372372,-0.11042626201328058,Seth93,Sethares (1993),interference,#B50000,Flute
7.387387387387387,-0.11163354968184704,Seth93,Sethares (1993),interference,#B50000,Flute
7.402402402402402,-0.1127776035812995,Seth93,Sethares (1993),interference,#B50000,Flute
7.4174174174174174,-0.11386087706556858,Seth93,Sethares (1993),interference,#B50000,Flute
7.4324324324324325,-0.1148857135386321,Seth93,Sethares (1993),interference,#B50000,Flute
7.4474474474474475,-0.11585434825700662,Seth93,Sethares (1993),interference,#B50000,Flute
7.4624624624624625,-0.11676891154117588,Seth93,Sethares (1993),interference,#B50000,Flute
7.4774774774774775,-0.11763142876696005,Seth93,Sethares (1993),interference,#B50000,Flute
7.4924924924924925,-0.11844383507222364,Seth93,Sethares (1993),interference,#B50000,Flute
7.5075075075075075,-0.11920796742805025,Seth93,Sethares (1993),interference,#B50000,Flute
7.5225225225225225,-0.11992548301762608,Seth93,Sethares (1993),interference,#B50000,Flute
7.5375375375375375,-0.12059804823102623,Seth93,Sethares (1993),interference,#B50000,Flute
7.5525525525525525,-0.12122719229291419,Seth93,Sethares (1993),interference,#B50000,Flute
7.5675675675675675,-0.12181434900350203,Seth93,Sethares (1993),interference,#B50000,Flute
7.5825825825825826,-0.12236085774907389,Seth93,Sethares (1993),interference,#B50000,Flute
7.597597597597598,-0.12286796439367283,Seth93,Sethares (1993),interference,#B50000,Flute
7.612612612612613,-0.12333682205205551,Seth93,Sethares (1993),interference,#B50000,Flute
7.627627627627628,-0.12376849174385582,Seth93,Sethares (1993),interference,#B50000,Flute
7.642642642642643,-0.1241639429287672,Seth93,Sethares (1993),interference,#B50000,Flute
7.657657657657658,-0.12452405392240984,Seth93,Sethares (1993),interference,#B50000,Flute
7.672672672672673,-0.12484961219240409,Seth93,Sethares (1993),interference,#B50000,Flute
7.687687687687688,-0.12514131453402172,Seth93,Sethares (1993),interference,#B50000,Flute
7.702702702702703,-0.12539976712465137,Seth93,Sethares (1993),interference,#B50000,Flute
7.717717717717718,-0.12562548545615002,Seth93,Sethares (1993),interference,#B50000,Flute
7.732732732732733,-0.12581889414401276,Seth93,Sethares (1993),interference,#B50000,Flute
7.747747747747748,-0.12598032661213718,Seth93,Sethares (1993),interference,#B50000,Flute
7.762762762762763,-0.12611002465179716,Seth93,Sethares (1993),interference,#B50000,Flute
7.777777777777778,-0.12620813785329135,Seth93,Sethares (1993),interference,#B50000,Flute
7.792792792792793,-0.12627472290856556,Seth93,Sethares (1993),interference,#B50000,Flute
7.807807807807808,-0.12630974278293933,Seth93,Sethares (1993),interference,#B50000,Flute
7.822822822822823,-0.12631306575391496,Seth93,Sethares (1993),interference,#B50000,Flute
7.837837837837838,-0.1262844643148555,Seth93,Sethares (1993),interference,#B50000,Flute
7.852852852852853,-0.12622361394116258,Seth93,Sethares (1993),interference,#B50000,Flute
7.867867867867868,-0.12613009171639314,Seth93,Sethares (1993),interference,#B50000,Flute
7.882882882882883,-0.12600337481558221,Seth93,Sethares (1993),interference,#B50000,Flute
7.897897897897898,-0.12584283884284328,Seth93,Sethares (1993),interference,#B50000,Flute
7.912912912912913,-0.12564775602013328,Seth93,Sethares (1993),interference,#B50000,Flute
7.927927927927928,-0.12541729322386702,Seth93,Sethares (1993),interference,#B50000,Flute
7.942942942942943,-0.125150509865875,Seth93,Sethares (1993),interference,#B50000,Flute
7.957957957957958,-0.12484635561497787,Seth93,Sethares (1993),interference,#B50000,Flute
7.972972972972973,-0.12450366795525358,Seth93,Sethares (1993),interference,#B50000,Flute
7.987987987987988,-0.12412116957684426,Seth93,Sethares (1993),interference,#B50000,Flute
8.003003003003004,-0.12369746559493294,Seth93,Sethares (1993),interference,#B50000,Flute
8.018018018018019,-0.12323104059228834,Seth93,Sethares (1993),interference,#B50000,Flute
8.033033033033034,-0.12272025548054016,Seth93,Sethares (1993),interference,#B50000,Flute
8.048048048048049,-0.12216334417509463,Seth93,Sethares (1993),interference,#B50000,Flute
8.063063063063064,-0.12155841007837256,Seth93,Sethares (1993),interference,#B50000,Flute
8.078078078078079,-0.12090342236575852,Seth93,Sethares (1993),interference,#B50000,Flute
8.093093093093094,-0.12019621206841936,Seth93,Sethares (1993),interference,#B50000,Flute
8.108108108108109,-0.11943446794685034,Seth93,Sethares (1993),interference,#B50000,Flute
8.123123123123124,-0.11861573214872852,Seth93,Sethares (1993),interference,#B50000,Flute
8.138138138138139,-0.11787948184446465,Seth93,Sethares (1993),interference,#B50000,Flute
8.153153153153154,-0.11861335991609706,Seth93,Sethares (1993),interference,#B50000,Flute
8.168168168168169,-0.11928787076432722,Seth93,Sethares (1993),interference,#B50000,Flute
8.183183183183184,-0.11990499619580153,Seth93,Sethares (1993),interference,#B50000,Flute
8.198198198198199,-0.12046657189541063,Seth93,Sethares (1993),interference,#B50000,Flute
8.213213213213214,-0.12097429023275962,Seth93,Sethares (1993),interference,#B50000,Flute
8.228228228228229,-0.1214297028695235,Seth93,Sethares (1993),interference,#B50000,Flute
8.243243243243244,-0.12183422317087056,Seth93,Sethares (1993),interference,#B50000,Flute
8.258258258258259,-0.1221891284239107,Seth93,Sethares (1993),interference,#B50000,Flute
8.273273273273274,-0.12249556186591852,Seth93,Sethares (1993),interference,#B50000,Flute
8.288288288288289,-0.12275453452483502,Seth93,Sethares (1993),interference,#B50000,Flute
8.303303303303304,-0.12296692687433187,Seth93,Sethares (1993),interference,#B50000,Flute
8.318318318318319,-0.12313349030552401,Seth93,Sethares (1993),interference,#B50000,Flute
8.333333333333334,-0.1232548484171668,Seth93,Sethares (1993),interference,#B50000,Flute
8.348348348348349,-0.1233314981259895,Seth93,Sethares (1993),interference,#B50000,Flute
8.363363363363364,-0.12336382827272217,Seth93,Sethares (1993),interference,#B50000,Flute
8.378378378378379,-0.12335204810747105,Seth93,Sethares (1993),interference,#B50000,Flute
8.393393393393394,-0.12329629871422662,Seth93,Sethares (1993),interference,#B50000,Flute
8.408408408408409,-0.12319657782932897,Seth93,Sethares (1993),interference,#B50000,Flute
8.423423423423424,-0.12305275940325303,Seth93,Sethares (1993),interference,#B50000,Flute
8.438438438438439,-0.12286459391318562,Seth93,Sethares (1993),interference,#B50000,Flute
8.453453453453454,-0.12263170721043298,Seth93,Sethares (1993),interference,#B50000,Flute
8.468468468468469,-0.12235360176696004,Seth93,Sethares (1993),interference,#B50000,Flute
8.483483483483484,-0.12202965480792292,Seth93,Sethares (1993),interference,#B50000,Flute
8.498498498498499,-0.121659089539323,Seth93,Sethares (1993),interference,#B50000,Flute
8.513513513513514,-0.12124108684445466,Seth93,Sethares (1993),interference,#B50000,Flute
8.528528528528529,-0.12077462314291074,Seth93,Sethares (1993),interference,#B50000,Flute
8.543543543543544,-0.12025856684662538,Seth93,Sethares (1993),interference,#B50000,Flute
8.558558558558559,-0.1196916592562996,Seth93,Sethares (1993),interference,#B50000,Flute
8.573573573573574,-0.11907251052779282,Seth93,Sethares (1993),interference,#B50000,Flute
8.588588588588589,-0.11839959795499247,Seth93,Sethares (1993),interference,#B50000,Flute
8.603603603603604,-0.11767126406834934,Seth93,Sethares (1993),interference,#B50000,Flute
8.618618618618619,-0.11688571454691198,Seth93,Sethares (1993),interference,#B50000,Flute
8.633633633633634,-0.116041015941429,Seth93,Sethares (1993),interference,#B50000,Flute
8.64864864864865,-0.11513509320588956,Seth93,Sethares (1993),interference,#B50000,Flute
8.663663663663664,-0.11416572703463984,Seth93,Sethares (1993),interference,#B50000,Flute
8.67867867867868,-0.11313055100195858,Seth93,Sethares (1993),interference,#B50000,Flute
8.693693693693694,-0.1120270485007604,Seth93,Sethares (1993),interference,#B50000,Flute
8.70870870870871,-0.11085254947685583,Seth93,Sethares (1993),interference,#B50000,Flute
8.723723723723724,-0.10960422695491706,Seth93,Sethares (1993),interference,#B50000,Flute
8.73873873873874,-0.1082790933521104,Seth93,Sethares (1993),interference,#B50000,Flute
8.753753753753754,-0.1068739965750318,Seth93,Sethares (1993),interference,#B50000,Flute
8.76876876876877,-0.10538561589537612,Seth93,Sethares (1993),interference,#B50000,Flute
8.783783783783784,-0.10381045759949324,Seth93,Sethares (1993),interference,#B50000,Flute
8.7987987987988,-0.10214485040669205,Seth93,Sethares (1993),interference,#B50000,Flute
8.813813813813814,-0.10038494065089473,Seth93,Sethares (1993),interference,#B50000,Flute
8.82882882882883,-0.09852668721998867,Seth93,Sethares (1993),interference,#B50000,Flute
8.843843843843844,-0.09663631934868945,Seth93,Sethares (1993),interference,#B50000,Flute
8.85885885885886,-0.09868755420402489,Seth93,Sethares (1993),interference,#B50000,Flute
8.873873873873874,-0.10063786812796859,Seth93,Sethares (1993),interference,#B50000,Flute
8.88888888888889,-0.10249157488836909,Seth93,Sethares (1993),interference,#B50000,Flute
8.903903903903904,-0.10425281367262342,Seth93,Sethares (1993),interference,#B50000,Flute
8.91891891891892,-0.10592555399269293,Seth93,Sethares (1993),interference,#B50000,Flute
8.933933933933934,-0.10751360039484144,Seth93,Sethares (1993),interference,#B50000,Flute
8.94894894894895,-0.1090205969784535,Seth93,Sethares (1993),interference,#B50000,Flute
8.963963963963964,-0.11045003172812226,Seth93,Sethares (1993),interference,#B50000,Flute
8.97897897897898,-0.11180524066296171,Seth93,Sethares (1993),interference,#B50000,Flute
8.993993993993994,-0.11308941180696713,Seth93,Sethares (1993),interference,#B50000,Flute
9.00900900900901,-0.11430558898402403,Seth93,Sethares (1993),interference,#B50000,Flute
9.024024024024024,-0.11545667544100228,Seth93,Sethares (1993),interference,#B50000,Flute
9.03903903903904,-0.11654543730221031,Seth93,Sethares (1993),interference,#B50000,Flute
9.054054054054054,-0.11757450685828214,Seth93,Sethares (1993),interference,#B50000,Flute
9.06906906906907,-0.11854638569241502,Seth93,Sethares (1993),interference,#B50000,Flute
9.084084084084084,-0.11946344764671063,Seth93,Sethares (1993),interference,#B50000,Flute
9.0990990990991,-0.12032794163118257,Seth93,Sethares (1993),interference,#B50000,Flute
9.114114114114114,-0.12114199427785795,Seth93,Sethares (1993),interference,#B50000,Flute
9.12912912912913,-0.12190761244220126,Seth93,Sethares (1993),interference,#B50000,Flute
9.144144144144144,-0.12262668555395277,Seth93,Sethares (1993),interference,#B50000,Flute
9.15915915915916,-0.123300987819296,Seth93,Sethares (1993),interference,#B50000,Flute
9.174174174174174,-0.12393218027611717,Seth93,Sethares (1993),interference,#B50000,Flute
9.18918918918919,-0.12452181270394429,Seth93,Sethares (1993),interference,#B50000,Flute
9.204204204204204,-0.12507132539001242,Seth93,Sethares (1993),interference,#B50000,Flute
9.21921921921922,-0.1255820507527248,Seth93,Sethares (1993),interference,#B50000,Flute
9.234234234234235,-0.1260552148236331,Seth93,Sethares (1993),interference,#B50000,Flute
9.24924924924925,-0.12649193858889438,Seth93,Sethares (1993),interference,#B50000,Flute
9.264264264264265,-0.12689323919100032,Seth93,Sethares (1993),interference,#B50000,Flute
9.27927927927928,-0.12726003099142713,Seth93,Sethares (1993),interference,#B50000,Flute
9.294294294294295,-0.12759312649468013,Seth93,Sethares (1993),interference,#B50000,Flute
9.30930930930931,-0.12789323713405776,Seth93,Sethares (1993),interference,#B50000,Flute
9.324324324324325,-0.12816097391929254,Seth93,Sethares (1993),interference,#B50000,Flute
9.33933933933934,-0.12839684794606906,Seth93,Sethares (1993),interference,#B50000,Flute
9.354354354354355,-0.12860127076725342,Seth93,Sethares (1993),interference,#B50000,Flute
9.36936936936937,-0.1287745501027731,Seth93,Sethares (1993),interference,#B50000,Flute
9.384384384384385,-0.12891690808692804,Seth93,Sethares (1993),interference,#B50000,Flute
9.3993993993994,-0.12902845389392123,Seth93,Sethares (1993),interference,#B50000,Flute
9.414414414414415,-0.1291092018364273,Seth93,Sethares (1993),interference,#B50000,Flute
9.42942942942943,-0.12915906644877959,Seth93,Sethares (1993),interference,#B50000,Flute
9.444444444444445,-0.12917786240256776,Seth93,Sethares (1993),interference,#B50000,Flute
9.45945945945946,-0.12916530234441803,Seth93,Sethares (1993),interference,#B50000,Flute
9.474474474474475,-0.1291209984542535,Seth93,Sethares (1993),interference,#B50000,Flute
9.48948948948949,-0.12904445963095737,Seth93,Sethares (1993),interference,#B50000,Flute
9.504504504504505,-0.1289350879491977,Seth93,Sethares (1993),interference,#B50000,Flute
9.51951951951952,-0.12879219026351638,Seth93,Sethares (1993),interference,#B50000,Flute
9.534534534534535,-0.12861495919048332,Seth93,Sethares (1993),interference,#B50000,Flute
9.54954954954955,-0.1284024817431161,Seth93,Sethares (1993),interference,#B50000,Flute
9.564564564564565,-0.12815373557442206,Seth93,Sethares (1993),interference,#B50000,Flute
9.57957957957958,-0.12786758713834318,Seth93,Sethares (1993),interference,#B50000,Flute
9.594594594594595,-0.1275427896860237,Seth93,Sethares (1993),interference,#B50000,Flute
9.60960960960961,-0.12717798109411108,Seth93,Sethares (1993),interference,#B50000,Flute
9.624624624624625,-0.1267716815215964,Seth93,Sethares (1993),interference,#B50000,Flute
9.63963963963964,-0.12632229089146435,Seth93,Sethares (1993),interference,#B50000,Flute
9.654654654654655,-0.12582808619320957,Seth93,Sethares (1993),interference,#B50000,Flute
9.66966966966967,-0.12528721860203193,Seth93,Sethares (1993),interference,#B50000,Flute
9.684684684684685,-0.1246977104102922,Seth93,Sethares (1993),interference,#B50000,Flute
9.6996996996997,-0.12537215812253352,Seth93,Sethares (1993),interference,#B50000,Flute
9.714714714714715,-0.12640829035098883,Seth93,Sethares (1993),interference,#B50000,Flute
9.72972972972973,-0.12739798681253667,Seth93,Sethares (1993),interference,#B50000,Flute
9.744744744744745,-0.12834354194898195,Seth93,Sethares (1993),interference,#B50000,Flute
9.75975975975976,-0.12924713174644514,Seth93,Sethares (1993),interference,#B50000,Flute
9.774774774774775,-0.13011081696204108,Seth93,Sethares (1993),interference,#B50000,Flute
9.78978978978979,-0.13093654619263284,Seth93,Sethares (1993),interference,#B50000,Flute
9.804804804804805,-0.13172615878895894,Seth93,Sethares (1993),interference,#B50000,Flute
9.81981981981982,-0.13248138761827047,Seth93,Sethares (1993),interference,#B50000,Flute
9.834834834834835,-0.13320386167846276,Seth93,Sethares (1993),interference,#B50000,Flute
9.84984984984985,-0.1338951085664826,Seth93,Sethares (1993),interference,#B50000,Flute
9.864864864864865,-0.13455655680363024,Seth93,Sethares (1993),interference,#B50000,Flute
9.87987987987988,-0.1351895380202317,Seth93,Sethares (1993),interference,#B50000,Flute
9.894894894894895,-0.13579528900194351,Seth93,Sethares (1993),interference,#B50000,Flute
9.90990990990991,-0.136374953599844,Seth93,Sethares (1993),interference,#B50000,Flute
9.924924924924925,-0.13692958450625609,Seth93,Sethares (1993),interference,#B50000,Flute
9.93993993993994,-0.13746014489809896,Seth93,Sethares (1993),interference,#B50000,Flute
9.954954954954955,-0.13796750994943147,Seth93,Sethares (1993),interference,#B50000,Flute
9.96996996996997,-0.13845246821464355,Seth93,Sethares (1993),interference,#B50000,Flute
9.984984984984985,-0.13891572288363122,Seth93,Sethares (1993),interference,#B50000,Flute
10,-0.13935789291012096,Seth93,Sethares (1993),interference,#B50000,Flute
10.015015015015015,-0.13977951401413857,Seth93,Sethares (1993),interference,#B50000,Flute
10.03003003003003,-0.14018103955948663,Seth93,Sethares (1993),interference,#B50000,Flute
10.045045045045045,-0.14056284130691413,Seth93,Sethares (1993),interference,#B50000,Flute
10.06006006006006,-0.1409252100435058,Seth93,Sethares (1993),interference,#B50000,Flute
10.075075075075075,-0.14126835608869176,Seth93,Sethares (1993),interference,#B50000,Flute
10.09009009009009,-0.14159240967705974,Seth93,Sethares (1993),interference,#B50000,Flute
10.105105105105105,-0.14189742121806634,Seth93,Sethares (1993),interference,#B50000,Flute
10.12012012012012,-0.14218336143252538,Seth93,Sethares (1993),interference,#B50000,Flute
10.135135135135135,-0.14245012136560745,Seth93,Sethares (1993),interference,#B50000,Flute
10.15015015015015,-0.14269751227595132,Seth93,Sethares (1993),interference,#B50000,Flute
10.165165165165165,-0.142925265400276,Seth93,Sethares (1993),interference,#B50000,Flute
10.18018018018018,-0.14329239604410632,Seth93,Sethares (1993),interference,#B50000,Flute
10.195195195195195,-0.1440478755055128,Seth93,Sethares (1993),interference,#B50000,Flute
10.21021021021021,-0.14478491513667135,Seth93,Sethares (1993),interference,#B50000,Flute
10.225225225225225,-0.14550476482045677,Seth93,Sethares (1993),interference,#B50000,Flute
10.24024024024024,-0.14620860153851417,Seth93,Sethares (1993),interference,#B50000,Flute
10.255255255255255,-0.1468975317106331,Seth93,Sethares (1993),interference,#B50000,Flute
10.27027027027027,-0.14757259342902143,Seth93,Sethares (1993),interference,#B50000,Flute
10.285285285285285,-0.14823475859058058,Seth93,Sethares (1993),interference,#B50000,Flute
10.3003003003003,-0.1488849349301802,Seth93,Sethares (1993),interference,#B50000,Flute
10.315315315315315,-0.1495239679578065,Seth93,Sethares (1993),interference,#B50000,Flute
10.33033033033033,-0.15015264280233093,Seth93,Sethares (1993),interference,#B50000,Flute
10.345345345345345,-0.15077168596455265,Seth93,Sethares (1993),interference,#B50000,Flute
10.36036036036036,-0.1513817669820334,Seth93,Sethares (1993),interference,#B50000,Flute
10.375375375375375,-0.15198350536410854,Seth93,Sethares (1993),interference,#B50000,Flute
10.39039039039039,-0.15257745010328755,Seth93,Sethares (1993),interference,#B50000,Flute
10.405405405405405,-0.15316411493767426,Seth93,Sethares (1993),interference,#B50000,Flute
10.42042042042042,-0.15374395651728878,Seth93,Sethares (1993),interference,#B50000,Flute
10.435435435435435,-0.15431738201336917,Seth93,Sethares (1993),interference,#B50000,Flute
10.45045045045045,-0.15488474869257718,Seth93,Sethares (1993),interference,#B50000,Flute
10.465465465465465,-0.1554463674394265,Seth93,Sethares (1993),interference,#B50000,Flute
10.48048048048048,-0.15600250218551917,Seth93,Sethares (1993),interference,#B50000,Flute
10.495495495495495,-0.1565533632316967,Seth93,Sethares (1993),interference,#B50000,Flute
10.51051051051051,-0.15709918283869165,Seth93,Sethares (1993),interference,#B50000,Flute
10.525525525525525,-0.15763999777076126,Seth93,Sethares (1993),interference,#B50000,Flute
10.54054054054054,-0.15817593724385767,Seth93,Sethares (1993),interference,#B50000,Flute
10.555555555555555,-0.15870704560456889,Seth93,Sethares (1993),interference,#B50000,Flute
10.57057057057057,-0.15923332545756158,Seth93,Sethares (1993),interference,#B50000,Flute
10.585585585585585,-0.15975473824330985,Seth93,Sethares (1993),interference,#B50000,Flute
10.6006006006006,-0.16027120475503256,Seth93,Sethares (1993),interference,#B50000,Flute
10.615615615615615,-0.1607826055958298,Seth93,Sethares (1993),interference,#B50000,Flute
10.63063063063063,-0.1612887815769399,Seth93,Sethares (1993),interference,#B50000,Flute
10.645645645645645,-0.1617895340579826,Seth93,Sethares (1993),interference,#B50000,Flute
10.66066066066066,-0.1622846252299483,Seth93,Sethares (1993),interference,#B50000,Flute
10.675675675675675,-0.16277377834165743,Seth93,Sethares (1993),interference,#B50000,Flute
10.69069069069069,-0.16325667787031764,Seth93,Sethares (1993),interference,#B50000,Flute
10.705705705705705,-0.16373296963674625,Seth93,Sethares (1993),interference,#B50000,Flute
10.72072072072072,-0.1642022608657621,Seth93,Sethares (1993),interference,#B50000,Flute
10.735735735735735,-0.16466412019217386,Seth93,Sethares (1993),interference,#B50000,Flute
10.75075075075075,-0.16511807761272282,Seth93,Sethares (1993),interference,#B50000,Flute
10.765765765765765,-0.16556362438428593,Seth93,Sethares (1993),interference,#B50000,Flute
10.78078078078078,-0.16600021286855735,Seth93,Sethares (1993),interference,#B50000,Flute
10.795795795795796,-0.16642725632337824,Seth93,Sethares (1993),interference,#B50000,Flute
10.81081081081081,-0.16684412864080886,Seth93,Sethares (1993),interference,#B50000,Flute
10.825825825825826,-0.16725016403197024,Seth93,Sethares (1993),interference,#B50000,Flute
10.84084084084084,-0.16764465665862677,Seth93,Sethares (1993),interference,#B50000,Flute
10.855855855855856,-0.16802686021140284,Seth93,Sethares (1993),interference,#B50000,Flute
10.87087087087087,-0.16839598743446765,Seth93,Sethares (1993),interference,#B50000,Flute
10.885885885885886,-0.16875120959646164,Seth93,Sethares (1993),interference,#B50000,Flute
10.9009009009009,-0.16909165590735545,Seth93,Sethares (1993),interference,#B50000,Flute
10.915915915915916,-0.16941641288088471,Seth93,Sethares (1993),interference,#B50000,Flute
10.93093093093093,-0.16972452364212956,Seth93,Sethares (1993),interference,#B50000,Flute
10.945945945945946,-0.17001498717972977,Seth93,Sethares (1993),interference,#B50000,Flute
10.96096096096096,-0.1702867575421841,Seth93,Sethares (1993),interference,#B50000,Flute
10.975975975975976,-0.17053874297758712,Seth93,Sethares (1993),interference,#B50000,Flute
10.99099099099099,-0.17076980501610758,Seth93,Sethares (1993),interference,#B50000,Flute
11.006006006006006,-0.1709787574944321,Seth93,Sethares (1993),interference,#B50000,Flute
11.02102102102102,-0.1711643655213316,Seth93,Sethares (1993),interference,#B50000,Flute
11.036036036036036,-0.17132534438343708,Seth93,Sethares (1993),interference,#B50000,Flute
11.05105105105105,-0.1714603583902382,Seth93,Sethares (1993),interference,#B50000,Flute
11.066066066066066,-0.1715680196572401,Seth93,Sethares (1993),interference,#B50000,Flute
11.08108108108108,-0.1716468868261521,Seth93,Sethares (1993),interference,#B50000,Flute
11.096096096096096,-0.1716954637208888,Seth93,Sethares (1993),interference,#B50000,Flute
11.11111111111111,-0.1717121979381018,Seth93,Sethares (1993),interference,#B50000,Flute
11.126126126126126,-0.1716954793708745,Seth93,Sethares (1993),interference,#B50000,Flute
11.14114114114114,-0.17164363866413107,Seth93,Sethares (1993),interference,#B50000,Flute
11.156156156156156,-0.17155494560023576,Seth93,Sethares (1993),interference,#B50000,Flute
11.17117117117117,-0.17142760741316657,Seth93,Sethares (1993),interference,#B50000,Flute
11.186186186186186,-0.17125976702956888,Seth93,Sethares (1993),interference,#B50000,Flute
11.2012012012012,-0.1710495012349048,Seth93,Sethares (1993),interference,#B50000,Flute
11.216216216216216,-0.17079481876282201,Seth93,Sethares (1993),interference,#B50000,Flute
11.23123123123123,-0.17049365830578123,Seth93,Sethares (1993),interference,#B50000,Flute
11.246246246246246,-0.1701438864448781,Seth93,Sethares (1993),interference,#B50000,Flute
11.26126126126126,-0.169743295496712,Seth93,Sethares (1993),interference,#B50000,Flute
11.276276276276276,-0.16928960127503961,Seth93,Sethares (1993),interference,#B50000,Flute
11.29129129129129,-0.16878044076486448,Seth93,Sethares (1993),interference,#B50000,Flute
11.306306306306306,-0.16821336970650533,Seth93,Sethares (1993),interference,#B50000,Flute
11.32132132132132,-0.16758586008707088,Seth93,Sethares (1993),interference,#B50000,Flute
11.336336336336336,-0.16689529753667218,Seth93,Sethares (1993),interference,#B50000,Flute
11.35135135135135,-0.16613897862658422,Seth93,Sethares (1993),interference,#B50000,Flute
11.366366366366366,-0.16531410593073426,Seth93,Sethares (1993),interference,#B50000,Flute
11.381381381381381,-0.1644177936722372,Seth93,Sethares (1993),interference,#B50000,Flute
11.396396396396396,-0.1634470518616246,Seth93,Sethares (1993),interference,#B50000,Flute
11.411411411411411,-0.16239879175099858,Seth93,Sethares (1993),interference,#B50000,Flute
11.426426426426426,-0.1612698204477418,Seth93,Sethares (1993),interference,#B50000,Flute
11.441441441441441,-0.1600568379587408,Seth93,Sethares (1993),interference,#B50000,Flute
11.456456456456456,-0.15875643211515045,Seth93,Sethares (1993),interference,#B50000,Flute
11.471471471471471,-0.15736507736934352,Seth93,Sethares (1993),interference,#B50000,Flute
11.486486486486486,-0.15587912913039947,Seth93,Sethares (1993),interference,#B50000,Flute
11.501501501501501,-0.15429471484146687,Seth93,Sethares (1993),interference,#B50000,Flute
11.516516516516516,-0.15260814824649066,Seth93,Sethares (1993),interference,#B50000,Flute
11.531531531531531,-0.15081530629022422,Seth93,Sethares (1993),interference,#B50000,Flute
11.546546546546546,-0.14891203145135457,Seth93,Sethares (1993),interference,#B50000,Flute
11.561561561561561,-0.14689402716774788,Seth93,Sethares (1993),interference,#B50000,Flute
11.576576576576576,-0.14475685324128457,Seth93,Sethares (1993),interference,#B50000,Flute
11.591591591591591,-0.14249592108157735,Seth93,Sethares (1993),interference,#B50000,Flute
11.606606606606606,-0.1401064887832144,Seth93,Sethares (1993),interference,#B50000,Flute
11.621621621621621,-0.1375836560310098,Seth93,Sethares (1993),interference,#B50000,Flute
11.636636636636636,-0.1349223588275515,Seth93,Sethares (1993),interference,#B50000,Flute
11.651651651651651,-0.13211736403704677,Seth93,Sethares (1993),interference,#B50000,Flute
11.666666666666666,-0.12916326373937903,Seth93,Sethares (1993),interference,#B50000,Flute
11.681681681681681,-0.12605446938792678,Seth93,Sethares (1993),interference,#B50000,Flute
11.696696696696696,-0.12278520576455262,Seth93,Sethares (1993),interference,#B50000,Flute
11.711711711711711,-0.11934950472493139,Seth93,Sethares (1993),interference,#B50000,Flute
11.726726726726726,-0.11574119872706244,Seth93,Sethares (1993),interference,#B50000,Flute
11.741741741741741,-0.11195391413563245,Seth93,Sethares (1993),interference,#B50000,Flute
11.756756756756756,-0.10798106429461869,Seth93,Sethares (1993),interference,#B50000,Flute
11.771771771771771,-0.10381584236017492,Seth93,Sethares (1993),interference,#B50000,Flute
11.786786786786786,-0.09945121388569332,Seth93,Sethares (1993),interference,#B50000,Flute
11.801801801801801,-0.0948799091504863,Seth93,Sethares (1993),interference,#B50000,Flute
11.816816816816816,-0.09009441522333415,Seth93,Sethares (1993),interference,#B50000,Flute
11.831831831831831,-0.08508696775184257,Seth93,Sethares (1993),interference,#B50000,Flute
11.846846846846846,-0.07984954246811025,Seth93,Sethares (1993),interference,#B50000,Flute
11.861861861861861,-0.07437384640099537,Seth93,Sethares (1993),interference,#B50000,Flute
11.876876876876876,-0.06865130878488332,Seth93,Sethares (1993),interference,#B50000,Flute
11.891891891891891,-0.06267307165442687,Seth93,Sethares (1993),interference,#B50000,Flute
11.906906906906906,-0.05642998011450665,Seth93,Sethares (1993),interference,#B50000,Flute
11.921921921921921,-0.04991257227411061,Seth93,Sethares (1993),interference,#B50000,Flute
11.936936936936936,-0.04311106883250666,Seth93,Sethares (1993),interference,#B50000,Flute
11.951951951951951,-0.03601536230576296,Seth93,Sethares (1993),interference,#B50000,Flute
11.966966966966966,-0.028615005881031077,Seth93,Sethares (1993),interference,#B50000,Flute
11.981981981981981,-0.02089920188571922,Seth93,Sethares (1993),interference,#B50000,Flute
11.996996996996996,-0.012856789858277366,Seth93,Sethares (1993),interference,#B50000,Flute
12.012012012012011,-0.017655193450143703,Seth93,Sethares (1993),interference,#B50000,Flute
12.027027027027026,-0.025422994623852602,Seth93,Sethares (1993),interference,#B50000,Flute
12.042042042042041,-0.032877125824658494,Seth93,Sethares (1993),interference,#B50000,Flute
12.057057057057056,-0.040027709144720015,Seth93,Sethares (1993),interference,#B50000,Flute
12.072072072072071,-0.04688455952908805,Seth93,Sethares (1993),interference,#B50000,Flute
12.087087087087086,-0.05345719411810766,Seth93,Sethares (1993),interference,#B50000,Flute
12.102102102102101,-0.05975484130322515,Seth93,Sethares (1993),interference,#B50000,Flute
12.117117117117116,-0.06578644950495106,Seth93,Sethares (1993),interference,#B50000,Flute
12.132132132132131,-0.07156069568162776,Seth93,Sethares (1993),interference,#B50000,Flute
12.147147147147146,-0.07708599357707839,Seth93,Sethares (1993),interference,#B50000,Flute
12.162162162162161,-0.0823705017152985,Seth93,Sethares (1993),interference,#B50000,Flute
12.177177177177176,-0.08742213114984672,Seth93,Sethares (1993),interference,#B50000,Flute
12.192192192192191,-0.09224855297546392,Seth93,Sethares (1993),interference,#B50000,Flute
12.207207207207206,-0.09685720560922038,Seth93,Sethares (1993),interference,#B50000,Flute
12.222222222222221,-0.10125530184826768,Seth93,Sethares (1993),interference,#B50000,Flute
12.237237237237236,-0.10544983571095168,Seth93,Sethares (1993),interference,#B50000,Flute
12.252252252252251,-0.10944758906802794,Seth93,Sethares (1993),interference,#B50000,Flute
12.267267267267266,-0.11325513807029473,Seth93,Sethares (1993),interference,#B50000,Flute
12.282282282282281,-0.11687885937893644,Seth93,Sethares (1993),interference,#B50000,Flute
12.297297297297296,-0.12032493620459275,Seth93,Sethares (1993),interference,#B50000,Flute
12.312312312312311,-0.12359936416095052,Seth93,Sethares (1993),interference,#B50000,Flute
12.327327327327327,-0.1267079569385791,Seth93,Sethares (1993),interference,#B50000,Flute
12.342342342342342,-0.1296563518044654,Seth93,Sethares (1993),interference,#B50000,Flute
12.357357357357357,-0.13245001493253264,Seth93,Sethares (1993),interference,#B50000,Flute
12.372372372372372,-0.13509424623745164,Seth93,Sethares (1993),interference,#B50000,Flute
12.387387387387387,-0.13759418563715997,Seth93,Sethares (1993),interference,#B50000,Flute
12.402402402402402,-0.139954816145273,Seth93,Sethares (1993),interference,#B50000,Flute
12.417417417417417,-0.14218096966551005,Seth93,Sethares (1993),interference,#B50000,Flute
12.432432432432432,-0.14427733130089246,Seth93,Sethares (1993),interference,#B50000,Flute
12.447447447447447,-0.14624844416760832,Seth93,Sethares (1993),interference,#B50000,Flute
12.462462462462462,-0.14809871209909048,Seth93,Sethares (1993),interference,#B50000,Flute
12.477477477477477,-0.14983240616530813,Seth93,Sethares (1993),interference,#B50000,Flute
12.492492492492492,-0.15145366980443195,Seth93,Sethares (1993),interference,#B50000,Flute
12.507507507507507,-0.15296660736749743,Seth93,Sethares (1993),interference,#B50000,Flute
12.522522522522522,-0.15437491721455926,Seth93,Sethares (1993),interference,#B50000,Flute
12.537537537537537,-0.15568247527762633,Seth93,Sethares (1993),interference,#B50000,Flute
12.552552552552552,-0.15689294039736476,Seth93,Sethares (1993),interference,#B50000,Flute
12.567567567567567,-0.1580098598124322,Seth93,Sethares (1993),interference,#B50000,Flute
12.582582582582582,-0.1590366724903017,Seth93,Sethares (1993),interference,#B50000,Flute
12.597597597597597,-0.15997671235445776,Seth93,Sethares (1993),interference,#B50000,Flute
12.612612612612612,-0.16083321141106047,Seth93,Sethares (1993),interference,#B50000,Flute
12.627627627627627,-0.16160930277802593,Seth93,Sethares (1993),interference,#B50000,Flute
12.642642642642642,-0.16230802361937496,Seth93,Sethares (1993),interference,#B50000,Flute
12.657657657657657,-0.16293231798764105,Seth93,Sethares (1993),interference,#B50000,Flute
12.672672672672672,-0.16348503957699673,Seth93,Sethares (1993),interference,#B50000,Flute
12.687687687687687,-0.1639689543896855,Seth93,Sethares (1993),interference,#B50000,Flute
12.702702702702702,-0.16438674331826628,Seth93,Sethares (1993),interference,#B50000,Flute
12.717717717717717,-0.16474100464607613,Seth93,Sethares (1993),interference,#B50000,Flute
12.732732732732732,-0.16503425646824527,Seth93,Sethares (1993),interference,#B50000,Flute
12.747747747747747,-0.16526893903551867,Seth93,Sethares (1993),interference,#B50000,Flute
12.762762762762762,-0.16544741702304663,Seth93,Sethares (1993),interference,#B50000,Flute
12.777777777777777,-0.16557198172625298,Seth93,Sethares (1993),interference,#B50000,Flute
12.792792792792792,-0.16564485318579475,Seth93,Sethares (1993),interference,#B50000,Flute
12.807807807807807,-0.16566818224356405,Seth93,Sethares (1993),interference,#B50000,Flute
12.822822822822824,-0.16564405253161438,Seth93,Sethares (1993),interference,#B50000,Flute
12.837837837837839,-0.1655744823958172,Seth93,Sethares (1993),interference,#B50000,Flute
12.852852852852854,-0.1654614267559992,Seth93,Sethares (1993),interference,#B50000,Flute
12.867867867867869,-0.16530677890422663,Seth93,Sethares (1993),interference,#B50000,Flute
12.882882882882884,-0.16511237224286548,Seth93,Sethares (1993),interference,#B50000,Flute
12.897897897897899,-0.16487998196395487,Seth93,Sethares (1993),interference,#B50000,Flute
12.912912912912914,-0.16461132667139464,Seth93,Sethares (1993),interference,#B50000,Flute
12.927927927927929,-0.16430806994737157,Seth93,Sethares (1993),interference,#B50000,Flute
12.942942942942944,-0.16397182186440165,Seth93,Sethares (1993),interference,#B50000,Flute
12.957957957957959,-0.1636041404443,Seth93,Sethares (1993),interference,#B50000,Flute
12.972972972972974,-0.16320653306534094,Seth93,Sethares (1993),interference,#B50000,Flute
12.987987987987989,-0.16278045781880948,Seth93,Sethares (1993),interference,#B50000,Flute
13.003003003003004,-0.1623273248161009,Seth93,Sethares (1993),interference,#B50000,Flute
13.018018018018019,-0.16184849744746177,Seth93,Sethares (1993),interference,#B50000,Flute
13.033033033033034,-0.16134529359341698,Seth93,Sethares (1993),interference,#B50000,Flute
13.048048048048049,-0.1608189867898891,Seth93,Sethares (1993),interference,#B50000,Flute
13.063063063063064,-0.16027080734793883,Seth93,Sethares (1993),interference,#B50000,Flute
13.078078078078079,-0.15970194342903896,Seth93,Sethares (1993),interference,#B50000,Flute
13.093093093093094,-0.1591135420767177,Seth93,Sethares (1993),interference,#B50000,Flute
13.108108108108109,-0.15850671020537316,Seth93,Sethares (1993),interference,#B50000,Flute
13.123123123123124,-0.15788251554701885,Seth93,Sethares (1993),interference,#B50000,Flute
13.138138138138139,-0.15724198755665095,Seth93,Sethares (1993),interference,#B50000,Flute
13.153153153153154,-0.15658611827690813,Seth93,Sethares (1993),interference,#B50000,Flute
13.168168168168169,-0.15591586316263495,Seth93,Sethares (1993),interference,#B50000,Flute
13.183183183183184,-0.1552321418659074,Seth93,Sethares (1993),interference,#B50000,Flute
13.198198198198199,-0.15453583898205664,Seth93,Sethares (1993),interference,#B50000,Flute
13.213213213213214,-0.15382780475715693,Seth93,Sethares (1993),interference,#B50000,Flute
13.228228228228229,-0.15310885575741476,Seth93,Sethares (1993),interference,#B50000,Flute
13.243243243243244,-0.15237977550085138,Seth93,Sethares (1993),interference,#B50000,Flute
13.258258258258259,-0.15164131505161643,Seth93,Sethares (1993),interference,#B50000,Flute
13.273273273273274,-0.150894193577233,Seth93,Sethares (1993),interference,#B50000,Flute
13.288288288288289,-0.1501390988690392,Seth93,Sethares (1993),interference,#B50000,Flute
13.303303303303304,-0.14937668782602204,Seth93,Sethares (1993),interference,#B50000,Flute
13.318318318318319,-0.14860758690222708,Seth93,Sethares (1993),interference,#B50000,Flute
13.333333333333334,-0.1478323925178544,Seth93,Sethares (1993),interference,#B50000,Flute
13.348348348348349,-0.1470516714341208,Seth93,Sethares (1993),interference,#B50000,Flute
13.363363363363364,-0.1462659603499808,Seth93,Sethares (1993),interference,#B50000,Flute
13.378378378378379,-0.14547576918491206,Seth93,Sethares (1993),interference,#B50000,Flute
13.393393393393394,-0.14468157685571073,Seth93,Sethares (1993),interference,#B50000,Flute
13.408408408408409,-0.14388383451190745,Seth93,Sethares (1993),interference,#B50000,Flute
13.423423423423424,-0.14308296497447956,Seth93,Sethares (1993),interference,#B50000,Flute
13.438438438438439,-0.14227936328191715,Seth93,Sethares (1993),interference,#B50000,Flute
13.453453453453454,-0.14147339525182667,Seth93,Sethares (1993),interference,#B50000,Flute
13.468468468468469,-0.14066539990042154,Seth93,Sethares (1993),interference,#B50000,Flute
13.483483483483484,-0.1398556876155452,Seth93,Sethares (1993),interference,#B50000,Flute
13.498498498498499,-0.13904454345712003,Seth93,Sethares (1993),interference,#B50000,Flute
13.513513513513514,-0.13823216340684552,Seth93,Sethares (1993),interference,#B50000,Flute
13.528528528528529,-0.137418886334909,Seth93,Sethares (1993),interference,#B50000,Flute
13.543543543543544,-0.13660485576478676,Seth93,Sethares (1993),interference,#B50000,Flute
13.558558558558559,-0.13579024209505264,Seth93,Sethares (1993),interference,#B50000,Flute
13.573573573573574,-0.13497518725251942,Seth93,Sethares (1993),interference,#B50000,Flute
13.588588588588589,-0.13415980445993916,Seth93,Sethares (1993),interference,#B50000,Flute
13.603603603603604,-0.13334417796150674,Seth93,Sethares (1993),interference,#B50000,Flute
13.618618618618619,-0.13252836270532942,Seth93,Sethares (1993),interference,#B50000,Flute
13.633633633633634,-0.1317123839819755,Seth93,Sethares (1993),interference,#B50000,Flute
13.64864864864865,-0.13089623701816636,Seth93,Sethares (1993),interference,#B50000,Flute
13.663663663663664,-0.1300798865245862,Seth93,Sethares (1993),interference,#B50000,Flute
13.67867867867868,-0.12926326619673978,Seth93,Sethares (1993),interference,#B50000,Flute
13.693693693693694,-0.12844627816772475,Seth93,Sethares (1993),interference,#B50000,Flute
13.70870870870871,-0.1276287924116871,Seth93,Sethares (1993),interference,#B50000,Flute
13.723723723723724,-0.1268106460967069,Seth93,Sethares (1993),interference,#B50000,Flute
13.73873873873874,-0.1259916428857327,Seth93,Sethares (1993),interference,#B50000,Flute
13.753753753753754,-0.12517155218415385,Seth93,Sethares (1993),interference,#B50000,Flute
13.76876876876877,-0.12435010833250891,Seth93,Sethares (1993),interference,#B50000,Flute
13.783783783783784,-0.12352700974272939,Seth93,Sethares (1993),interference,#B50000,Flute
13.7987987987988,-0.12270191797626687,Seth93,Sethares (1993),interference,#B50000,Flute
13.813813813813814,-0.12187445676235645,Seth93,Sethares (1993),interference,#B50000,Flute
13.82882882882883,-0.12104421095456047,Seth93,Sethares (1993),interference,#B50000,Flute
13.843843843843844,-0.12021072542369507,Seth93,Sethares (1993),interference,#B50000,Flute
13.85885885885886,-0.11937350388509345,Seth93,Sethares (1993),interference,#B50000,Flute
13.873873873873874,-0.11853200765810354,Seth93,Sethares (1993),interference,#B50000,Flute
13.88888888888889,-0.11768565435561364,Seth93,Sethares (1993),interference,#B50000,Flute
13.903903903903904,-0.11683381650127292,Seth93,Sethares (1993),interference,#B50000,Flute
13.91891891891892,-0.11597582007199472,Seth93,Sethares (1993),interference,#B50000,Flute
13.933933933933934,-0.11511094296321857,Seth93,Sethares (1993),interference,#B50000,Flute
13.94894894894895,-0.11423841337426718,Seth93,Sethares (1993),interference,#B50000,Flute
13.963963963963964,-0.11335740811105974,Seth93,Sethares (1993),interference,#B50000,Flute
13.97897897897898,-0.11246705080328138,Seth93,Sethares (1993),interference,#B50000,Flute
13.993993993993994,-0.11156641003300619,Seth93,Sethares (1993),interference,#B50000,Flute
14.00900900900901,-0.11065449737164593,Seth93,Sethares (1993),interference,#B50000,Flute
14.024024024024024,-0.10973026532193514,Seth93,Sethares (1993),interference,#B50000,Flute
14.03903903903904,-0.10879260516155147,Seth93,Sethares (1993),interference,#B50000,Flute
14.054054054054054,-0.10840579720899853,Seth93,Sethares (1993),interference,#B50000,Flute
14.06906906906907,-0.10800742070528588,Seth93,Sethares (1993),interference,#B50000,Flute
14.084084084084084,-0.10759570551619733,Seth93,Sethares (1993),interference,#B50000,Flute
14.0990990990991,-0.10717112492016483,Seth93,Sethares (1993),interference,#B50000,Flute
14.114114114114114,-0.10673409116874387,Seth93,Sethares (1993),interference,#B50000,Flute
14.12912912912913,-0.10628495602304595,Seth93,Sethares (1993),interference,#B50000,Flute
14.144144144144144,-0.10582401119544367,Seth93,Sethares (1993),interference,#B50000,Flute
14.15915915915916,-0.10535148869696116,Seth93,Sethares (1993),interference,#B50000,Flute
14.174174174174174,-0.10486756109064362,Seth93,Sethares (1993),interference,#B50000,Flute
14.18918918918919,-0.10437234165105175,Seth93,Sethares (1993),interference,#B50000,Flute
14.204204204204204,-0.10386588442993384,Seth93,Sethares (1993),interference,#B50000,Flute
14.21921921921922,-0.10334818422797365,Seth93,Sethares (1993),interference,#B50000,Flute
14.234234234234235,-0.10281917647240547,Seth93,Sethares (1993),interference,#B50000,Flute
14.24924924924925,-0.10227873700016063,Seth93,Sethares (1993),interference,#B50000,Flute
14.264264264264265,-0.10172668174606925,Seth93,Sethares (1993),interference,#B50000,Flute
14.27927927927928,-0.10116276633553006,Seth93,Sethares (1993),interference,#B50000,Flute
14.294294294294295,-0.10058668558092845,Seth93,Sethares (1993),interference,#B50000,Flute
14.30930930930931,-0.09999807288094004,Seth93,Sethares (1993),interference,#B50000,Flute
14.324324324324325,-0.09939649952175204,Seth93,Sethares (1993),interference,#B50000,Flute
14.33933933933934,-0.09878147387907396,Seth93,Sethares (1993),interference,#B50000,Flute
14.354354354354355,-0.09815244051969695,Seth93,Sethares (1993),interference,#B50000,Flute
14.36936936936937,-0.09750877897729808,Seth93,Sethares (1993),interference,#B50000,Flute
14.384384384384385,-0.09684980354793578,Seth93,Sethares (1993),interference,#B50000,Flute
14.3993993993994,-0.09617476072741084,Seth93,Sethares (1993),interference,#B50000,Flute
14.414414414414415,-0.09548282880200906,Seth93,Sethares (1993),interference,#B50000,Flute
14.42942942942943,-0.09477311619677455,Seth93,Sethares (1993),interference,#B50000,Flute
14.444444444444445,-0.09404466032452415,Seth93,Sethares (1993),interference,#B50000,Flute
14.45945945945946,-0.09329642440094407,Seth93,Sethares (1993),interference,#B50000,Flute
14.474474474474475,-0.09252729798593379,Seth93,Sethares (1993),interference,#B50000,Flute
14.48948948948949,-0.09173609326141319,Seth93,Sethares (1993),interference,#B50000,Flute
14.504504504504505,-0.09092148968665505,Seth93,Sethares (1993),interference,#B50000,Flute
14.51951951951952,-0.09008224811877646,Seth93,Sethares (1993),interference,#B50000,Flute
14.534534534534535,-0.08921688511458283,Seth93,Sethares (1993),interference,#B50000,Flute
14.54954954954955,-0.08832388511475706,Seth93,Sethares (1993),interference,#B50000,Flute
14.564564564564565,-0.0874016445885864,Seth93,Sethares (1993),interference,#B50000,Flute
14.57957957957958,-0.08644846938083554,Seth93,Sethares (1993),interference,#B50000,Flute
14.594594594594595,-0.08546257191798265,Seth93,Sethares (1993),interference,#B50000,Flute
14.60960960960961,-0.08444206826985116,Seth93,Sethares (1993),interference,#B50000,Flute
14.624624624624625,-0.08338497506252578,Seth93,Sethares (1993),interference,#B50000,Flute
14.63963963963964,-0.08228920623818602,Seth93,Sethares (1993),interference,#B50000,Flute
14.654654654654655,-0.08115256965732404,Seth93,Sethares (1993),interference,#B50000,Flute
14.66966966966967,-0.08008315333840701,Seth93,Sethares (1993),interference,#B50000,Flute
14.684684684684685,-0.08058375195424998,Seth93,Sethares (1993),interference,#B50000,Flute
14.6996996996997,-0.08104182556704963,Seth93,Sethares (1993),interference,#B50000,Flute
14.714714714714715,-0.08145952705643698,Seth93,Sethares (1993),interference,#B50000,Flute
14.72972972972973,-0.08183890723142871,Seth93,Sethares (1993),interference,#B50000,Flute
14.744744744744745,-0.08218191786623918,Seth93,Sethares (1993),interference,#B50000,Flute
14.75975975975976,-0.08249041460152891,Seth93,Sethares (1993),interference,#B50000,Flute
14.774774774774775,-0.08276615971448148,Seth93,Sethares (1993),interference,#B50000,Flute
14.78978978978979,-0.0830108247609437,Seth93,Sethares (1993),interference,#B50000,Flute
14.804804804804805,-0.08322599309274305,Seth93,Sethares (1993),interference,#B50000,Flute
14.81981981981982,-0.08341316225313632,Seth93,Sethares (1993),interference,#B50000,Flute
14.834834834834835,-0.08357374625320639,Seth93,Sethares (1993),interference,#B50000,Flute
14.84984984984985,-0.0837090777319038,Seth93,Sethares (1993),interference,#B50000,Flute
14.864864864864865,-0.08382041000228137,Seth93,Sethares (1993),interference,#B50000,Flute
14.87987987987988,-0.08390891898634698,Seth93,Sethares (1993),interference,#B50000,Flute
14.894894894894895,-0.08397570504083658,Seth93,Sethares (1993),interference,#B50000,Flute
14.90990990990991,-0.08402179467607022,Seth93,Sethares (1993),interference,#B50000,Flute
14.924924924924925,-0.08404814216994799,Seth93,Sethares (1993),interference,#B50000,Flute
14.93993993993994,-0.08405563107901327,Seth93,Sethares (1993),interference,#B50000,Flute
14.954954954954955,-0.08404507564838307,Seth93,Sethares (1993),interference,#B50000,Flute
14.96996996996997,-0.08401722212224855,Seth93,Sethares (1993),interference,#B50000,Flute
14.984984984984985,-0.08397274995651333,Seth93,Sethares (1993),interference,#B50000,Flute
15,-0.08391227293503083,Seth93,Sethares (1993),interference,#B50000,Flute
