interval,output,model_id,model_label,model_theory,model_colour,timbre_label
0,2.3449215285188365,Har18,Harrison & Pearce (2018),harmonicity,#11A3FF,Flute
0.015015015015015015,2.3345531430643485,Har18,Harrison & Pearce (2018),harmonicity,#11A3FF,Flute
0.03003003003003003,2.3182650466111174,Har18,Harrison & Pearce (2018),harmonicity,#11A3FF,Flute
0.04504504504504504,2.295739054578338,Har18,Harrison & Pearce (2018),harmonicity,#11A3FF,Flute
0.06006006006006006,2.267614890722424,Har18,Harrison & Pearce (2018),harmonicity,#11A3FF,Flute
0.07507507507507508,2.23491835150298,Har18,Harrison & Pearce (2018),harmonicity,#11A3FF,Flute
0.09009009009009009,2.19844970974097,Har18,Harrison & Pearce (2018),harmonicity,#11A3FF,Flute
0.10510510510510511,2.158769758818385,Har18,Harrison & Pearce (2018),harmonicity,#11A3FF,Flute
0.12012012012012012,2.116481833773358,Har18,Harrison & Pearce (2018),harmonicity,#11A3FF,Flute
0.13513513513513514,2.072339053495189,Har18,Harrison & Pearce (2018),harmonicity,#11A3FF,Flute
0.15015015015015015,2.027170605110496,Har18,Harrison & Pearce (2018),harmonicity,#11A3FF,Flute
0.16516516516516516,1.981780825196013,Har18,Harrison & Pearce (2018),harmonicity,#11A3FF,Flute
0.18018018018018017,1.9368865176473853,Har18,Harrison & Pearce (2018),harmonicity,#11A3FF,Flute
0.19519519519519518,1.8931085529728158,Har18,Harrison & Pearce (2018),harmonicity,#11A3FF,Flute
0.21021021021021022,1.8510109899382583,Har18,Harrison & Pearce (2018),harmonicity,#11A3FF,Flute
0.22522522522522523,1.8111346157441968,Har18,Harrison & Pearce (2018),harmonicity,#11A3FF,Flute
0.24024024024024024,1.7739476714612286,Har18,Harrison & Pearce (2018),harmonicity,#11A3FF,Flute
0.2552552552552553,1.7396869463730125,Har18,Harrison & Pearce (2018),harmonicity,#11A3FF,Flute
0.2702702702702703,1.708216563454252,Har18,Harrison & Pearce (2018),harmonicity,#11A3FF,Flute
0.2852852852852853,1.6791558616350222,Har18,Harrison & Pearce (2018),harmonicity,#11A3FF,Flute
0.3003003003003003,1.6522863701593635,Har18,Harrison & Pearce (2018),harmonicity,#11A3FF,Flute
0.3153153153153153,1.627801995750991,Har18,Harrison & Pearce (2018),harmonicity,#11A3FF,Flute
0.3303303303303303,1.6060838835383615,Har18,Harrison & Pearce (2018),harmonicity,#11A3FF,Flute
0.34534534534534533,1.5873063478490992,Har18,Harrison & Pearce (2018),harmonicity,#11A3FF,Flute
0.36036036036036034,1.5713236297686326,Har18,Harrison & Pearce (2018),harmonicity,#11A3FF,Flute
0.37537537537537535,1.5578286934072059,Har18,Harrison & Pearce (2018),harmonicity,#11A3FF,Flute
0.39039039039039036,1.5465149590918537,Har18,Harrison & Pearce (2018),harmonicity,#11A3FF,Flute
0.40540540540540543,1.5371262020693173,Har18,Harrison & Pearce (2018),harmonicity,#11A3FF,Flute
0.42042042042042044,1.529444927608104,Har18,Harrison & Pearce (2018),harmonicity,#11A3FF,Flute
0.43543543543543545,1.5232733414248318,Har18,Harrison & Pearce (2018),harmonicity,#11A3FF,Flute
0.45045045045045046,1.5184213525253842,Har18,Harrison & Pearce (2018),harmonicity,#11A3FF,Flute
0.46546546546546547,1.5147040522598392,Har18,Harrison & Pearce (2018),harmonicity,#11A3FF,Flute
0.4804804804804805,1.5119464013032735,Har18,Harrison & Pearce (2018),harmonicity,#11A3FF,Flute
0.4954954954954955,1.5099877535446005,Har18,Harrison & Pearce (2018),harmonicity,#11A3FF,Flute
0.5105105105105106,1.5086835745829468,Har18,Harrison & Pearce (2018),harmonicity,#11A3FF,Flute
0.5255255255255256,1.507905855805161,Har18,Harrison & Pearce (2018),harmonicity,#11A3FF,Flute
0.5405405405405406,1.5075396448365221,Har18,Harrison & Pearce (2018),harmonicity,#11A3FF,Flute
0.5555555555555556,1.507475923468685,Har18,Harrison & Pearce (2018),harmonicity,#11A3FF,Flute
0.5705705705705706,1.5076115549480953,Har18,Harrison & Pearce (2018),harmonicity,#11A3FF,Flute
0.5855855855855856,1.5078612329124101,Har18,Harrison & Pearce (2018),harmonicity,#11A3FF,Flute
0.6006006006006006,1.508166646171939,Har18,Harrison & Pearce (2018),harmonicity,#11A3FF,Flute
0.6156156156156156,1.5084903859033902,Har18,Harrison & Pearce (2018),harmonicity,#11A3FF,Flute
0.6306306306306306,1.508805711025133,Har18,Harrison & Pearce (2018),harmonicity,#11A3FF,Flute
0.6456456456456456,1.50909536088251,Har18,Harrison & Pearce (2018),harmonicity,#11A3FF,Flute
0.6606606606606606,1.5093515688580599,Har18,Harrison & Pearce (2018),harmonicity,#11A3FF,Flute
0.6756756756756757,1.509567908211833,Har18,Harrison & Pearce (2018),harmonicity,#11A3FF,Flute
0.6906906906906907,1.5097349680550352,Har18,Harrison & Pearce (2018),harmonicity,#11A3FF,Flute
0.7057057057057057,1.5098538047532515,Har18,Harrison & Pearce (2018),harmonicity,#11A3FF,Flute
0.7207207207207207,1.5099540017564022,Har18,Harrison & Pearce (2018),harmonicity,#11A3FF,Flute
0.7357357357357357,1.5100913357116106,Har18,Harrison & Pearce (2018),harmonicity,#11A3FF,Flute
0.7507507507507507,1.5103287852300493,Har18,Harrison & Pearce (2018),harmonicity,#11A3FF,Flute
0.7657657657657657,1.5107280354268051,Har18,Harrison & Pearce (2018),harmonicity,#11A3FF,Flute
0.7807807807807807,1.5113524257486697,Har18,Harrison & Pearce (2018),harmonicity,#11A3FF,Flute
0.7957957957957957,1.5122579736066961,Har18,Harrison & Pearce (2018),harmonicity,#11A3FF,Flute
0.8108108108108109,1.5134794491127745,Har18,Harrison & Pearce (2018),harmonicity,#11A3FF,Flute
0.8258258258258259,1.5150387708576623,Har18,Harrison & Pearce (2018),harmonicity,#11A3FF,Flute
0.8408408408408409,1.5169665941156079,Har18,Harrison & Pearce (2018),harmonicity,#11A3FF,Flute
0.8558558558558559,1.519305888303273,Har18,Harrison & Pearce (2018),harmonicity,#11A3FF,Flute
0.8708708708708709,1.522093998054687,Har18,Harrison & Pearce (2018),harmonicity,#11A3FF,Flute
0.8858858858858859,1.5253436386168155,Har18,Harrison & Pearce (2018),harmonicity,#11A3FF,Flute
0.9009009009009009,1.5290401173471666,Har18,Harrison & Pearce (2018),harmonicity,#11A3FF,Flute
0.9159159159159159,1.5331586642786823,Har18,Harrison & Pearce (2018),harmonicity,#11A3FF,Flute
0.9309309309309309,1.5376817112567422,Har18,Harrison & Pearce (2018),harmonicity,#11A3FF,Flute
0.9459459459459459,1.542583061179249,Har18,Harrison & Pearce (2018),harmonicity,#11A3FF,Flute
0.960960960960961,1.5477924903446625,Har18,Harrison & Pearce (2018),harmonicity,#11A3FF,Flute
0.975975975975976,1.5532057965308583,Har18,Harrison & Pearce (2018),harmonicity,#11A3FF,Flute
0.990990990990991,1.5587424569411992,Har18,Harrison & Pearce (2018),harmonicity,#11A3FF,Flute
1.006006006006006,1.5643545815865718,Har18,Harrison & Pearce (2018),harmonicity,#11A3FF,Flute
1.021021021021021,1.5699487869028719,Har18,Harrison & Pearce (2018),harmonicity,#11A3FF,Flute
1.0360360360360361,1.5753226014413324,Har18,Harrison & Pearce (2018),harmonicity,#11A3FF,Flute
1.0510510510510511,1.580207310083933,Har18,Harrison & Pearce (2018),harmonicity,#11A3FF,Flute
1.0660660660660661,1.5843713012787568,Har18,Harrison & Pearce (2018),harmonicity,#11A3FF,Flute
1.0810810810810811,1.5876800397589772,Har18,Harrison & Pearce (2018),harmonicity,#11A3FF,Flute
1.0960960960960962,1.5900820787602623,Har18,Harrison & Pearce (2018),harmonicity,#11A3FF,Flute
1.1111111111111112,1.5915681797439067,Har18,Harrison & Pearce (2018),harmonicity,#11A3FF,Flute
1.1261261261261262,1.5921483771567473,Har18,Harrison & Pearce (2018),harmonicity,#11A3FF,Flute
1.1411411411411412,1.5918490770060107,Har18,Harrison & Pearce (2018),harmonicity,#11A3FF,Flute
1.1561561561561562,1.5907130507880622,Har18,Harrison & Pearce (2018),harmonicity,#11A3FF,Flute
1.1711711711711712,1.5887952237045755,Har18,Harrison & Pearce (2018),harmonicity,#11A3FF,Flute
1.1861861861861862,1.5861620424137075,Har18,Harrison & Pearce (2018),harmonicity,#11A3FF,Flute
1.2012012012012012,1.5829084837050222,Har18,Harrison & Pearce (2018),harmonicity,#11A3FF,Flute
1.2162162162162162,1.5791828910323773,Har18,Harrison & Pearce (2018),harmonicity,#11A3FF,Flute
1.2312312312312312,1.5751730069681207,Har18,Harrison & Pearce (2018),harmonicity,#11A3FF,Flute
1.2462462462462462,1.5710444719993588,Har18,Harrison & Pearce (2018),harmonicity,#11A3FF,Flute
1.2612612612612613,1.5669110776610415,Har18,Harrison & Pearce (2018),harmonicity,#11A3FF,Flute
1.2762762762762763,1.562887417350301,Har18,Harrison & Pearce (2018),harmonicity,#11A3FF,Flute
1.2912912912912913,1.559145188319617,Har18,Harrison & Pearce (2018),harmonicity,#11A3FF,Flute
1.3063063063063063,1.5558823191190108,Har18,Harrison & Pearce (2018),harmonicity,#11A3FF,Flute
1.3213213213213213,1.55323790890959,Har18,Harrison & Pearce (2018),harmonicity,#11A3FF,Flute
1.3363363363363363,1.5512488696499878,Har18,Harrison & Pearce (2018),harmonicity,#11A3FF,Flute
1.3513513513513513,1.54988784753779,Har18,Harrison & Pearce (2018),harmonicity,#11A3FF,Flute
1.3663663663663663,1.5491400982512702,Har18,Harrison & Pearce (2018),harmonicity,#11A3FF,Flute
1.3813813813813813,1.5490395170740825,Har18,Harrison & Pearce (2018),harmonicity,#11A3FF,Flute
1.3963963963963963,1.5496292629491695,Har18,Harrison & Pearce (2018),harmonicity,#11A3FF,Flute
1.4114114114114114,1.550901759876503,Har18,Harrison & Pearce (2018),harmonicity,#11A3FF,Flute
1.4264264264264264,1.5527889411914544,Har18,Harrison & Pearce (2018),harmonicity,#11A3FF,Flute
1.4414414414414414,1.5552003304367317,Har18,Harrison & Pearce (2018),harmonicity,#11A3FF,Flute
1.4564564564564564,1.5580550082885916,Har18,Harrison & Pearce (2018),harmonicity,#11A3FF,Flute
1.4714714714714714,1.5612819743510982,Har18,Harrison & Pearce (2018),harmonicity,#11A3FF,Flute
1.4864864864864864,1.5648117648508404,Har18,Harrison & Pearce (2018),harmonicity,#11A3FF,Flute
1.5015015015015014,1.5685798076817734,Har18,Harrison & Pearce (2018),harmonicity,#11A3FF,Flute
1.5165165165165164,1.5725281314711264,Har18,Harrison & Pearce (2018),harmonicity,#11A3FF,Flute
1.5315315315315314,1.576592497505989,Har18,Harrison & Pearce (2018),harmonicity,#11A3FF,Flute
1.5465465465465464,1.580693674826905,Har18,Harrison & Pearce (2018),harmonicity,#11A3FF,Flute
1.5615615615615615,1.5847518223236532,Har18,Harrison & Pearce (2018),harmonicity,#11A3FF,Flute
1.5765765765765765,1.5887089661272928,Har18,Harrison & Pearce (2018),harmonicity,#11A3FF,Flute
1.5915915915915915,1.5925350759814705,Har18,Harrison & Pearce (2018),harmonicity,#11A3FF,Flute
1.6066066066066067,1.5962174385104162,Har18,Harrison & Pearce (2018),harmonicity,#11A3FF,Flute
1.6216216216216217,1.5997493340120803,Har18,Harrison & Pearce (2018),harmonicity,#11A3FF,Flute
1.6366366366366367,1.6031310858562033,Har18,Harrison & Pearce (2018),harmonicity,#11A3FF,Flute
1.6516516516516517,1.6063867385430712,Har18,Harrison & Pearce (2018),harmonicity,#11A3FF,Flute
1.6666666666666667,1.609579748290193,Har18,Harrison & Pearce (2018),harmonicity,#11A3FF,Flute
1.6816816816816818,1.6127955032559296,Har18,Harrison & Pearce (2018),harmonicity,#11A3FF,Flute
1.6966966966966968,1.6160902036118137,Har18,Harrison & Pearce (2018),harmonicity,#11A3FF,Flute
1.7117117117117118,1.6194620869209861,Har18,Harrison & Pearce (2018),harmonicity,#11A3FF,Flute
1.7267267267267268,1.6228872210399916,Har18,Harrison & Pearce (2018),harmonicity,#11A3FF,Flute
1.7417417417417418,1.6263799134876085,Har18,Harrison & Pearce (2018),harmonicity,#11A3FF,Flute
1.7567567567567568,1.6300056223238752,Har18,Harrison & Pearce (2018),harmonicity,#11A3FF,Flute
1.7717717717717718,1.6338333889397416,Har18,Harrison & Pearce (2018),harmonicity,#11A3FF,Flute
1.7867867867867868,1.6378830747088864,Har18,Harrison & Pearce (2018),harmonicity,#11A3FF,Flute
1.8018018018018018,1.6421212235991782,Har18,Harrison & Pearce (2018),harmonicity,#11A3FF,Flute
1.8168168168168168,1.6464972965813807,Har18,Harrison & Pearce (2018),harmonicity,#11A3FF,Flute
1.8318318318318318,1.6509723211471192,Har18,Harrison & Pearce (2018),harmonicity,#11A3FF,Flute
1.8468468468468469,1.6555191558734084,Har18,Harrison & Pearce (2018),harmonicity,#11A3FF,Flute
1.8618618618618619,1.6601113928276037,Har18,Harrison & Pearce (2018),harmonicity,#11A3FF,Flute
1.8768768768768769,1.6647161526459315,Har18,Harrison & Pearce (2018),harmonicity,#11A3FF,Flute
1.8918918918918919,1.6692914088292858,Har18,Harrison & Pearce (2018),harmonicity,#11A3FF,Flute
1.906906906906907,1.6737875205781214,Har18,Harrison & Pearce (2018),harmonicity,#11A3FF,Flute
1.921921921921922,1.6781519939634317,Har18,Harrison & Pearce (2018),harmonicity,#11A3FF,Flute
1.936936936936937,1.6823316584114079,Har18,Harrison & Pearce (2018),harmonicity,#11A3FF,Flute
1.951951951951952,1.6862691730362107,Har18,Harrison & Pearce (2018),harmonicity,#11A3FF,Flute
1.966966966966967,1.6899004522454253,Har18,Harrison & Pearce (2018),harmonicity,#11A3FF,Flute
1.981981981981982,1.6931646665098172,Har18,Harrison & Pearce (2018),harmonicity,#11A3FF,Flute
1.996996996996997,1.6960271210750413,Har18,Harrison & Pearce (2018),harmonicity,#11A3FF,Flute
2.012012012012012,1.6984911425912832,Har18,Harrison & Pearce (2018),harmonicity,#11A3FF,Flute
2.027027027027027,1.7005732864042062,Har18,Harrison & Pearce (2018),harmonicity,#11A3FF,Flute
2.042042042042042,1.7022586282768672,Har18,Harrison & Pearce (2018),harmonicity,#11A3FF,Flute
2.057057057057057,1.7034869508754542,Har18,Harrison & Pearce (2018),harmonicity,#11A3FF,Flute
2.0720720720720722,1.704185991266444,Har18,Harrison & Pearce (2018),harmonicity,#11A3FF,Flute
2.0870870870870872,1.7043112438461532,Har18,Harrison & Pearce (2018),harmonicity,#11A3FF,Flute
2.1021021021021022,1.7038565207625804,Har18,Harrison & Pearce (2018),harmonicity,#11A3FF,Flute
2.1171171171171173,1.7028428656367651,Har18,Harrison & Pearce (2018),harmonicity,#11A3FF,Flute
2.1321321321321323,1.70130500350543,Har18,Harrison & Pearce (2018),harmonicity,#11A3FF,Flute
2.1471471471471473,1.6992805276328975,Har18,Harrison & Pearce (2018),harmonicity,#11A3FF,Flute
2.1621621621621623,1.6968036869015832,Har18,Harrison & Pearce (2018),harmonicity,#11A3FF,Flute
2.1771771771771773,1.6939058328582324,Har18,Harrison & Pearce (2018),harmonicity,#11A3FF,Flute
2.1921921921921923,1.6906204265320777,Har18,Harrison & Pearce (2018),harmonicity,#11A3FF,Flute
2.2072072072072073,1.6869935507815854,Har18,Harrison & Pearce (2018),harmonicity,#11A3FF,Flute
2.2222222222222223,1.6831012954874467,Har18,Harrison & Pearce (2018),harmonicity,#11A3FF,Flute
2.2372372372372373,1.6790537490981288,Har18,Harrison & Pearce (2018),harmonicity,#11A3FF,Flute
2.2522522522522523,1.6749453844800601,Har18,Harrison & Pearce (2018),harmonicity,#11A3FF,Flute
2.2672672672672673,1.670759030858391,Har18,Harrison & Pearce (2018),harmonicity,#11A3FF,Flute
2.2822822822822824,1.66633623680369,Har18,Harrison & Pearce (2018),harmonicity,#11A3FF,Flute
2.2972972972972974,1.6615147576925005,Har18,Harrison & Pearce (2018),harmonicity,#11A3FF,Flute
2.3123123123123124,1.6563205351131105,Har18,Harrison & Pearce (2018),harmonicity,#11A3FF,Flute
2.3273273273273274,1.6509822583889164,Har18,Harrison & Pearce (2018),harmonicity,#11A3FF,Flute
2.3423423423423424,1.6457513718913062,Har18,Harrison & Pearce (2018),harmonicity,#11A3FF,Flute
2.3573573573573574,1.6407467145053884,Har18,Harrison & Pearce (2018),harmonicity,#11A3FF,Flute
2.3723723723723724,1.6359582347043176,Har18,Harrison & Pearce (2018),harmonicity,#11A3FF,Flute
2.3873873873873874,1.63133590596174,Har18,Harrison & Pearce (2018),harmonicity,#11A3FF,Flute
2.4024024024024024,1.626855944255537,Har18,Harrison & Pearce (2018),harmonicity,#11A3FF,Flute
2.4174174174174174,1.6225378436015208,Har18,Harrison & Pearce (2018),harmonicity,#11A3FF,Flute
2.4324324324324325,1.618426035392954,Har18,Harrison & Pearce (2018),harmonicity,#11A3FF,Flute
2.4474474474474475,1.6145551606859037,Har18,Harrison & Pearce (2018),harmonicity,#11A3FF,Flute
2.4624624624624625,1.6109279731415453,Har18,Harrison & Pearce (2018),harmonicity,#11A3FF,Flute
2.4774774774774775,1.6075234979514363,Har18,Harrison & Pearce (2018),harmonicity,#11A3FF,Flute
2.4924924924924925,1.604323228391155,Har18,Harrison & Pearce (2018),harmonicity,#11A3FF,Flute
2.5075075075075075,1.6013324421999866,Har18,Harrison & Pearce (2018),harmonicity,#11A3FF,Flute
2.5225225225225225,1.5985742796981182,Har18,Harrison & Pearce (2018),harmonicity,#11A3FF,Flute
2.5375375375375375,1.5960512697027853,Har18,Harrison & Pearce (2018),harmonicity,#11A3FF,Flute
2.5525525525525525,1.5937192606799724,Har18,Harrison & Pearce (2018),harmonicity,#11A3FF,Flute
2.5675675675675675,1.5915188481960933,Har18,Harrison & Pearce (2018),harmonicity,#11A3FF,Flute
2.5825825825825826,1.589424101906308,Har18,Harrison & Pearce (2018),harmonicity,#11A3FF,Flute
2.5975975975975976,1.58744184161775,Har18,Harrison & Pearce (2018),harmonicity,#11A3FF,Flute
2.6126126126126126,1.5855754071449102,Har18,Harrison & Pearce (2018),harmonicity,#11A3FF,Flute
2.6276276276276276,1.5838076177748206,Har18,Harrison & Pearce (2018),harmonicity,#11A3FF,Flute
2.6426426426426426,1.5821114538246868,Har18,Harrison & Pearce (2018),harmonicity,#11A3FF,Flute
2.6576576576576576,1.5804637106350479,Har18,Harrison & Pearce (2018),harmonicity,#11A3FF,Flute
2.6726726726726726,1.5788503632498032,Har18,Harrison & Pearce (2018),harmonicity,#11A3FF,Flute
2.6876876876876876,1.5772683931317184,Har18,Harrison & Pearce (2018),harmonicity,#11A3FF,Flute
2.7027027027027026,1.5757291074077548,Har18,Harrison & Pearce (2018),harmonicity,#11A3FF,Flute
2.7177177177177176,1.574262382080292,Har18,Harrison & Pearce (2018),harmonicity,#11A3FF,Flute
2.7327327327327327,1.5729170298339417,Har18,Harrison & Pearce (2018),harmonicity,#11A3FF,Flute
2.7477477477477477,1.5717542875147679,Har18,Harrison & Pearce (2018),harmonicity,#11A3FF,Flute
2.7627627627627627,1.5708384400459763,Har18,Harrison & Pearce (2018),harmonicity,#11A3FF,Flute
2.7777777777777777,1.5702321431370991,Har18,Harrison & Pearce (2018),harmonicity,#11A3FF,Flute
2.7927927927927927,1.5699988357648504,Har18,Harrison & Pearce (2018),harmonicity,#11A3FF,Flute
2.8078078078078077,1.5702055832329558,Har18,Harrison & Pearce (2018),harmonicity,#11A3FF,Flute
2.8228228228228227,1.5709190276201441,Har18,Harrison & Pearce (2018),harmonicity,#11A3FF,Flute
2.8378378378378377,1.5721987330900786,Har18,Harrison & Pearce (2018),harmonicity,#11A3FF,Flute
2.8528528528528527,1.574097545189866,Har18,Harrison & Pearce (2018),harmonicity,#11A3FF,Flute
2.8678678678678677,1.5766657109260644,Har18,Harrison & Pearce (2018),harmonicity,#11A3FF,Flute
2.8828828828828827,1.5799446694993617,Har18,Harrison & Pearce (2018),harmonicity,#11A3FF,Flute
2.8978978978978978,1.5839474345615372,Har18,Harrison & Pearce (2018),harmonicity,#11A3FF,Flute
2.9129129129129128,1.5886436352527882,Har18,Harrison & Pearce (2018),harmonicity,#11A3FF,Flute
2.9279279279279278,1.5939693605862413,Har18,Harrison & Pearce (2018),harmonicity,#11A3FF,Flute
2.942942942942943,1.5998550819336204,Har18,Harrison & Pearce (2018),harmonicity,#11A3FF,Flute
2.957957957957958,1.606240454836912,Har18,Harrison & Pearce (2018),harmonicity,#11A3FF,Flute
2.972972972972973,1.6130578285942958,Har18,Harrison & Pearce (2018),harmonicity,#11A3FF,Flute
2.987987987987988,1.62020056778632,Har18,Harrison & Pearce (2018),harmonicity,#11A3FF,Flute
3.003003003003003,1.627507581736174,Har18,Harrison & Pearce (2018),harmonicity,#11A3FF,Flute
3.018018018018018,1.6347825781280478,Har18,Harrison & Pearce (2018),harmonicity,#11A3FF,Flute
3.033033033033033,1.6418346789310303,Har18,Harrison & Pearce (2018),harmonicity,#11A3FF,Flute
3.048048048048048,1.6485012899503937,Har18,Harrison & Pearce (2018),harmonicity,#11A3FF,Flute
3.063063063063063,1.6546351519216023,Har18,Harrison & Pearce (2018),harmonicity,#11A3FF,Flute
3.078078078078078,1.660083441070155,Har18,Harrison & Pearce (2018),harmonicity,#11A3FF,Flute
3.093093093093093,1.6646876183110124,Har18,Harrison & Pearce (2018),harmonicity,#11A3FF,Flute
3.108108108108108,1.668297612892321,Har18,Harrison & Pearce (2018),harmonicity,#11A3FF,Flute
3.123123123123123,1.6707835925191072,Har18,Harrison & Pearce (2018),harmonicity,#11A3FF,Flute
3.138138138138138,1.6720418920504736,Har18,Harrison & Pearce (2018),harmonicity,#11A3FF,Flute
3.153153153153153,1.6719972536202936,Har18,Harrison & Pearce (2018),harmonicity,#11A3FF,Flute
3.168168168168168,1.670603728574708,Har18,Harrison & Pearce (2018),harmonicity,#11A3FF,Flute
3.183183183183183,1.66784937660156,Har18,Harrison & Pearce (2018),harmonicity,#11A3FF,Flute
3.198198198198198,1.6637652312033853,Har18,Harrison & Pearce (2018),harmonicity,#11A3FF,Flute
3.2132132132132134,1.6584284360378319,Har18,Harrison & Pearce (2018),harmonicity,#11A3FF,Flute
3.2282282282282284,1.65195244335395,Har18,Harrison & Pearce (2018),harmonicity,#11A3FF,Flute
3.2432432432432434,1.6444722651080386,Har18,Harrison & Pearce (2018),harmonicity,#11A3FF,Flute
3.2582582582582584,1.6361360620090635,Har18,Harrison & Pearce (2018),harmonicity,#11A3FF,Flute
3.2732732732732734,1.6271033096387095,Har18,Harrison & Pearce (2018),harmonicity,#11A3FF,Flute
3.2882882882882885,1.617543460401679,Har18,Harrison & Pearce (2018),harmonicity,#11A3FF,Flute
3.3033033033033035,1.6076324996622986,Har18,Harrison & Pearce (2018),harmonicity,#11A3FF,Flute
3.3183183183183185,1.5975486206162193,Har18,Harrison & Pearce (2018),harmonicity,#11A3FF,Flute
3.3333333333333335,1.5874682924776056,Har18,Harrison & Pearce (2018),harmonicity,#11A3FF,Flute
3.3483483483483485,1.5775628040520289,Har18,Harrison & Pearce (2018),harmonicity,#11A3FF,Flute
3.3633633633633635,1.5679948285373562,Har18,Harrison & Pearce (2018),harmonicity,#11A3FF,Flute
3.3783783783783785,1.5589150357457828,Har18,Harrison & Pearce (2018),harmonicity,#11A3FF,Flute
3.3933933933933935,1.5504605617413316,Har18,Harrison & Pearce (2018),harmonicity,#11A3FF,Flute
3.4084084084084085,1.5427586683224284,Har18,Harrison & Pearce (2018),harmonicity,#11A3FF,Flute
3.4234234234234235,1.535935462924029,Har18,Harrison & Pearce (2018),harmonicity,#11A3FF,Flute
3.4384384384384385,1.530120818284577,Har18,Harrison & Pearce (2018),harmonicity,#11A3FF,Flute
3.4534534534534536,1.5254388913712373,Har18,Harrison & Pearce (2018),harmonicity,#11A3FF,Flute
3.4684684684684686,1.521988451590645,Har18,Harrison & Pearce (2018),harmonicity,#11A3FF,Flute
3.4834834834834836,1.5198325832207025,Har18,Harrison & Pearce (2018),harmonicity,#11A3FF,Flute
3.4984984984984986,1.5190093391402595,Har18,Harrison & Pearce (2018),harmonicity,#11A3FF,Flute
3.5135135135135136,1.5195513593989394,Har18,Harrison & Pearce (2018),harmonicity,#11A3FF,Flute
3.5285285285285286,1.5214945457042457,Har18,Harrison & Pearce (2018),harmonicity,#11A3FF,Flute
3.5435435435435436,1.524871359170099,Har18,Harrison & Pearce (2018),harmonicity,#11A3FF,Flute
3.5585585585585586,1.5296992701658427,Har18,Harrison & Pearce (2018),harmonicity,#11A3FF,Flute
3.5735735735735736,1.5359732998360647,Har18,Harrison & Pearce (2018),harmonicity,#11A3FF,Flute
3.5885885885885886,1.5436629869377982,Har18,Harrison & Pearce (2018),harmonicity,#11A3FF,Flute
3.6036036036036037,1.5527107328710128,Har18,Harrison & Pearce (2018),harmonicity,#11A3FF,Flute
3.6186186186186187,1.5630300124789658,Har18,Harrison & Pearce (2018),harmonicity,#11A3FF,Flute
3.6336336336336337,1.574503640239771,Har18,Harrison & Pearce (2018),harmonicity,#11A3FF,Flute
3.6486486486486487,1.5869827067321425,Har18,Harrison & Pearce (2018),harmonicity,#11A3FF,Flute
3.6636636636636637,1.6002866636243238,Har18,Harrison & Pearce (2018),harmonicity,#11A3FF,Flute
3.6786786786786787,1.6142048905251887,Har18,Harrison & Pearce (2018),harmonicity,#11A3FF,Flute
3.6936936936936937,1.6284999726514509,Har18,Harrison & Pearce (2018),harmonicity,#11A3FF,Flute
3.7087087087087087,1.6429128138682298,Har18,Harrison & Pearce (2018),harmonicity,#11A3FF,Flute
3.7237237237237237,1.6571695430818465,Har18,Harrison & Pearce (2018),harmonicity,#11A3FF,Flute
3.7387387387387387,1.670989966861434,Har18,Harrison & Pearce (2018),harmonicity,#11A3FF,Flute
3.7537537537537538,1.6840970642640227,Har18,Harrison & Pearce (2018),harmonicity,#11A3FF,Flute
3.7687687687687688,1.6962267991198132,Har18,Harrison & Pearce (2018),harmonicity,#11A3FF,Flute
3.7837837837837838,1.7071373698797476,Har18,Harrison & Pearce (2018),harmonicity,#11A3FF,Flute
3.798798798798799,1.7166170467729631,Har18,Harrison & Pearce (2018),harmonicity,#11A3FF,Flute
3.813813813813814,1.7244899552330968,Har18,Harrison & Pearce (2018),harmonicity,#11A3FF,Flute
3.828828828828829,1.7306195705819833,Har18,Harrison & Pearce (2018),harmonicity,#11A3FF,Flute
3.843843843843844,1.7349101496571353,Har18,Harrison & Pearce (2018),harmonicity,#11A3FF,Flute
3.858858858858859,1.7373067165876226,Har18,Harrison & Pearce (2018),harmonicity,#11A3FF,Flute
3.873873873873874,1.7377943893617616,Har18,Harrison & Pearce (2018),harmonicity,#11A3FF,Flute
3.888888888888889,1.7363977457745123,Har18,Harrison & Pearce (2018),harmonicity,#11A3FF,Flute
3.903903903903904,1.7331807410681175,Har18,Harrison & Pearce (2018),harmonicity,#11A3FF,Flute
3.918918918918919,1.7282479461618225,Har18,Harrison & Pearce (2018),harmonicity,#11A3FF,Flute
3.933933933933934,1.7217491724295877,Har18,Harrison & Pearce (2018),harmonicity,#11A3FF,Flute
3.948948948948949,1.7138896119685763,Har18,Harrison & Pearce (2018),harmonicity,#11A3FF,Flute
3.963963963963964,1.7049370695822976,Har18,Harrison & Pearce (2018),harmonicity,#11A3FF,Flute
3.978978978978979,1.6951934943652736,Har18,Harrison & Pearce (2018),harmonicity,#11A3FF,Flute
3.993993993993994,1.684903055004768,Har18,Harrison & Pearce (2018),harmonicity,#11A3FF,Flute
4.009009009009009,1.6741634003828056,Har18,Harrison & Pearce (2018),harmonicity,#11A3FF,Flute
4.024024024024024,1.6629926427561073,Har18,Harrison & Pearce (2018),harmonicity,#11A3FF,Flute
4.039039039039039,1.651553602683061,Har18,Harrison & Pearce (2018),harmonicity,#11A3FF,Flute
4.054054054054054,1.6402612401462853,Har18,Harrison & Pearce (2018),harmonicity,#11A3FF,Flute
4.069069069069069,1.6295759800721272,Har18,Harrison & Pearce (2018),harmonicity,#11A3FF,Flute
4.084084084084084,1.6197079739468119,Har18,Harrison & Pearce (2018),harmonicity,#11A3FF,Flute
4.099099099099099,1.6105882284779156,Har18,Harrison & Pearce (2018),harmonicity,#11A3FF,Flute
4.114114114114114,1.6020860798738,Har18,Harrison & Pearce (2018),harmonicity,#11A3FF,Flute
4.129129129129129,1.5941560310735978,Har18,Harrison & Pearce (2018),harmonicity,#11A3FF,Flute
4.1441441441441444,1.5868095611471165,Har18,Harrison & Pearce (2018),harmonicity,#11A3FF,Flute
4.1591591591591595,1.5800888204088666,Har18,Harrison & Pearce (2018),harmonicity,#11A3FF,Flute
4.1741741741741745,1.5740857055865016,Har18,Harrison & Pearce (2018),harmonicity,#11A3FF,Flute
4.1891891891891895,1.5688784105671842,Har18,Harrison & Pearce (2018),harmonicity,#11A3FF,Flute
4.2042042042042045,1.5644234650155848,Har18,Harrison & Pearce (2018),harmonicity,#11A3FF,Flute
4.2192192192192195,1.560558336659989,Har18,Harrison & Pearce (2018),harmonicity,#11A3FF,Flute
4.2342342342342345,1.5571025220657406,Har18,Harrison & Pearce (2018),harmonicity,#11A3FF,Flute
4.2492492492492495,1.5539292856982378,Har18,Harrison & Pearce (2018),harmonicity,#11A3FF,Flute
4.2642642642642645,1.5509632559786102,Har18,Harrison & Pearce (2018),harmonicity,#11A3FF,Flute
4.2792792792792795,1.5481448015402697,Har18,Harrison & Pearce (2018),harmonicity,#11A3FF,Flute
4.2942942942942945,1.5454055592288303,Har18,Harrison & Pearce (2018),harmonicity,#11A3FF,Flute
4.3093093093093096,1.5426769747009834,Har18,Harrison & Pearce (2018),harmonicity,#11A3FF,Flute
4.324324324324325,1.5399202398016347,Har18,Harrison & Pearce (2018),harmonicity,#11A3FF,Flute
4.33933933933934,1.537142638452478,Har18,Harrison & Pearce (2018),harmonicity,#11A3FF,Flute
4.354354354354355,1.5343941506453125,Har18,Harrison & Pearce (2018),harmonicity,#11A3FF,Flute
4.36936936936937,1.5317633780821487,Har18,Harrison & Pearce (2018),harmonicity,#11A3FF,Flute
4.384384384384385,1.529357390389858,Har18,Harrison & Pearce (2018),harmonicity,#11A3FF,Flute
4.3993993993994,1.5272488150746784,Har18,Harrison & Pearce (2018),harmonicity,#11A3FF,Flute
4.414414414414415,1.5254460542576975,Har18,Harrison & Pearce (2018),harmonicity,#11A3FF,Flute
4.42942942942943,1.5239459092439653,Har18,Harrison & Pearce (2018),harmonicity,#11A3FF,Flute
4.444444444444445,1.522815146538231,Har18,Harrison & Pearce (2018),harmonicity,#11A3FF,Flute
4.45945945945946,1.5221946425423978,Har18,Harrison & Pearce (2018),harmonicity,#11A3FF,Flute
4.474474474474475,1.5222226139825794,Har18,Harrison & Pearce (2018),harmonicity,#11A3FF,Flute
4.48948948948949,1.522978126917923,Har18,Harrison & Pearce (2018),harmonicity,#11A3FF,Flute
4.504504504504505,1.524504583278406,Har18,Harrison & Pearce (2018),harmonicity,#11A3FF,Flute
4.51951951951952,1.5268636410749312,Har18,Harrison & Pearce (2018),harmonicity,#11A3FF,Flute
4.534534534534535,1.5301521515910768,Har18,Harrison & Pearce (2018),harmonicity,#11A3FF,Flute
4.54954954954955,1.5344813995385689,Har18,Harrison & Pearce (2018),harmonicity,#11A3FF,Flute
4.564564564564565,1.539938945210992,Har18,Harrison & Pearce (2018),harmonicity,#11A3FF,Flute
4.57957957957958,1.5465392185231113,Har18,Harrison & Pearce (2018),harmonicity,#11A3FF,Flute
4.594594594594595,1.5542152587006577,Har18,Harrison & Pearce (2018),harmonicity,#11A3FF,Flute
4.60960960960961,1.5629107693730062,Har18,Harrison & Pearce (2018),harmonicity,#11A3FF,Flute
4.624624624624625,1.5726964057113892,Har18,Harrison & Pearce (2018),harmonicity,#11A3FF,Flute
4.63963963963964,1.583750582328269,Har18,Harrison & Pearce (2018),harmonicity,#11A3FF,Flute
4.654654654654655,1.5961988885733556,Har18,Harrison & Pearce (2018),harmonicity,#11A3FF,Flute
4.66966966966967,1.610001112883048,Har18,Harrison & Pearce (2018),harmonicity,#11A3FF,Flute
4.684684684684685,1.6250065995394816,Har18,Harrison & Pearce (2018),harmonicity,#11A3FF,Flute
4.6996996996997,1.6410706560202857,Har18,Harrison & Pearce (2018),harmonicity,#11A3FF,Flute
4.714714714714715,1.658089400522292,Har18,Harrison & Pearce (2018),harmonicity,#11A3FF,Flute
4.72972972972973,1.6759775772928922,Har18,Harrison & Pearce (2018),harmonicity,#11A3FF,Flute
4.744744744744745,1.6946883364681973,Har18,Harrison & Pearce (2018),harmonicity,#11A3FF,Flute
4.75975975975976,1.7142517495634473,Har18,Harrison & Pearce (2018),harmonicity,#11A3FF,Flute
4.774774774774775,1.7347005069769015,Har18,Harrison & Pearce (2018),harmonicity,#11A3FF,Flute
4.78978978978979,1.7558820738184846,Har18,Harrison & Pearce (2018),harmonicity,#11A3FF,Flute
4.804804804804805,1.7773816064750803,Har18,Harrison & Pearce (2018),harmonicity,#11A3FF,Flute
4.81981981981982,1.798700753563243,Har18,Harrison & Pearce (2018),harmonicity,#11A3FF,Flute
4.834834834834835,1.8194921577735066,Har18,Harrison & Pearce (2018),harmonicity,#11A3FF,Flute
4.84984984984985,1.8395634712768414,Har18,Harrison & Pearce (2018),harmonicity,#11A3FF,Flute
4.864864864864865,1.8586915915706896,Har18,Harrison & Pearce (2018),harmonicity,#11A3FF,Flute
4.87987987987988,1.8765267609019656,Har18,Harrison & Pearce (2018),harmonicity,#11A3FF,Flute
4.894894894894895,1.8926679259423247,Har18,Harrison & Pearce (2018),harmonicity,#11A3FF,Flute
4.90990990990991,1.9067327604436712,Har18,Harrison & Pearce (2018),harmonicity,#11A3FF,Flute
4.924924924924925,1.9183454960348156,Har18,Harrison & Pearce (2018),harmonicity,#11A3FF,Flute
4.93993993993994,1.9271467145141228,Har18,Harrison & Pearce (2018),harmonicity,#11A3FF,Flute
4.954954954954955,1.932855248193056,Har18,Harrison & Pearce (2018),harmonicity,#11A3FF,Flute
4.96996996996997,1.935300319133775,Har18,Harrison & Pearce (2018),harmonicity,#11A3FF,Flute
4.984984984984985,1.9344002466000367,Har18,Harrison & Pearce (2018),harmonicity,#11A3FF,Flute
5,1.9301449462622755,Har18,Harrison & Pearce (2018),harmonicity,#11A3FF,Flute
5.015015015015015,1.9226121803546923,Har18,Harrison & Pearce (2018),harmonicity,#11A3FF,Flute
5.03003003003003,1.9119711511219006,Har18,Harrison & Pearce (2018),harmonicity,#11A3FF,Flute
5.045045045045045,1.8984331424784708,Har18,Harrison & Pearce (2018),harmonicity,#11A3FF,Flute
5.06006006006006,1.8822217269955022,Har18,Harrison & Pearce (2018),harmonicity,#11A3FF,Flute
5.075075075075075,1.8636455352661823,Har18,Harrison & Pearce (2018),harmonicity,#11A3FF,Flute
5.09009009009009,1.8431762502552296,Har18,Harrison & Pearce (2018),harmonicity,#11A3FF,Flute
5.105105105105105,1.821385835916979,Har18,Harrison & Pearce (2018),harmonicity,#11A3FF,Flute
5.12012012012012,1.7988051956487814,Har18,Harrison & Pearce (2018),harmonicity,#11A3FF,Flute
5.135135135135135,1.7758642346433389,Har18,Harrison & Pearce (2018),harmonicity,#11A3FF,Flute
5.15015015015015,1.752928561163326,Har18,Harrison & Pearce (2018),harmonicity,#11A3FF,Flute
5.165165165165165,1.73034328046182,Har18,Harrison & Pearce (2018),harmonicity,#11A3FF,Flute
5.18018018018018,1.7084415654434444,Har18,Harrison & Pearce (2018),harmonicity,#11A3FF,Flute
5.195195195195195,1.6875363907067034,Har18,Harrison & Pearce (2018),harmonicity,#11A3FF,Flute
5.21021021021021,1.6679133897378435,Har18,Harrison & Pearce (2018),harmonicity,#11A3FF,Flute
5.225225225225225,1.6498138863972927,Har18,Harrison & Pearce (2018),harmonicity,#11A3FF,Flute
5.24024024024024,1.6333881933059358,Har18,Harrison & Pearce (2018),harmonicity,#11A3FF,Flute
5.255255255255255,1.6186465020782073,Har18,Harrison & Pearce (2018),harmonicity,#11A3FF,Flute
5.27027027027027,1.605489609105897,Har18,Harrison & Pearce (2018),harmonicity,#11A3FF,Flute
5.285285285285285,1.5938335868206077,Har18,Harrison & Pearce (2018),harmonicity,#11A3FF,Flute
5.3003003003003,1.5836957932768798,Har18,Harrison & Pearce (2018),harmonicity,#11A3FF,Flute
5.315315315315315,1.575135690231517,Har18,Harrison & Pearce (2018),harmonicity,#11A3FF,Flute
5.33033033033033,1.5681376341136302,Har18,Harrison & Pearce (2018),harmonicity,#11A3FF,Flute
5.345345345345345,1.562575719516105,Har18,Harrison & Pearce (2018),harmonicity,#11A3FF,Flute
5.36036036036036,1.5582636723448529,Har18,Harrison & Pearce (2018),harmonicity,#11A3FF,Flute
5.375375375375375,1.555010090132569,Har18,Harrison & Pearce (2018),harmonicity,#11A3FF,Flute
5.39039039039039,1.5526431668123213,Har18,Harrison & Pearce (2018),harmonicity,#11A3FF,Flute
5.405405405405405,1.5510155445265164,Har18,Harrison & Pearce (2018),harmonicity,#11A3FF,Flute
5.42042042042042,1.5499985275750117,Har18,Harrison & Pearce (2018),harmonicity,#11A3FF,Flute
5.435435435435435,1.5494704544199451,Har18,Harrison & Pearce (2018),harmonicity,#11A3FF,Flute
5.45045045045045,1.5493120860108822,Har18,Harrison & Pearce (2018),harmonicity,#11A3FF,Flute
5.465465465465465,1.5494153520861,Har18,Harrison & Pearce (2018),harmonicity,#11A3FF,Flute
5.48048048048048,1.549693902337527,Har18,Harrison & Pearce (2018),harmonicity,#11A3FF,Flute
5.495495495495495,1.5500841736682345,Har18,Harrison & Pearce (2018),harmonicity,#11A3FF,Flute
5.51051051051051,1.5505390163154567,Har18,Harrison & Pearce (2018),harmonicity,#11A3FF,Flute
5.525525525525525,1.5510210475808826,Har18,Harrison & Pearce (2018),harmonicity,#11A3FF,Flute
5.54054054054054,1.5515009924346712,Har18,Harrison & Pearce (2018),harmonicity,#11A3FF,Flute
5.555555555555555,1.5519608892662216,Har18,Harrison & Pearce (2018),harmonicity,#11A3FF,Flute
5.57057057057057,1.5523955487770598,Har18,Harrison & Pearce (2018),harmonicity,#11A3FF,Flute
5.585585585585585,1.5528079687166902,Har18,Harrison & Pearce (2018),harmonicity,#11A3FF,Flute
5.6006006006006,1.5532028401761244,Har18,Harrison & Pearce (2018),harmonicity,#11A3FF,Flute
5.615615615615615,1.5535842454251487,Har18,Harrison & Pearce (2018),harmonicity,#11A3FF,Flute
5.63063063063063,1.5539587242738726,Har18,Harrison & Pearce (2018),harmonicity,#11A3FF,Flute
5.645645645645645,1.5543402529988941,Har18,Harrison & Pearce (2018),harmonicity,#11A3FF,Flute
5.66066066066066,1.5547517367934698,Har18,Harrison & Pearce (2018),harmonicity,#11A3FF,Flute
5.675675675675675,1.5552187049836292,Har18,Harrison & Pearce (2018),harmonicity,#11A3FF,Flute
5.6906906906906904,1.5557576549173875,Har18,Harrison & Pearce (2018),harmonicity,#11A3FF,Flute
5.7057057057057055,1.556369410678721,Har18,Harrison & Pearce (2018),harmonicity,#11A3FF,Flute
5.7207207207207205,1.5570441465465146,Har18,Harrison & Pearce (2018),harmonicity,#11A3FF,Flute
5.7357357357357355,1.5577736044872015,Har18,Harrison & Pearce (2018),harmonicity,#11A3FF,Flute
5.7507507507507505,1.5585682672333918,Har18,Harrison & Pearce (2018),harmonicity,#11A3FF,Flute
5.7657657657657655,1.5594876662796389,Har18,Harrison & Pearce (2018),harmonicity,#11A3FF,Flute
5.7807807807807805,1.5606687836771438,Har18,Harrison & Pearce (2018),harmonicity,#11A3FF,Flute
5.7957957957957955,1.562267785025379,Har18,Harrison & Pearce (2018),harmonicity,#11A3FF,Flute
5.8108108108108105,1.5642370420326042,Har18,Harrison & Pearce (2018),harmonicity,#11A3FF,Flute
5.8258258258258255,1.5661055110644146,Har18,Harrison & Pearce (2018),harmonicity,#11A3FF,Flute
5.8408408408408405,1.5671586946098688,Har18,Harrison & Pearce (2018),harmonicity,#11A3FF,Flute
5.8558558558558556,1.5670361019051602,Har18,Harrison & Pearce (2018),harmonicity,#11A3FF,Flute
5.870870870870871,1.5660855323589613,Har18,Harrison & Pearce (2018),harmonicity,#11A3FF,Flute
5.885885885885886,1.5650096399278666,Har18,Harrison & Pearce (2018),harmonicity,#11A3FF,Flute
5.900900900900901,1.5642694589872028,Har18,Harrison & Pearce (2018),harmonicity,#11A3FF,Flute
5.915915915915916,1.563905240765941,Har18,Harrison & Pearce (2018),harmonicity,#11A3FF,Flute
5.930930930930931,1.5637557838186882,Har18,Harrison & Pearce (2018),harmonicity,#11A3FF,Flute
5.945945945945946,1.5636808439616119,Har18,Harrison & Pearce (2018),harmonicity,#11A3FF,Flute
5.960960960960961,1.5636209591264167,Har18,Harrison & Pearce (2018),harmonicity,#11A3FF,Flute
5.975975975975976,1.563570713111265,Har18,Harrison & Pearce (2018),harmonicity,#11A3FF,Flute
5.990990990990991,1.5635449043040965,Har18,Harrison & Pearce (2018),harmonicity,#11A3FF,Flute
6.006006006006006,1.5635556002555107,Har18,Harrison & Pearce (2018),harmonicity,#11A3FF,Flute
6.021021021021021,1.5636009783758804,Har18,Harrison & Pearce (2018),harmonicity,#11A3FF,Flute
6.036036036036036,1.5636662145715818,Har18,Harrison & Pearce (2018),harmonicity,#11A3FF,Flute
6.051051051051051,1.5637295563519735,Har18,Harrison & Pearce (2018),harmonicity,#11A3FF,Flute
6.066066066066066,1.563766432977563,Har18,Harrison & Pearce (2018),harmonicity,#11A3FF,Flute
6.081081081081081,1.5637535269237721,Har18,Harrison & Pearce (2018),harmonicity,#11A3FF,Flute
6.096096096096096,1.5636771761593178,Har18,Harrison & Pearce (2018),harmonicity,#11A3FF,Flute
6.111111111111111,1.563540463722973,Har18,Harrison & Pearce (2018),harmonicity,#11A3FF,Flute
6.126126126126126,1.563355863924787,Har18,Harrison & Pearce (2018),harmonicity,#11A3FF,Flute
6.141141141141141,1.5631229329020313,Har18,Harrison & Pearce (2018),harmonicity,#11A3FF,Flute
6.156156156156156,1.5628141620577232,Har18,Harrison & Pearce (2018),harmonicity,#11A3FF,Flute
6.171171171171171,1.5623916135569949,Har18,Harrison & Pearce (2018),harmonicity,#11A3FF,Flute
6.186186186186186,1.5618419603494789,Har18,Harrison & Pearce (2018),harmonicity,#11A3FF,Flute
6.201201201201201,1.561192100311029,Har18,Harrison & Pearce (2018),harmonicity,#11A3FF,Flute
6.216216216216216,1.5604893432480247,Har18,Harrison & Pearce (2018),harmonicity,#11A3FF,Flute
6.231231231231231,1.5597693845986622,Har18,Harrison & Pearce (2018),harmonicity,#11A3FF,Flute
6.246246246246246,1.5590438452437696,Har18,Harrison & Pearce (2018),harmonicity,#11A3FF,Flute
6.261261261261261,1.558316514163389,Har18,Harrison & Pearce (2018),harmonicity,#11A3FF,Flute
6.276276276276276,1.5576085640399362,Har18,Harrison & Pearce (2018),harmonicity,#11A3FF,Flute
6.291291291291291,1.5569606014521162,Har18,Harrison & Pearce (2018),harmonicity,#11A3FF,Flute
6.306306306306306,1.5564016357557635,Har18,Harrison & Pearce (2018),harmonicity,#11A3FF,Flute
6.321321321321321,1.5559171815146962,Har18,Harrison & Pearce (2018),harmonicity,#11A3FF,Flute
6.336336336336336,1.555459426568883,Har18,Harrison & Pearce (2018),harmonicity,#11A3FF,Flute
6.351351351351351,1.5549951795713715,Har18,Harrison & Pearce (2018),harmonicity,#11A3FF,Flute
6.366366366366366,1.5545348139934354,Har18,Harrison & Pearce (2018),harmonicity,#11A3FF,Flute
6.381381381381381,1.5541067135913718,Har18,Harrison & Pearce (2018),harmonicity,#11A3FF,Flute
6.396396396396396,1.5537139565863285,Har18,Harrison & Pearce (2018),harmonicity,#11A3FF,Flute
6.411411411411412,1.553327408245877,Har18,Harrison & Pearce (2018),harmonicity,#11A3FF,Flute
6.426426426426427,1.5529135158193144,Har18,Harrison & Pearce (2018),harmonicity,#11A3FF,Flute
6.441441441441442,1.5524557931163545,Har18,Harrison & Pearce (2018),harmonicity,#11A3FF,Flute
6.456456456456457,1.551954191562348,Har18,Harrison & Pearce (2018),harmonicity,#11A3FF,Flute
6.471471471471472,1.5514209769331857,Har18,Harrison & Pearce (2018),harmonicity,#11A3FF,Flute
6.486486486486487,1.5508822950667898,Har18,Harrison & Pearce (2018),harmonicity,#11A3FF,Flute
6.501501501501502,1.5503747609915548,Har18,Harrison & Pearce (2018),harmonicity,#11A3FF,Flute
6.516516516516517,1.5499369764677886,Har18,Harrison & Pearce (2018),harmonicity,#11A3FF,Flute
6.531531531531532,1.5496095259754796,Har18,Harrison & Pearce (2018),harmonicity,#11A3FF,Flute
6.546546546546547,1.549445979895441,Har18,Harrison & Pearce (2018),harmonicity,#11A3FF,Flute
6.561561561561562,1.5495229559472714,Har18,Harrison & Pearce (2018),harmonicity,#11A3FF,Flute
6.576576576576577,1.549940173199414,Har18,Harrison & Pearce (2018),harmonicity,#11A3FF,Flute
6.591591591591592,1.5508136486042383,Har18,Harrison & Pearce (2018),harmonicity,#11A3FF,Flute
6.606606606606607,1.5522708234935751,Har18,Harrison & Pearce (2018),harmonicity,#11A3FF,Flute
6.621621621621622,1.5544502180470736,Har18,Harrison & Pearce (2018),harmonicity,#11A3FF,Flute
6.636636636636637,1.5575008076900498,Har18,Harrison & Pearce (2018),harmonicity,#11A3FF,Flute
6.651651651651652,1.5615781258295154,Har18,Harrison & Pearce (2018),harmonicity,#11A3FF,Flute
6.666666666666667,1.566838072841419,Har18,Harrison & Pearce (2018),harmonicity,#11A3FF,Flute
6.681681681681682,1.573429160693042,Har18,Harrison & Pearce (2018),harmonicity,#11A3FF,Flute
6.696696696696697,1.5814850478221476,Har18,Harrison & Pearce (2018),harmonicity,#11A3FF,Flute
6.711711711711712,1.5911198318414566,Har18,Harrison & Pearce (2018),harmonicity,#11A3FF,Flute
6.726726726726727,1.6024232441511796,Har18,Harrison & Pearce (2018),harmonicity,#11A3FF,Flute
6.741741741741742,1.6154505947099849,Har18,Harrison & Pearce (2018),harmonicity,#11A3FF,Flute
6.756756756756757,1.630210139830944,Har18,Harrison & Pearce (2018),harmonicity,#11A3FF,Flute
6.771771771771772,1.6466567417152618,Har18,Harrison & Pearce (2018),harmonicity,#11A3FF,Flute
6.786786786786787,1.6646947452258103,Har18,Harrison & Pearce (2018),harmonicity,#11A3FF,Flute
6.801801801801802,1.6841841891315152,Har18,Harrison & Pearce (2018),harmonicity,#11A3FF,Flute
6.816816816816817,1.7049431740046284,Har18,Harrison & Pearce (2018),harmonicity,#11A3FF,Flute
6.831831831831832,1.7267423695521031,Har18,Harrison & Pearce (2018),harmonicity,#11A3FF,Flute
6.846846846846847,1.7492939351128969,Har18,Harrison & Pearce (2018),harmonicity,#11A3FF,Flute
6.861861861861862,1.7722459107941462,Har18,Harrison & Pearce (2018),harmonicity,#11A3FF,Flute
6.876876876876877,1.795192881666265,Har18,Harrison & Pearce (2018),harmonicity,#11A3FF,Flute
6.891891891891892,1.8177001461109579,Har18,Harrison & Pearce (2018),harmonicity,#11A3FF,Flute
6.906906906906907,1.8393274047091785,Har18,Harrison & Pearce (2018),harmonicity,#11A3FF,Flute
6.921921921921922,1.859643921229347,Har18,Harrison & Pearce (2018),harmonicity,#11A3FF,Flute
6.936936936936937,1.8782412188355069,Har18,Harrison & Pearce (2018),harmonicity,#11A3FF,Flute
6.951951951951952,1.89474880866591,Har18,Harrison & Pearce (2018),harmonicity,#11A3FF,Flute
6.966966966966967,1.9088471542574008,Har18,Harrison & Pearce (2018),harmonicity,#11A3FF,Flute
6.981981981981982,1.9202679842155632,Har18,Harrison & Pearce (2018),harmonicity,#11A3FF,Flute
6.996996996996997,1.9287730678207011,Har18,Harrison & Pearce (2018),harmonicity,#11A3FF,Flute
7.012012012012012,1.9341266967451705,Har18,Harrison & Pearce (2018),harmonicity,#11A3FF,Flute
7.027027027027027,1.9361210855731816,Har18,Harrison & Pearce (2018),harmonicity,#11A3FF,Flute
7.042042042042042,1.9346738568693327,Har18,Harrison & Pearce (2018),harmonicity,#11A3FF,Flute
7.057057057057057,1.9298952254141326,Har18,Harrison & Pearce (2018),harmonicity,#11A3FF,Flute
7.072072072072072,1.922033826111773,Har18,Harrison & Pearce (2018),harmonicity,#11A3FF,Flute
7.087087087087087,1.9113736708513787,Har18,Harrison & Pearce (2018),harmonicity,#11A3FF,Flute
7.102102102102102,1.8981979211589437,Har18,Harrison & Pearce (2018),harmonicity,#11A3FF,Flute
7.117117117117117,1.8828104425183565,Har18,Harrison & Pearce (2018),harmonicity,#11A3FF,Flute
7.132132132132132,1.8655475812662028,Har18,Harrison & Pearce (2018),harmonicity,#11A3FF,Flute
7.147147147147147,1.8467700767808708,Har18,Harrison & Pearce (2018),harmonicity,#11A3FF,Flute
7.162162162162162,1.8268505933164383,Har18,Harrison & Pearce (2018),harmonicity,#11A3FF,Flute
7.177177177177177,1.8061512469197625,Har18,Harrison & Pearce (2018),harmonicity,#11A3FF,Flute
7.192192192192192,1.7850004940405821,Har18,Harrison & Pearce (2018),harmonicity,#11A3FF,Flute
7.207207207207207,1.7636958623554708,Har18,Harrison & Pearce (2018),harmonicity,#11A3FF,Flute
7.222222222222222,1.7425237914883909,Har18,Harrison & Pearce (2018),harmonicity,#11A3FF,Flute
7.237237237237237,1.7217601739573503,Har18,Harrison & Pearce (2018),harmonicity,#11A3FF,Flute
7.252252252252252,1.70164358803694,Har18,Harrison & Pearce (2018),harmonicity,#11A3FF,Flute
7.267267267267267,1.6823500072270363,Har18,Harrison & Pearce (2018),harmonicity,#11A3FF,Flute
7.282282282282282,1.6639949212231036,Har18,Harrison & Pearce (2018),harmonicity,#11A3FF,Flute
7.297297297297297,1.6466588351715474,Har18,Harrison & Pearce (2018),harmonicity,#11A3FF,Flute
7.312312312312312,1.6304117961252613,Har18,Harrison & Pearce (2018),harmonicity,#11A3FF,Flute
7.327327327327327,1.6153181233664549,Har18,Harrison & Pearce (2018),harmonicity,#11A3FF,Flute
7.342342342342342,1.6014232910536992,Har18,Harrison & Pearce (2018),harmonicity,#11A3FF,Flute
7.357357357357357,1.5887412556136036,Har18,Harrison & Pearce (2018),harmonicity,#11A3FF,Flute
7.372372372372372,1.5772590502346204,Har18,Harrison & Pearce (2018),harmonicity,#11A3FF,Flute
7.387387387387387,1.5669563750448694,Har18,Harrison & Pearce (2018),harmonicity,#11A3FF,Flute
7.402402402402402,1.5578202504780245,Har18,Harrison & Pearce (2018),harmonicity,#11A3FF,Flute
7.4174174174174174,1.5498423859540629,Har18,Harrison & Pearce (2018),harmonicity,#11A3FF,Flute
7.4324324324324325,1.5430094328223736,Har18,Harrison & Pearce (2018),harmonicity,#11A3FF,Flute
7.4474474474474475,1.5372978300952056,Har18,Harrison & Pearce (2018),harmonicity,#11A3FF,Flute
7.4624624624624625,1.5326671110447485,Har18,Harrison & Pearce (2018),harmonicity,#11A3FF,Flute
7.4774774774774775,1.5290465981142276,Har18,Harrison & Pearce (2018),harmonicity,#11A3FF,Flute
7.4924924924924925,1.5263342468461418,Har18,Harrison & Pearce (2018),harmonicity,#11A3FF,Flute
7.5075075075075075,1.524426271944222,Har18,Harrison & Pearce (2018),harmonicity,#11A3FF,Flute
7.5225225225225225,1.5232545760943226,Har18,Harrison & Pearce (2018),harmonicity,#11A3FF,Flute
7.5375375375375375,1.5227886781979592,Har18,Harrison & Pearce (2018),harmonicity,#11A3FF,Flute
7.5525525525525525,1.5230054713642664,Har18,Harrison & Pearce (2018),harmonicity,#11A3FF,Flute
7.5675675675675675,1.523880717108704,Har18,Harrison & Pearce (2018),harmonicity,#11A3FF,Flute
7.5825825825825826,1.5254371965745046,Har18,Harrison & Pearce (2018),harmonicity,#11A3FF,Flute
7.597597597597598,1.5278037052846782,Har18,Harrison & Pearce (2018),harmonicity,#11A3FF,Flute
7.612612612612613,1.5311421702950163,Har18,Harrison & Pearce (2018),harmonicity,#11A3FF,Flute
7.627627627627628,1.5353325282425117,Har18,Harrison & Pearce (2018),harmonicity,#11A3FF,Flute
7.642642642642643,1.5396602721405193,Har18,Harrison & Pearce (2018),harmonicity,#11A3FF,Flute
7.657657657657658,1.5430714523334714,Har18,Harrison & Pearce (2018),harmonicity,#11A3FF,Flute
7.672672672672673,1.5450212436334665,Har18,Harrison & Pearce (2018),harmonicity,#11A3FF,Flute
7.687687687687688,1.5459779057439027,Har18,Harrison & Pearce (2018),harmonicity,#11A3FF,Flute
7.702702702702703,1.5469218719418876,Har18,Harrison & Pearce (2018),harmonicity,#11A3FF,Flute
7.717717717717718,1.5485001129417484,Har18,Harrison & Pearce (2018),harmonicity,#11A3FF,Flute
7.732732732732733,1.550774431977778,Har18,Harrison & Pearce (2018),harmonicity,#11A3FF,Flute
7.747747747747748,1.5535369574620121,Har18,Harrison & Pearce (2018),harmonicity,#11A3FF,Flute
7.762762762762763,1.556628296144284,Har18,Harrison & Pearce (2018),harmonicity,#11A3FF,Flute
7.777777777777778,1.5600185279334897,Har18,Harrison & Pearce (2018),harmonicity,#11A3FF,Flute
7.792792792792793,1.5637612740416205,Har18,Harrison & Pearce (2018),harmonicity,#11A3FF,Flute
7.807807807807808,1.567943878344286,Har18,Harrison & Pearce (2018),harmonicity,#11A3FF,Flute
7.822822822822823,1.5726619285860233,Har18,Harrison & Pearce (2018),harmonicity,#11A3FF,Flute
7.837837837837838,1.5780071939727136,Har18,Harrison & Pearce (2018),harmonicity,#11A3FF,Flute
7.852852852852853,1.584059809295358,Har18,Harrison & Pearce (2018),harmonicity,#11A3FF,Flute
7.867867867867868,1.590881579133734,Har18,Harrison & Pearce (2018),harmonicity,#11A3FF,Flute
7.882882882882883,1.5985096662522535,Har18,Harrison & Pearce (2018),harmonicity,#11A3FF,Flute
7.897897897897898,1.606950937287356,Har18,Harrison & Pearce (2018),harmonicity,#11A3FF,Flute
7.912912912912913,1.616177757259942,Har18,Harrison & Pearce (2018),harmonicity,#11A3FF,Flute
7.927927927927928,1.6261253232405395,Har18,Harrison & Pearce (2018),harmonicity,#11A3FF,Flute
7.942942942942943,1.6366889233869875,Har18,Harrison & Pearce (2018),harmonicity,#11A3FF,Flute
7.957957957957958,1.6477193559871701,Har18,Harrison & Pearce (2018),harmonicity,#11A3FF,Flute
7.972972972972973,1.6590197691277813,Har18,Harrison & Pearce (2018),harmonicity,#11A3FF,Flute
7.987987987987988,1.6703561819492285,Har18,Harrison & Pearce (2018),harmonicity,#11A3FF,Flute
8.003003003003004,1.6814913632440593,Har18,Harrison & Pearce (2018),harmonicity,#11A3FF,Flute
8.018018018018019,1.692221041405449,Har18,Harrison & Pearce (2018),harmonicity,#11A3FF,Flute
8.033033033033034,1.7023654613382166,Har18,Harrison & Pearce (2018),harmonicity,#11A3FF,Flute
8.048048048048049,1.711713249413043,Har18,Harrison & Pearce (2018),harmonicity,#11A3FF,Flute
8.063063063063064,1.7199906339177153,Har18,Harrison & Pearce (2018),harmonicity,#11A3FF,Flute
8.078078078078079,1.7269079721324196,Har18,Harrison & Pearce (2018),harmonicity,#11A3FF,Flute
8.093093093093094,1.732233681120428,Har18,Harrison & Pearce (2018),harmonicity,#11A3FF,Flute
8.108108108108109,1.7358222531302308,Har18,Harrison & Pearce (2018),harmonicity,#11A3FF,Flute
8.123123123123124,1.7375961935195472,Har18,Harrison & Pearce (2018),harmonicity,#11A3FF,Flute
8.138138138138139,1.7375234837016047,Har18,Harrison & Pearce (2018),harmonicity,#11A3FF,Flute
8.153153153153154,1.7356022192191585,Har18,Harrison & Pearce (2018),harmonicity,#11A3FF,Flute
8.168168168168169,1.731836178232071,Har18,Harrison & Pearce (2018),harmonicity,#11A3FF,Flute
8.183183183183184,1.7262126817628214,Har18,Harrison & Pearce (2018),harmonicity,#11A3FF,Flute
8.198198198198199,1.7187319591146086,Har18,Harrison & Pearce (2018),harmonicity,#11A3FF,Flute
8.213213213213214,1.7094925923557953,Har18,Harrison & Pearce (2018),harmonicity,#11A3FF,Flute
8.228228228228229,1.6987428160616826,Har18,Harrison & Pearce (2018),harmonicity,#11A3FF,Flute
8.243243243243244,1.6868182283695785,Har18,Harrison & Pearce (2018),harmonicity,#11A3FF,Flute
8.258258258258259,1.6740106068161522,Har18,Harrison & Pearce (2018),harmonicity,#11A3FF,Flute
8.273273273273274,1.6604903945997755,Har18,Harrison & Pearce (2018),harmonicity,#11A3FF,Flute
8.288288288288289,1.6463641453221625,Har18,Harrison & Pearce (2018),harmonicity,#11A3FF,Flute
8.303303303303304,1.6318193358574344,Har18,Harrison & Pearce (2018),harmonicity,#11A3FF,Flute
8.318318318318319,1.6171971038533173,Har18,Harrison & Pearce (2018),harmonicity,#11A3FF,Flute
8.333333333333334,1.602907582100141,Har18,Harrison & Pearce (2018),harmonicity,#11A3FF,Flute
8.348348348348349,1.5892984485139252,Har18,Harrison & Pearce (2018),harmonicity,#11A3FF,Flute
8.363363363363364,1.5766154679649271,Har18,Harrison & Pearce (2018),harmonicity,#11A3FF,Flute
8.378378378378379,1.5650380142791396,Har18,Harrison & Pearce (2018),harmonicity,#11A3FF,Flute
8.393393393393394,1.5546931058350382,Har18,Harrison & Pearce (2018),harmonicity,#11A3FF,Flute
8.408408408408409,1.5456318900162878,Har18,Harrison & Pearce (2018),harmonicity,#11A3FF,Flute
8.423423423423424,1.5378378404016475,Har18,Harrison & Pearce (2018),harmonicity,#11A3FF,Flute
8.438438438438439,1.5312957733972796,Har18,Harrison & Pearce (2018),harmonicity,#11A3FF,Flute
8.453453453453454,1.5260498548037693,Har18,Harrison & Pearce (2018),harmonicity,#11A3FF,Flute
8.468468468468469,1.5221825185462747,Har18,Harrison & Pearce (2018),harmonicity,#11A3FF,Flute
8.483483483483484,1.5197507338133407,Har18,Harrison & Pearce (2018),harmonicity,#11A3FF,Flute
8.498498498498499,1.5187599141446078,Har18,Harrison & Pearce (2018),harmonicity,#11A3FF,Flute
8.513513513513514,1.5191931480131613,Har18,Harrison & Pearce (2018),harmonicity,#11A3FF,Flute
8.528528528528529,1.5210399244448731,Har18,Harrison & Pearce (2018),harmonicity,#11A3FF,Flute
8.543543543543544,1.524270287211372,Har18,Harrison & Pearce (2018),harmonicity,#11A3FF,Flute
8.558558558558559,1.528780983535349,Har18,Harrison & Pearce (2018),harmonicity,#11A3FF,Flute
8.573573573573574,1.5343975063057025,Har18,Harrison & Pearce (2018),harmonicity,#11A3FF,Flute
8.588588588588589,1.5409558606859959,Har18,Harrison & Pearce (2018),harmonicity,#11A3FF,Flute
8.603603603603604,1.5483789060474205,Har18,Harrison & Pearce (2018),harmonicity,#11A3FF,Flute
8.618618618618619,1.556650786801525,Har18,Harrison & Pearce (2018),harmonicity,#11A3FF,Flute
8.633633633633634,1.5657086823265993,Har18,Harrison & Pearce (2018),harmonicity,#11A3FF,Flute
8.64864864864865,1.575376793466088,Har18,Harrison & Pearce (2018),harmonicity,#11A3FF,Flute
8.663663663663664,1.5854128588232066,Har18,Harrison & Pearce (2018),harmonicity,#11A3FF,Flute
8.67867867867868,1.5955939717685446,Har18,Harrison & Pearce (2018),harmonicity,#11A3FF,Flute
8.693693693693694,1.6057440793205184,Har18,Harrison & Pearce (2018),harmonicity,#11A3FF,Flute
8.70870870870871,1.6157037646719226,Har18,Harrison & Pearce (2018),harmonicity,#11A3FF,Flute
8.723723723723724,1.6252993923635661,Har18,Harrison & Pearce (2018),harmonicity,#11A3FF,Flute
8.73873873873874,1.6343446049223938,Har18,Harrison & Pearce (2018),harmonicity,#11A3FF,Flute
8.753753753753754,1.6426721664974762,Har18,Harrison & Pearce (2018),harmonicity,#11A3FF,Flute
8.76876876876877,1.6501663948204797,Har18,Harrison & Pearce (2018),harmonicity,#11A3FF,Flute
8.783783783783784,1.6567512250425496,Har18,Harrison & Pearce (2018),harmonicity,#11A3FF,Flute
8.7987987987988,1.6623330332086441,Har18,Harrison & Pearce (2018),harmonicity,#11A3FF,Flute
8.813813813813814,1.666768977988375,Har18,Harrison & Pearce (2018),harmonicity,#11A3FF,Flute
8.82882882882883,1.6699092179042416,Har18,Harrison & Pearce (2018),harmonicity,#11A3FF,Flute
8.843843843843844,1.6716623740447616,Har18,Harrison & Pearce (2018),harmonicity,#11A3FF,Flute
8.85885885885886,1.67201591108525,Har18,Harrison & Pearce (2018),harmonicity,#11A3FF,Flute
8.873873873873874,1.6710181459637334,Har18,Harrison & Pearce (2018),harmonicity,#11A3FF,Flute
8.88888888888889,1.668762269260623,Har18,Harrison & Pearce (2018),harmonicity,#11A3FF,Flute
8.903903903903904,1.6653750087859551,Har18,Harrison & Pearce (2018),harmonicity,#11A3FF,Flute
8.91891891891892,1.6609898703434844,Har18,Harrison & Pearce (2018),harmonicity,#11A3FF,Flute
8.933933933933934,1.655718143946888,Har18,Harrison & Pearce (2018),harmonicity,#11A3FF,Flute
8.94894894894895,1.6496627410283589,Har18,Harrison & Pearce (2018),harmonicity,#11A3FF,Flute
8.963963963963964,1.6429795413529555,Har18,Harrison & Pearce (2018),harmonicity,#11A3FF,Flute
8.97897897897898,1.63591550063641,Har18,Harrison & Pearce (2018),harmonicity,#11A3FF,Flute
8.993993993993994,1.6287579074846035,Har18,Harrison & Pearce (2018),harmonicity,#11A3FF,Flute
9.00900900900901,1.6217222884168745,Har18,Harrison & Pearce (2018),harmonicity,#11A3FF,Flute
9.024024024024024,1.6148808488515516,Har18,Harrison & Pearce (2018),harmonicity,#11A3FF,Flute
9.03903903903904,1.6082149707659652,Har18,Harrison & Pearce (2018),harmonicity,#11A3FF,Flute
9.054054054054054,1.601749490570749,Har18,Harrison & Pearce (2018),harmonicity,#11A3FF,Flute
9.06906906906907,1.595614314856931,Har18,Harrison & Pearce (2018),harmonicity,#11A3FF,Flute
9.084084084084084,1.5899761007403892,Har18,Harrison & Pearce (2018),harmonicity,#11A3FF,Flute
9.0990990990991,1.5849617901136495,Har18,Harrison & Pearce (2018),harmonicity,#11A3FF,Flute
9.114114114114114,1.5806564538193246,Har18,Harrison & Pearce (2018),harmonicity,#11A3FF,Flute
9.12912912912913,1.5771155294404267,Har18,Harrison & Pearce (2018),harmonicity,#11A3FF,Flute
9.144144144144144,1.5743503073060974,Har18,Harrison & Pearce (2018),harmonicity,#11A3FF,Flute
9.15915915915916,1.572323656213989,Har18,Harrison & Pearce (2018),harmonicity,#11A3FF,Flute
9.174174174174174,1.5709721852683265,Har18,Harrison & Pearce (2018),harmonicity,#11A3FF,Flute
9.18918918918919,1.5702277863272398,Har18,Harrison & Pearce (2018),harmonicity,#11A3FF,Flute
9.204204204204204,1.570020012914876,Har18,Harrison & Pearce (2018),harmonicity,#11A3FF,Flute
9.21921921921922,1.5702648678940228,Har18,Harrison & Pearce (2018),harmonicity,#11A3FF,Flute
9.234234234234235,1.5708598775284113,Har18,Harrison & Pearce (2018),harmonicity,#11A3FF,Flute
9.24924924924925,1.5717062103262391,Har18,Harrison & Pearce (2018),harmonicity,#11A3FF,Flute
9.264264264264265,1.5727468691867033,Har18,Harrison & Pearce (2018),harmonicity,#11A3FF,Flute
9.27927927927928,1.5739725120845984,Har18,Harrison & Pearce (2018),harmonicity,#11A3FF,Flute
9.294294294294295,1.5753765017211228,Har18,Harrison & Pearce (2018),harmonicity,#11A3FF,Flute
9.30930930930931,1.576912910859486,Har18,Harrison & Pearce (2018),harmonicity,#11A3FF,Flute
9.324324324324325,1.5785097326236628,Har18,Harrison & Pearce (2018),harmonicity,#11A3FF,Flute
9.33933933933934,1.5801157557941952,Har18,Harrison & Pearce (2018),harmonicity,#11A3FF,Flute
9.354354354354355,1.5817267041548433,Har18,Harrison & Pearce (2018),harmonicity,#11A3FF,Flute
9.36936936936937,1.5833717950524326,Har18,Harrison & Pearce (2018),harmonicity,#11A3FF,Flute
9.384384384384385,1.5850828307495666,Har18,Harrison & Pearce (2018),harmonicity,#11A3FF,Flute
9.3993993993994,1.5868770579907163,Har18,Harrison & Pearce (2018),harmonicity,#11A3FF,Flute
9.414414414414415,1.5887639269261526,Har18,Harrison & Pearce (2018),harmonicity,#11A3FF,Flute
9.42942942942943,1.5907583395431593,Har18,Harrison & Pearce (2018),harmonicity,#11A3FF,Flute
9.444444444444445,1.5928817221226128,Har18,Harrison & Pearce (2018),harmonicity,#11A3FF,Flute
9.45945945945946,1.5951541124496231,Har18,Harrison & Pearce (2018),harmonicity,#11A3FF,Flute
9.474474474474475,1.5975918872390271,Har18,Harrison & Pearce (2018),harmonicity,#11A3FF,Flute
9.48948948948949,1.6002152022952691,Har18,Harrison & Pearce (2018),harmonicity,#11A3FF,Flute
9.504504504504505,1.6030541920457955,Har18,Harrison & Pearce (2018),harmonicity,#11A3FF,Flute
9.51951951951952,1.6061413336553638,Har18,Harrison & Pearce (2018),harmonicity,#11A3FF,Flute
9.534534534534535,1.6094911927872242,Har18,Harrison & Pearce (2018),harmonicity,#11A3FF,Flute
9.54954954954955,1.61308605166392,Har18,Harrison & Pearce (2018),harmonicity,#11A3FF,Flute
9.564564564564565,1.616885315149592,Har18,Harrison & Pearce (2018),harmonicity,#11A3FF,Flute
9.57957957957958,1.6208511190648,Har18,Harrison & Pearce (2018),harmonicity,#11A3FF,Flute
9.594594594594595,1.6249688621008078,Har18,Harrison & Pearce (2018),harmonicity,#11A3FF,Flute
9.60960960960961,1.6292528479861406,Har18,Harrison & Pearce (2018),harmonicity,#11A3FF,Flute
9.624624624624625,1.6337214914116511,Har18,Harrison & Pearce (2018),harmonicity,#11A3FF,Flute
9.63963963963964,1.638338597649982,Har18,Harrison & Pearce (2018),harmonicity,#11A3FF,Flute
9.654654654654655,1.6429936516628942,Har18,Harrison & Pearce (2018),harmonicity,#11A3FF,Flute
9.66966966966967,1.6475964629098587,Har18,Harrison & Pearce (2018),harmonicity,#11A3FF,Flute
9.684684684684685,1.652200479508008,Har18,Harrison & Pearce (2018),harmonicity,#11A3FF,Flute
9.6996996996997,1.656970205028119,Har18,Harrison & Pearce (2018),harmonicity,#11A3FF,Flute
9.714714714714715,1.6619850340586164,Har18,Harrison & Pearce (2018),harmonicity,#11A3FF,Flute
9.72972972972973,1.6671107784737633,Har18,Harrison & Pearce (2018),harmonicity,#11A3FF,Flute
9.744744744744745,1.6720959327702953,Har18,Harrison & Pearce (2018),harmonicity,#11A3FF,Flute
9.75975975975976,1.67675928741628,Har18,Harrison & Pearce (2018),harmonicity,#11A3FF,Flute
9.774774774774775,1.68106110423451,Har18,Harrison & Pearce (2018),harmonicity,#11A3FF,Flute
9.78978978978979,1.6850370166134903,Har18,Harrison & Pearce (2018),harmonicity,#11A3FF,Flute
9.804804804804805,1.6887156256433036,Har18,Harrison & Pearce (2018),harmonicity,#11A3FF,Flute
9.81981981981982,1.6921032315977056,Har18,Harrison & Pearce (2018),harmonicity,#11A3FF,Flute
9.834834834834835,1.6952004763928938,Har18,Harrison & Pearce (2018),harmonicity,#11A3FF,Flute
9.84984984984985,1.6979826706521555,Har18,Harrison & Pearce (2018),harmonicity,#11A3FF,Flute
9.864864864864865,1.700371723773808,Har18,Harrison & Pearce (2018),harmonicity,#11A3FF,Flute
9.87987987987988,1.7022690792185813,Har18,Harrison & Pearce (2018),harmonicity,#11A3FF,Flute
9.894894894894895,1.7036210385838053,Har18,Harrison & Pearce (2018),harmonicity,#11A3FF,Flute
9.90990990990991,1.704433602540758,Har18,Harrison & Pearce (2018),harmonicity,#11A3FF,Flute
9.924924924924925,1.7047266648037798,Har18,Harrison & Pearce (2018),harmonicity,#11A3FF,Flute
9.93993993993994,1.7044882140609188,Har18,Harrison & Pearce (2018),harmonicity,#11A3FF,Flute
9.954954954954955,1.7036801471022704,Har18,Harrison & Pearce (2018),harmonicity,#11A3FF,Flute
9.96996996996997,1.7022864336626973,Har18,Harrison & Pearce (2018),harmonicity,#11A3FF,Flute
9.984984984984985,1.7003453923476004,Har18,Harrison & Pearce (2018),harmonicity,#11A3FF,Flute
10,1.697930274023698,Har18,Harrison & Pearce (2018),harmonicity,#11A3FF,Flute
10.015015015015015,1.6951014558137214,Har18,Harrison & Pearce (2018),harmonicity,#11A3FF,Flute
10.03003003003003,1.691875768474822,Har18,Harrison & Pearce (2018),harmonicity,#11A3FF,Flute
10.045045045045045,1.6882463545717747,Har18,Harrison & Pearce (2018),harmonicity,#11A3FF,Flute
10.06006006006006,1.6842414546547042,Har18,Harrison & Pearce (2018),harmonicity,#11A3FF,Flute
10.075075075075075,1.679951301906388,Har18,Harrison & Pearce (2018),harmonicity,#11A3FF,Flute
10.09009009009009,1.6754810932634339,Har18,Harrison & Pearce (2018),harmonicity,#11A3FF,Flute
10.105105105105105,1.6708911028168598,Har18,Harrison & Pearce (2018),harmonicity,#11A3FF,Flute
10.12012012012012,1.6662030784593684,Har18,Harrison & Pearce (2018),harmonicity,#11A3FF,Flute
10.135135135135135,1.6614586162465161,Har18,Harrison & Pearce (2018),harmonicity,#11A3FF,Flute
10.15015015015015,1.6567460655375639,Har18,Harrison & Pearce (2018),harmonicity,#11A3FF,Flute
10.165165165165165,1.6521546177497688,Har18,Harrison & Pearce (2018),harmonicity,#11A3FF,Flute
10.18018018018018,1.6477133839412152,Har18,Harrison & Pearce (2018),harmonicity,#11A3FF,Flute
10.195195195195195,1.6433975340981588,Har18,Harrison & Pearce (2018),harmonicity,#11A3FF,Flute
10.21021021021021,1.6391901025622053,Har18,Harrison & Pearce (2018),harmonicity,#11A3FF,Flute
10.225225225225225,1.6351119365175255,Har18,Harrison & Pearce (2018),harmonicity,#11A3FF,Flute
10.24024024024024,1.6311894566194924,Har18,Harrison & Pearce (2018),harmonicity,#11A3FF,Flute
10.255255255255255,1.627420016850403,Har18,Harrison & Pearce (2018),harmonicity,#11A3FF,Flute
10.27027027027027,1.623778200368494,Har18,Harrison & Pearce (2018),harmonicity,#11A3FF,Flute
10.285285285285285,1.6202371052536366,Har18,Harrison & Pearce (2018),harmonicity,#11A3FF,Flute
10.3003003003003,1.6167730698920992,Har18,Harrison & Pearce (2018),harmonicity,#11A3FF,Flute
10.315315315315315,1.6133617687866282,Har18,Harrison & Pearce (2018),harmonicity,#11A3FF,Flute
10.33033033033033,1.609980720192466,Har18,Harrison & Pearce (2018),harmonicity,#11A3FF,Flute
10.345345345345345,1.6066109336131436,Har18,Harrison & Pearce (2018),harmonicity,#11A3FF,Flute
10.36036036036036,1.6032292957525396,Har18,Harrison & Pearce (2018),harmonicity,#11A3FF,Flute
10.375375375375375,1.5998026579710773,Har18,Harrison & Pearce (2018),harmonicity,#11A3FF,Flute
10.39039039039039,1.596293232246352,Har18,Harrison & Pearce (2018),harmonicity,#11A3FF,Flute
10.405405405405405,1.592666797502416,Har18,Harrison & Pearce (2018),harmonicity,#11A3FF,Flute
10.42042042042042,1.588898728848548,Har18,Harrison & Pearce (2018),harmonicity,#11A3FF,Flute
10.435435435435435,1.5849859722691437,Har18,Harrison & Pearce (2018),harmonicity,#11A3FF,Flute
10.45045045045045,1.580960669151135,Har18,Harrison & Pearce (2018),harmonicity,#11A3FF,Flute
10.465465465465465,1.5768862748884689,Har18,Harrison & Pearce (2018),harmonicity,#11A3FF,Flute
10.48048048048048,1.5728349573893612,Har18,Harrison & Pearce (2018),harmonicity,#11A3FF,Flute
10.495495495495495,1.5688698260743479,Har18,Harrison & Pearce (2018),harmonicity,#11A3FF,Flute
10.51051051051051,1.5650492298277283,Har18,Harrison & Pearce (2018),harmonicity,#11A3FF,Flute
10.525525525525525,1.5614438414466951,Har18,Harrison & Pearce (2018),harmonicity,#11A3FF,Flute
10.54054054054054,1.5581437423860793,Har18,Harrison & Pearce (2018),harmonicity,#11A3FF,Flute
10.555555555555555,1.5552457135861062,Har18,Harrison & Pearce (2018),harmonicity,#11A3FF,Flute
10.57057057057057,1.552833335184109,Har18,Harrison & Pearce (2018),harmonicity,#11A3FF,Flute
10.585585585585585,1.5509680291737344,Har18,Harrison & Pearce (2018),harmonicity,#11A3FF,Flute
10.6006006006006,1.5496953644694145,Har18,Harrison & Pearce (2018),harmonicity,#11A3FF,Flute
10.615615615615615,1.5490545827404743,Har18,Harrison & Pearce (2018),harmonicity,#11A3FF,Flute
10.63063063063063,1.5490773046597606,Har18,Harrison & Pearce (2018),harmonicity,#11A3FF,Flute
10.645645645645645,1.5497782836513925,Har18,Harrison & Pearce (2018),harmonicity,#11A3FF,Flute
10.66066066066066,1.5511511590185765,Har18,Harrison & Pearce (2018),harmonicity,#11A3FF,Flute
10.675675675675675,1.5531684909159729,Har18,Harrison & Pearce (2018),harmonicity,#11A3FF,Flute
10.69069069069069,1.5557798408283632,Har18,Harrison & Pearce (2018),harmonicity,#11A3FF,Flute
10.705705705705705,1.5589133407864617,Har18,Harrison & Pearce (2018),harmonicity,#11A3FF,Flute
10.72072072072072,1.5624812571650186,Har18,Harrison & Pearce (2018),harmonicity,#11A3FF,Flute
10.735735735735735,1.566378957260885,Har18,Harrison & Pearce (2018),harmonicity,#11A3FF,Flute
10.75075075075075,1.5704784410714505,Har18,Harrison & Pearce (2018),harmonicity,#11A3FF,Flute
10.765765765765765,1.5746287271611457,Har18,Harrison & Pearce (2018),harmonicity,#11A3FF,Flute
10.78078078078078,1.5786651945986063,Har18,Harrison & Pearce (2018),harmonicity,#11A3FF,Flute
10.795795795795796,1.5824207912804733,Har18,Harrison & Pearce (2018),harmonicity,#11A3FF,Flute
10.81081081081081,1.5857368413338406,Har18,Harrison & Pearce (2018),harmonicity,#11A3FF,Flute
10.825825825825826,1.5884744024030208,Har18,Harrison & Pearce (2018),harmonicity,#11A3FF,Flute
10.84084084084084,1.5905205641879563,Har18,Harrison & Pearce (2018),harmonicity,#11A3FF,Flute
10.855855855855856,1.591783229604856,Har18,Harrison & Pearce (2018),harmonicity,#11A3FF,Flute
10.87087087087087,1.5921824579632773,Har18,Harrison & Pearce (2018),harmonicity,#11A3FF,Flute
10.885885885885886,1.5916556639632944,Har18,Harrison & Pearce (2018),harmonicity,#11A3FF,Flute
10.9009009009009,1.5901786835105638,Har18,Harrison & Pearce (2018),harmonicity,#11A3FF,Flute
10.915915915915916,1.5877831443974804,Har18,Harrison & Pearce (2018),harmonicity,#11A3FF,Flute
10.93093093093093,1.5845510418161761,Har18,Harrison & Pearce (2018),harmonicity,#11A3FF,Flute
10.945945945945946,1.5805905353479246,Har18,Harrison & Pearce (2018),harmonicity,#11A3FF,Flute
10.96096096096096,1.5760167407543355,Har18,Harrison & Pearce (2018),harmonicity,#11A3FF,Flute
10.975975975975976,1.570951846684914,Har18,Harrison & Pearce (2018),harmonicity,#11A3FF,Flute
10.99099099099099,1.565532510768174,Har18,Harrison & Pearce (2018),harmonicity,#11A3FF,Flute
11.006006006006006,1.5599070576896201,Har18,Harrison & Pearce (2018),harmonicity,#11A3FF,Flute
11.02102102102102,1.5542225392987974,Har18,Harrison & Pearce (2018),harmonicity,#11A3FF,Flute
11.036036036036036,1.5486124033807942,Har18,Harrison & Pearce (2018),harmonicity,#11A3FF,Flute
11.05105105105105,1.5431918073215722,Har18,Harrison & Pearce (2018),harmonicity,#11A3FF,Flute
11.066066066066066,1.5380614041940899,Har18,Harrison & Pearce (2018),harmonicity,#11A3FF,Flute
11.08108108108108,1.5333133789174203,Har18,Harrison & Pearce (2018),harmonicity,#11A3FF,Flute
11.096096096096096,1.529027430231453,Har18,Harrison & Pearce (2018),harmonicity,#11A3FF,Flute
11.11111111111111,1.5252537378439421,Har18,Harrison & Pearce (2018),harmonicity,#11A3FF,Flute
11.126126126126126,1.5220006127618555,Har18,Harrison & Pearce (2018),harmonicity,#11A3FF,Flute
11.14114114114114,1.51924385860617,Har18,Harrison & Pearce (2018),harmonicity,#11A3FF,Flute
11.156156156156156,1.5169486721784629,Har18,Harrison & Pearce (2018),harmonicity,#11A3FF,Flute
11.17117117117117,1.5150823114936383,Har18,Harrison & Pearce (2018),harmonicity,#11A3FF,Flute
11.186186186186186,1.5136113212606135,Har18,Harrison & Pearce (2018),harmonicity,#11A3FF,Flute
11.2012012012012,1.5124936902989898,Har18,Harrison & Pearce (2018),harmonicity,#11A3FF,Flute
11.216216216216216,1.511676421313301,Har18,Harrison & Pearce (2018),harmonicity,#11A3FF,Flute
11.23123123123123,1.5110998725772333,Har18,Harrison & Pearce (2018),harmonicity,#11A3FF,Flute
11.246246246246246,1.5107039075411859,Har18,Harrison & Pearce (2018),harmonicity,#11A3FF,Flute
11.26126126126126,1.510432384171052,Har18,Harrison & Pearce (2018),harmonicity,#11A3FF,Flute
11.276276276276276,1.510236271061633,Har18,Harrison & Pearce (2018),harmonicity,#11A3FF,Flute
11.29129129129129,1.5100753278167423,Har18,Harrison & Pearce (2018),harmonicity,#11A3FF,Flute
11.306306306306306,1.5099173094646863,Har18,Harrison & Pearce (2018),harmonicity,#11A3FF,Flute
11.32132132132132,1.5097358119301736,Har18,Harrison & Pearce (2018),harmonicity,#11A3FF,Flute
11.336336336336336,1.5095096940007298,Har18,Harrison & Pearce (2018),harmonicity,#11A3FF,Flute
11.35135135135135,1.5092257690977111,Har18,Harrison & Pearce (2018),harmonicity,#11A3FF,Flute
11.366366366366366,1.5088833448727705,Har18,Harrison & Pearce (2018),harmonicity,#11A3FF,Flute
11.381381381381381,1.5084968790893891,Har18,Harrison & Pearce (2018),harmonicity,#11A3FF,Flute
11.396396396396396,1.5080948490863813,Har18,Harrison & Pearce (2018),harmonicity,#11A3FF,Flute
11.411411411411411,1.5077172658644873,Har18,Harrison & Pearce (2018),harmonicity,#11A3FF,Flute
11.426426426426426,1.5074148816448525,Har18,Harrison & Pearce (2018),harmonicity,#11A3FF,Flute
11.441441441441441,1.507249898522009,Har18,Harrison & Pearce (2018),harmonicity,#11A3FF,Flute
11.456456456456456,1.5072966398426928,Har18,Harrison & Pearce (2018),harmonicity,#11A3FF,Flute
11.471471471471471,1.5076426199926487,Har18,Harrison & Pearce (2018),harmonicity,#11A3FF,Flute
11.486486486486486,1.5083914135197396,Har18,Harrison & Pearce (2018),harmonicity,#11A3FF,Flute
11.501501501501501,1.509665336241127,Har18,Harrison & Pearce (2018),harmonicity,#11A3FF,Flute
11.516516516516516,1.5116024617090462,Har18,Harrison & Pearce (2018),harmonicity,#11A3FF,Flute
11.531531531531531,1.5143477998705632,Har18,Harrison & Pearce (2018),harmonicity,#11A3FF,Flute
11.546546546546546,1.5180488747923226,Har18,Harrison & Pearce (2018),harmonicity,#11A3FF,Flute
11.561561561561561,1.5228639999747235,Har18,Harrison & Pearce (2018),harmonicity,#11A3FF,Flute
11.576576576576576,1.528975275245811,Har18,Harrison & Pearce (2018),harmonicity,#11A3FF,Flute
11.591591591591591,1.536589169326776,Har18,Harrison & Pearce (2018),harmonicity,#11A3FF,Flute
11.606606606606606,1.545919456239664,Har18,Harrison & Pearce (2018),harmonicity,#11A3FF,Flute
11.621621621621621,1.55716755140251,Har18,Harrison & Pearce (2018),harmonicity,#11A3FF,Flute
11.636636636636636,1.5705184147262683,Har18,Harrison & Pearce (2018),harmonicity,#11A3FF,Flute
11.651651651651651,1.5861504473665924,Har18,Harrison & Pearce (2018),harmonicity,#11A3FF,Flute
11.666666666666666,1.6042412771442878,Har18,Harrison & Pearce (2018),harmonicity,#11A3FF,Flute
11.681681681681681,1.624958383237019,Har18,Harrison & Pearce (2018),harmonicity,#11A3FF,Flute
11.696696696696696,1.648440816488659,Har18,Harrison & Pearce (2018),harmonicity,#11A3FF,Flute
11.711711711711711,1.6747843354626677,Har18,Harrison & Pearce (2018),harmonicity,#11A3FF,Flute
11.726726726726726,1.7040342380651432,Har18,Harrison & Pearce (2018),harmonicity,#11A3FF,Flute
11.741741741741741,1.7361802279484946,Har18,Harrison & Pearce (2018),harmonicity,#11A3FF,Flute
11.756756756756756,1.7711470792811828,Har18,Harrison & Pearce (2018),harmonicity,#11A3FF,Flute
11.771771771771771,1.8087818556599575,Har18,Harrison & Pearce (2018),harmonicity,#11A3FF,Flute
11.786786786786786,1.8488432706650948,Har18,Harrison & Pearce (2018),harmonicity,#11A3FF,Flute
11.801801801801801,1.8909975027228092,Har18,Harrison & Pearce (2018),harmonicity,#11A3FF,Flute
11.816816816816816,1.9348206049991796,Har18,Harrison & Pearce (2018),harmonicity,#11A3FF,Flute
11.831831831831831,1.9798024001024075,Har18,Harrison & Pearce (2018),harmonicity,#11A3FF,Flute
11.846846846846846,2.02534164784517,Har18,Harrison & Pearce (2018),harmonicity,#11A3FF,Flute
11.861861861861861,2.070727566001567,Har18,Harrison & Pearce (2018),harmonicity,#11A3FF,Flute
11.876876876876876,2.1151257166483486,Har18,Harrison & Pearce (2018),harmonicity,#11A3FF,Flute
11.891891891891891,2.1576014569247266,Har18,Harrison & Pearce (2018),harmonicity,#11A3FF,Flute
11.906906906906906,2.1971913797532756,Har18,Harrison & Pearce (2018),harmonicity,#11A3FF,Flute
11.921921921921921,2.233005373034154,Har18,Harrison & Pearce (2018),harmonicity,#11A3FF,Flute
11.936936936936936,2.2643524540705338,Har18,Harrison & Pearce (2018),harmonicity,#11A3FF,Flute
11.951951951951951,2.2908453956362838,Har18,Harrison & Pearce (2018),harmonicity,#11A3FF,Flute
11.966966966966966,2.312264229049411,Har18,Harrison & Pearce (2018),harmonicity,#11A3FF,Flute
11.981981981981981,2.327966675888773,Har18,Harrison & Pearce (2018),harmonicity,#11A3FF,Flute
11.996996996996996,2.33630967153794,Har18,Harrison & Pearce (2018),harmonicity,#11A3FF,Flute
12.012012012012011,2.335181841832146,Har18,Harrison & Pearce (2018),harmonicity,#11A3FF,Flute
12.027027027027026,2.323687473897004,Har18,Harrison & Pearce (2018),harmonicity,#11A3FF,Flute
12.042042042042041,2.303128062494444,Har18,Harrison & Pearce (2018),harmonicity,#11A3FF,Flute
12.057057057057056,2.275986694111177,Har18,Harrison & Pearce (2018),harmonicity,#11A3FF,Flute
12.072072072072071,2.244224290166156,Har18,Harrison & Pearce (2018),harmonicity,#11A3FF,Flute
12.087087087087086,2.208739154402799,Har18,Harrison & Pearce (2018),harmonicity,#11A3FF,Flute
12.102102102102101,2.1699397875285227,Har18,Harrison & Pearce (2018),harmonicity,#11A3FF,Flute
12.117117117117116,2.1283282011148055,Har18,Harrison & Pearce (2018),harmonicity,#11A3FF,Flute
12.132132132132131,2.084629059771666,Har18,Harrison & Pearce (2018),harmonicity,#11A3FF,Flute
12.147147147147146,2.039676833482098,Har18,Harrison & Pearce (2018),harmonicity,#11A3FF,Flute
12.162162162162161,1.9942925301697552,Har18,Harrison & Pearce (2018),harmonicity,#11A3FF,Flute
12.177177177177176,1.9492109294161766,Har18,Harrison & Pearce (2018),harmonicity,#11A3FF,Flute
12.192192192192191,1.9050599603499003,Har18,Harrison & Pearce (2018),harmonicity,#11A3FF,Flute
12.207207207207206,1.8623765430259185,Har18,Harrison & Pearce (2018),harmonicity,#11A3FF,Flute
12.222222222222221,1.8216186220672481,Har18,Harrison & Pearce (2018),harmonicity,#11A3FF,Flute
12.237237237237236,1.7831558288998794,Har18,Harrison & Pearce (2018),harmonicity,#11A3FF,Flute
12.252252252252251,1.7472658069089217,Har18,Harrison & Pearce (2018),harmonicity,#11A3FF,Flute
12.267267267267266,1.7141466884355545,Har18,Harrison & Pearce (2018),harmonicity,#11A3FF,Flute
12.282282282282281,1.6839217311477253,Har18,Harrison & Pearce (2018),harmonicity,#11A3FF,Flute
12.297297297297296,1.6566330613886817,Har18,Harrison & Pearce (2018),harmonicity,#11A3FF,Flute
12.312312312312311,1.6322468243437611,Har18,Harrison & Pearce (2018),harmonicity,#11A3FF,Flute
12.327327327327327,1.6106734325967187,Har18,Harrison & Pearce (2018),harmonicity,#11A3FF,Flute
12.342342342342342,1.591786684019296,Har18,Harrison & Pearce (2018),harmonicity,#11A3FF,Flute
12.357357357357357,1.575433006573507,Har18,Harrison & Pearce (2018),harmonicity,#11A3FF,Flute
12.372372372372372,1.5614350076233499,Har18,Harrison & Pearce (2018),harmonicity,#11A3FF,Flute
12.387387387387387,1.549596084043489,Har18,Harrison & Pearce (2018),harmonicity,#11A3FF,Flute
12.402402402402402,1.5397092572770918,Har18,Harrison & Pearce (2018),harmonicity,#11A3FF,Flute
12.417417417417417,1.5315679532953252,Har18,Harrison & Pearce (2018),harmonicity,#11A3FF,Flute
12.432432432432432,1.5249731943674083,Har18,Harrison & Pearce (2018),harmonicity,#11A3FF,Flute
12.447447447447447,1.519735784299178,Har18,Harrison & Pearce (2018),harmonicity,#11A3FF,Flute
12.462462462462462,1.5156771383631986,Har18,Harrison & Pearce (2018),harmonicity,#11A3FF,Flute
12.477477477477477,1.512629772375275,Har18,Harrison & Pearce (2018),harmonicity,#11A3FF,Flute
12.492492492492492,1.5104364913716473,Har18,Harrison & Pearce (2018),harmonicity,#11A3FF,Flute
12.507507507507507,1.5089514481750312,Har18,Harrison & Pearce (2018),harmonicity,#11A3FF,Flute
12.522522522522522,1.5080440432891404,Har18,Harrison & Pearce (2018),harmonicity,#11A3FF,Flute
12.537537537537537,1.5075974902593823,Har18,Harrison & Pearce (2018),harmonicity,#11A3FF,Flute
12.552552552552552,1.5074978397176921,Har18,Harrison & Pearce (2018),harmonicity,#11A3FF,Flute
12.567567567567567,1.507628004893813,Har18,Harrison & Pearce (2018),harmonicity,#11A3FF,Flute
12.582582582582582,1.5078826183924479,Har18,Harrison & Pearce (2018),harmonicity,#11A3FF,Flute
12.597597597597597,1.5081907543114406,Har18,Harrison & Pearce (2018),harmonicity,#11A3FF,Flute
12.612612612612612,1.508518504208658,Har18,Harrison & Pearce (2018),harmonicity,#11A3FF,Flute
12.627627627627627,1.5088509033973478,Har18,Harrison & Pearce (2018),harmonicity,#11A3FF,Flute
12.642642642642642,1.509176976456209,Har18,Harrison & Pearce (2018),harmonicity,#11A3FF,Flute
12.657657657657657,1.5094856712898062,Har18,Harrison & Pearce (2018),harmonicity,#11A3FF,Flute
12.672672672672672,1.5097629840581162,Har18,Harrison & Pearce (2018),harmonicity,#11A3FF,Flute
12.687687687687687,1.5099928296006544,Har18,Harrison & Pearce (2018),harmonicity,#11A3FF,Flute
12.702702702702702,1.510171466884483,Har18,Harrison & Pearce (2018),harmonicity,#11A3FF,Flute
12.717717717717717,1.5103244271960767,Har18,Harrison & Pearce (2018),harmonicity,#11A3FF,Flute
12.732732732732732,1.5105037438365039,Har18,Harrison & Pearce (2018),harmonicity,#11A3FF,Flute
12.747747747747747,1.5107697497618893,Har18,Harrison & Pearce (2018),harmonicity,#11A3FF,Flute
12.762762762762762,1.511183172409656,Har18,Harrison & Pearce (2018),harmonicity,#11A3FF,Flute
12.777777777777777,1.511807428964637,Har18,Harrison & Pearce (2018),harmonicity,#11A3FF,Flute
12.792792792792792,1.5126985695226005,Har18,Harrison & Pearce (2018),harmonicity,#11A3FF,Flute
12.807807807807807,1.5138910559031757,Har18,Harrison & Pearce (2018),harmonicity,#11A3FF,Flute
12.822822822822824,1.515406554592492,Har18,Harrison & Pearce (2018),harmonicity,#11A3FF,Flute
12.837837837837839,1.5172757898945397,Har18,Harrison & Pearce (2018),harmonicity,#11A3FF,Flute
12.852852852852854,1.5195420023446478,Har18,Harrison & Pearce (2018),harmonicity,#11A3FF,Flute
12.867867867867869,1.5222430934899036,Har18,Harrison & Pearce (2018),harmonicity,#11A3FF,Flute
12.882882882882884,1.5253936185307666,Har18,Harrison & Pearce (2018),harmonicity,#11A3FF,Flute
12.897897897897899,1.5289835878988125,Har18,Harrison & Pearce (2018),harmonicity,#11A3FF,Flute
12.912912912912914,1.5329967838261607,Har18,Harrison & Pearce (2018),harmonicity,#11A3FF,Flute
12.927927927927929,1.5374286549010678,Har18,Harrison & Pearce (2018),harmonicity,#11A3FF,Flute
12.942942942942944,1.5422713018979282,Har18,Harrison & Pearce (2018),harmonicity,#11A3FF,Flute
12.957957957957959,1.5474734792190201,Har18,Harrison & Pearce (2018),harmonicity,#11A3FF,Flute
12.972972972972974,1.5529325772278062,Har18,Harrison & Pearce (2018),harmonicity,#11A3FF,Flute
12.987987987987989,1.5585332716416431,Har18,Harrison & Pearce (2018),harmonicity,#11A3FF,Flute
13.003003003003004,1.564171162470863,Har18,Harrison & Pearce (2018),harmonicity,#11A3FF,Flute
13.018018018018019,1.56972619167736,Har18,Harrison & Pearce (2018),harmonicity,#11A3FF,Flute
13.033033033033034,1.575030413027395,Har18,Harrison & Pearce (2018),harmonicity,#11A3FF,Flute
13.048048048048049,1.5798796490803224,Har18,Harrison & Pearce (2018),harmonicity,#11A3FF,Flute
13.063063063063064,1.584081028412855,Har18,Harrison & Pearce (2018),harmonicity,#11A3FF,Flute
13.078078078078079,1.5874922498806125,Har18,Harrison & Pearce (2018),harmonicity,#11A3FF,Flute
13.093093093093094,1.5900283884884536,Har18,Harrison & Pearce (2018),harmonicity,#11A3FF,Flute
13.108108108108109,1.5916521195776123,Har18,Harrison & Pearce (2018),harmonicity,#11A3FF,Flute
13.123123123123124,1.5923674034829367,Har18,Harrison & Pearce (2018),harmonicity,#11A3FF,Flute
13.138138138138139,1.5922105072537147,Har18,Harrison & Pearce (2018),harmonicity,#11A3FF,Flute
13.153153153153154,1.5912257801089038,Har18,Harrison & Pearce (2018),harmonicity,#11A3FF,Flute
13.168168168168169,1.5894401924199961,Har18,Harrison & Pearce (2018),harmonicity,#11A3FF,Flute
13.183183183183184,1.586874756765827,Har18,Harrison & Pearce (2018),harmonicity,#11A3FF,Flute
13.198198198198199,1.5836069555666155,Har18,Harrison & Pearce (2018),harmonicity,#11A3FF,Flute
13.213213213213214,1.5798245876000938,Har18,Harrison & Pearce (2018),harmonicity,#11A3FF,Flute
13.228228228228229,1.5757818009203672,Har18,Harrison & Pearce (2018),harmonicity,#11A3FF,Flute
13.243243243243244,1.571671641520329,Har18,Harrison & Pearce (2018),harmonicity,#11A3FF,Flute
13.258258258258259,1.5675590885095263,Har18,Harrison & Pearce (2018),harmonicity,#11A3FF,Flute
13.273273273273274,1.5634691559564604,Har18,Harrison & Pearce (2018),harmonicity,#11A3FF,Flute
13.288288288288289,1.5595261927541533,Har18,Harrison & Pearce (2018),harmonicity,#11A3FF,Flute
13.303303303303304,1.5559669105544938,Har18,Harrison & Pearce (2018),harmonicity,#11A3FF,Flute
13.318318318318319,1.553012621986701,Har18,Harrison & Pearce (2018),harmonicity,#11A3FF,Flute
13.333333333333334,1.5507552228578803,Har18,Harrison & Pearce (2018),harmonicity,#11A3FF,Flute
13.348348348348349,1.5491727875719108,Har18,Harrison & Pearce (2018),harmonicity,#11A3FF,Flute
13.363363363363364,1.5482304235450035,Har18,Harrison & Pearce (2018),harmonicity,#11A3FF,Flute
13.378378378378379,1.5479434796947398,Har18,Harrison & Pearce (2018),harmonicity,#11A3FF,Flute
13.393393393393394,1.5483513312759931,Har18,Harrison & Pearce (2018),harmonicity,#11A3FF,Flute
13.408408408408409,1.5494603175754609,Har18,Harrison & Pearce (2018),harmonicity,#11A3FF,Flute
13.423423423423424,1.5512251090871103,Har18,Harrison & Pearce (2018),harmonicity,#11A3FF,Flute
13.438438438438439,1.5535679868223091,Har18,Harrison & Pearce (2018),harmonicity,#11A3FF,Flute
13.453453453453454,1.5564002621393334,Har18,Harrison & Pearce (2018),harmonicity,#11A3FF,Flute
13.468468468468469,1.5596324119052263,Har18,Harrison & Pearce (2018),harmonicity,#11A3FF,Flute
13.483483483483484,1.5631813690581662,Har18,Harrison & Pearce (2018),harmonicity,#11A3FF,Flute
13.498498498498499,1.5669771791423428,Har18,Harrison & Pearce (2018),harmonicity,#11A3FF,Flute
13.513513513513514,1.57095846705995,Har18,Harrison & Pearce (2018),harmonicity,#11A3FF,Flute
13.528528528528529,1.5750548848876869,Har18,Harrison & Pearce (2018),harmonicity,#11A3FF,Flute
13.543543543543544,1.579177008314262,Har18,Harrison & Pearce (2018),harmonicity,#11A3FF,Flute
13.558558558558559,1.5832336107958018,Har18,Harrison & Pearce (2018),harmonicity,#11A3FF,Flute
13.573573573573574,1.5871678627123984,Har18,Harrison & Pearce (2018),harmonicity,#11A3FF,Flute
13.588588588588589,1.5909794088188878,Har18,Harrison & Pearce (2018),harmonicity,#11A3FF,Flute
13.603603603603604,1.5947023887927896,Har18,Harrison & Pearce (2018),harmonicity,#11A3FF,Flute
13.618618618618619,1.5983513858634162,Har18,Harrison & Pearce (2018),harmonicity,#11A3FF,Flute
13.633633633633634,1.601896672293176,Har18,Harrison & Pearce (2018),harmonicity,#11A3FF,Flute
13.64864864864865,1.605307408619127,Har18,Harrison & Pearce (2018),harmonicity,#11A3FF,Flute
13.663663663663664,1.6086122362820976,Har18,Harrison & Pearce (2018),harmonicity,#11A3FF,Flute
13.67867867867868,1.6118959885749613,Har18,Harrison & Pearce (2018),harmonicity,#11A3FF,Flute
13.693693693693694,1.6152326067487621,Har18,Harrison & Pearce (2018),harmonicity,#11A3FF,Flute
13.70870870870871,1.6186370159131014,Har18,Harrison & Pearce (2018),harmonicity,#11A3FF,Flute
13.723723723723724,1.622088588125344,Har18,Harrison & Pearce (2018),harmonicity,#11A3FF,Flute
13.73873873873874,1.6255868613734448,Har18,Harrison & Pearce (2018),harmonicity,#11A3FF,Flute
13.753753753753754,1.629174623625188,Har18,Harrison & Pearce (2018),harmonicity,#11A3FF,Flute
13.76876876876877,1.63291316578387,Har18,Harrison & Pearce (2018),harmonicity,#11A3FF,Flute
13.783783783783784,1.63684082442349,Har18,Harrison & Pearce (2018),harmonicity,#11A3FF,Flute
13.7987987987988,1.6409538321839743,Har18,Harrison & Pearce (2018),harmonicity,#11A3FF,Flute
13.813813813813814,1.6452214188316487,Har18,Harrison & Pearce (2018),harmonicity,#11A3FF,Flute
13.82882882882883,1.6496109973399768,Har18,Harrison & Pearce (2018),harmonicity,#11A3FF,Flute
13.843843843843844,1.6540971801647757,Har18,Harrison & Pearce (2018),harmonicity,#11A3FF,Flute
13.85885885885886,1.6586562900363149,Har18,Harrison & Pearce (2018),harmonicity,#11A3FF,Flute
13.873873873873874,1.6632608683213035,Har18,Harrison & Pearce (2018),harmonicity,#11A3FF,Flute
13.88888888888889,1.6678764277208313,Har18,Harrison & Pearce (2018),harmonicity,#11A3FF,Flute
13.903903903903904,1.672453646083275,Har18,Harrison & Pearce (2018),harmonicity,#11A3FF,Flute
13.91891891891892,1.6769205326989072,Har18,Harrison & Pearce (2018),harmonicity,#11A3FF,Flute
13.933933933933934,1.6811923945007055,Har18,Harrison & Pearce (2018),harmonicity,#11A3FF,Flute
13.94894894894895,1.6852007845311348,Har18,Harrison & Pearce (2018),harmonicity,#11A3FF,Flute
13.963963963963964,1.6889110692022375,Har18,Harrison & Pearce (2018),harmonicity,#11A3FF,Flute
13.97897897897898,1.6923054926104821,Har18,Harrison & Pearce (2018),harmonicity,#11A3FF,Flute
13.993993993993994,1.6953490941861797,Har18,Harrison & Pearce (2018),harmonicity,#11A3FF,Flute
14.00900900900901,1.6979758104896003,Har18,Harrison & Pearce (2018),harmonicity,#11A3FF,Flute
14.024024024024024,1.7001193064552698,Har18,Harrison & Pearce (2018),harmonicity,#11A3FF,Flute
14.03903903903904,1.7017678862909948,Har18,Harrison & Pearce (2018),harmonicity,#11A3FF,Flute
14.054054054054054,1.7029707412961663,Har18,Harrison & Pearce (2018),harmonicity,#11A3FF,Flute
14.06906906906907,1.7037651133499059,Har18,Harrison & Pearce (2018),harmonicity,#11A3FF,Flute
14.084084084084084,1.7041124326814947,Har18,Harrison & Pearce (2018),harmonicity,#11A3FF,Flute
14.0990990990991,1.7039299261921936,Har18,Harrison & Pearce (2018),harmonicity,#11A3FF,Flute
14.114114114114114,1.7031695916078011,Har18,Harrison & Pearce (2018),harmonicity,#11A3FF,Flute
14.12912912912913,1.7018470762072202,Har18,Harrison & Pearce (2018),harmonicity,#11A3FF,Flute
14.144144144144144,1.700010146540123,Har18,Harrison & Pearce (2018),harmonicity,#11A3FF,Flute
14.15915915915916,1.6977031427630433,Har18,Harrison & Pearce (2018),harmonicity,#11A3FF,Flute
14.174174174174174,1.6949618956553056,Har18,Harrison & Pearce (2018),harmonicity,#11A3FF,Flute
14.18918918918919,1.691831878681295,Har18,Harrison & Pearce (2018),harmonicity,#11A3FF,Flute
14.204204204204204,1.6883890856469335,Har18,Harrison & Pearce (2018),harmonicity,#11A3FF,Flute
14.21921921921922,1.684738672804526,Har18,Harrison & Pearce (2018),harmonicity,#11A3FF,Flute
14.234234234234235,1.6809641890913958,Har18,Harrison & Pearce (2018),harmonicity,#11A3FF,Flute
14.24924924924925,1.6770464852667195,Har18,Harrison & Pearce (2018),harmonicity,#11A3FF,Flute
14.264264264264265,1.67285370290497,Har18,Harrison & Pearce (2018),harmonicity,#11A3FF,Flute
14.27927927927928,1.6682680567768708,Har18,Harrison & Pearce (2018),harmonicity,#11A3FF,Flute
14.294294294294295,1.6633219211827328,Har18,Harrison & Pearce (2018),harmonicity,#11A3FF,Flute
14.30930930930931,1.658164431718891,Har18,Harrison & Pearce (2018),harmonicity,#11A3FF,Flute
14.324324324324325,1.652925748346988,Har18,Harrison & Pearce (2018),harmonicity,#11A3FF,Flute
14.33933933933934,1.6476853469066606,Har18,Harrison & Pearce (2018),harmonicity,#11A3FF,Flute
14.354354354354355,1.6425339122120148,Har18,Harrison & Pearce (2018),harmonicity,#11A3FF,Flute
14.36936936936937,1.6375681940153053,Har18,Harrison & Pearce (2018),harmonicity,#11A3FF,Flute
14.384384384384385,1.6328256505511027,Har18,Harrison & Pearce (2018),harmonicity,#11A3FF,Flute
14.3993993993994,1.6282834912813215,Har18,Harrison & Pearce (2018),harmonicity,#11A3FF,Flute
14.414414414414415,1.6239230753227458,Har18,Harrison & Pearce (2018),harmonicity,#11A3FF,Flute
14.42942942942943,1.6197617456778053,Har18,Harrison & Pearce (2018),harmonicity,#11A3FF,Flute
14.444444444444445,1.6158233904643282,Har18,Harrison & Pearce (2018),harmonicity,#11A3FF,Flute
14.45945945945946,1.6121079143058865,Har18,Harrison & Pearce (2018),harmonicity,#11A3FF,Flute
14.474474474474475,1.6086059444410317,Har18,Harrison & Pearce (2018),harmonicity,#11A3FF,Flute
14.48948948948949,1.605333565919129,Har18,Harrison & Pearce (2018),harmonicity,#11A3FF,Flute
14.504504504504505,1.6023303873387136,Har18,Harrison & Pearce (2018),harmonicity,#11A3FF,Flute
14.51951951951952,1.5996061659786716,Har18,Harrison & Pearce (2018),harmonicity,#11A3FF,Flute
14.534534534534535,1.597096582510981,Har18,Harrison & Pearce (2018),harmonicity,#11A3FF,Flute
14.54954954954955,1.5947010290262584,Har18,Harrison & Pearce (2018),harmonicity,#11A3FF,Flute
14.564564564564565,1.5923720927560632,Har18,Harrison & Pearce (2018),harmonicity,#11A3FF,Flute
14.57957957957958,1.5901455300773937,Har18,Harrison & Pearce (2018),harmonicity,#11A3FF,Flute
14.594594594594595,1.5880846357375487,Har18,Harrison & Pearce (2018),harmonicity,#11A3FF,Flute
14.60960960960961,1.5862309576032967,Har18,Harrison & Pearce (2018),harmonicity,#11A3FF,Flute
14.624624624624625,1.5846161433183004,Har18,Harrison & Pearce (2018),harmonicity,#11A3FF,Flute
14.63963963963964,1.5832706185730023,Har18,Harrison & Pearce (2018),harmonicity,#11A3FF,Flute
14.654654654654655,1.5821517222942183,Har18,Harrison & Pearce (2018),harmonicity,#11A3FF,Flute
14.66966966966967,1.5810542293958076,Har18,Harrison & Pearce (2018),harmonicity,#11A3FF,Flute
14.684684684684685,1.5796816227383572,Har18,Harrison & Pearce (2018),harmonicity,#11A3FF,Flute
14.6996996996997,1.5778943926406355,Har18,Harrison & Pearce (2018),harmonicity,#11A3FF,Flute
14.714714714714715,1.575860469664613,Har18,Harrison & Pearce (2018),harmonicity,#11A3FF,Flute
14.72972972972973,1.573911113907765,Har18,Harrison & Pearce (2018),harmonicity,#11A3FF,Flute
14.744744744744745,1.5722938758324554,Har18,Harrison & Pearce (2018),harmonicity,#11A3FF,Flute
14.75975975975976,1.571095384550527,Har18,Harrison & Pearce (2018),harmonicity,#11A3FF,Flute
14.774774774774775,1.5703213816386812,Har18,Harrison & Pearce (2018),harmonicity,#11A3FF,Flute
14.78978978978979,1.569972812629205,Har18,Harrison & Pearce (2018),harmonicity,#11A3FF,Flute
14.804804804804805,1.5700651757700481,Har18,Harrison & Pearce (2018),harmonicity,#11A3FF,Flute
14.81981981981982,1.5706295272527548,Har18,Harrison & Pearce (2018),harmonicity,#11A3FF,Flute
14.834834834834835,1.5717135709412837,Har18,Harrison & Pearce (2018),harmonicity,#11A3FF,Flute
14.84984984984985,1.5733766189296963,Har18,Harrison & Pearce (2018),harmonicity,#11A3FF,Flute
14.864864864864865,1.5756801778658474,Har18,Harrison & Pearce (2018),harmonicity,#11A3FF,Flute
14.87987987987988,1.578677234775544,Har18,Harrison & Pearce (2018),harmonicity,#11A3FF,Flute
14.894894894894895,1.5823958810447771,Har18,Harrison & Pearce (2018),harmonicity,#11A3FF,Flute
14.90990990990991,1.5868166636314776,Har18,Harrison & Pearce (2018),harmonicity,#11A3FF,Flute
14.924924924924925,1.5918434388378015,Har18,Harrison & Pearce (2018),harmonicity,#11A3FF,Flute
14.93993993993994,1.597259517930632,Har18,Harrison & Pearce (2018),harmonicity,#11A3FF,Flute
14.954954954954955,1.6026967787097222,Har18,Harrison & Pearce (2018),harmonicity,#11A3FF,Flute
14.96996996996997,1.6077054850136516,Har18,Harrison & Pearce (2018),harmonicity,#11A3FF,Flute
14.984984984984985,1.6119321770296875,Har18,Harrison & Pearce (2018),harmonicity,#11A3FF,Flute
15,1.6152484798247826,Har18,Harrison & Pearce (2018),harmonicity,#11A3FF,Flute
