interval,output,model_id,model_label,model_theory,model_colour,timbre_label
11.75,-0,Hutch78,Hutchinson & Knopoff (1978),interference,#B50000,Pure tones
11.7505005005005,-0,Hutch78,Hutchinson & Knopoff (1978),interference,#B50000,Pure tones
11.751001001001,-0,Hutch78,Hutchinson & Knopoff (1978),interference,#B50000,Pure tones
11.751501501501501,-0,Hutch78,Hutchinson & Knopoff (1978),interference,#B50000,Pure tones
11.752002002002001,-0,Hutch78,Hutchinson & Knopoff (1978),interference,#B50000,Pure tones
11.752502502502503,-0,Hutch78,Hutchinson & Knopoff (1978),interference,#B50000,Pure tones
11.753003003003004,-0,Hutch78,Hutchinson & Knopoff (1978),interference,#B50000,Pure tones
11.753503503503504,-0,Hutch78,Hutchinson & Knopoff (1978),interference,#B50000,Pure tones
11.754004004004004,-0,Hutch78,Hutchinson & Knopoff (1978),interference,#B50000,Pure tones
11.754504504504505,-0,Hutch78,Hutchinson & Knopoff (1978),interference,#B50000,Pure tones
11.755005005005005,-0,Hutch78,Hutchinson & Knopoff (1978),interference,#B50000,Pure tones
11.755505505505505,-0,Hutch78,Hutchinson & Knopoff (1978),interference,#B50000,Pure tones
11.756006006006006,-0,Hutch78,Hutchinson & Knopoff (1978),interference,#B50000,Pure tones
11.756506506506506,-0,Hutch78,Hutchinson & Knopoff (1978),interference,#B50000,Pure tones
11.757007007007006,-0,Hutch78,Hutchinson & Knopoff (1978),interference,#B50000,Pure tones
11.757507507507508,-0,Hutch78,Hutchinson & Knopoff (1978),interference,#B50000,Pure tones
11.758008008008009,-0,Hutch78,Hutchinson & Knopoff (1978),interference,#B50000,Pure tones
11.758508508508509,-0,Hutch78,Hutchinson & Knopoff (1978),interference,#B50000,Pure tones
11.75900900900901,-0,Hutch78,Hutchinson & Knopoff (1978),interference,#B50000,Pure tones
11.75950950950951,-0,Hutch78,Hutchinson & Knopoff (1978),interference,#B50000,Pure tones
11.76001001001001,-0,Hutch78,Hutchinson & Knopoff (1978),interference,#B50000,Pure tones
11.76051051051051,-0,Hutch78,Hutchinson & Knopoff (1978),interference,#B50000,Pure tones
11.76101101101101,-0,Hutch78,Hutchinson & Knopoff (1978),interference,#B50000,Pure tones
11.761511511511511,-0,Hutch78,Hutchinson & Knopoff (1978),interference,#B50000,Pure tones
11.762012012012011,-0,Hutch78,Hutchinson & Knopoff (1978),interference,#B50000,Pure tones
11.762512512512513,-0,Hutch78,Hutchinson & Knopoff (1978),interference,#B50000,Pure tones
11.763013013013014,-0,Hutch78,Hutchinson & Knopoff (1978),interference,#B50000,Pure tones
11.763513513513514,-0,Hutch78,Hutchinson & Knopoff (1978),interference,#B50000,Pure tones
11.764014014014014,-0,Hutch78,Hutchinson & Knopoff (1978),interference,#B50000,Pure tones
11.764514514514515,-0,Hutch78,Hutchinson & Knopoff (1978),interference,#B50000,Pure tones
11.765015015015015,-0,Hutch78,Hutchinson & Knopoff (1978),interference,#B50000,Pure tones
11.765515515515515,-0,Hutch78,Hutchinson & Knopoff (1978),interference,#B50000,Pure tones
11.766016016016016,-0,Hutch78,Hutchinson & Knopoff (1978),interference,#B50000,Pure tones
11.766516516516516,-0,Hutch78,Hutchinson & Knopoff (1978),interference,#B50000,Pure tones
11.767017017017016,-0,Hutch78,Hutchinson & Knopoff (1978),interference,#B50000,Pure tones
11.767517517517518,-0,Hutch78,Hutchinson & Knopoff (1978),interference,#B50000,Pure tones
11.768018018018019,-0,Hutch78,Hutchinson & Knopoff (1978),interference,#B50000,Pure tones
11.768518518518519,-0,Hutch78,Hutchinson & Knopoff (1978),interference,#B50000,Pure tones
11.76901901901902,-0,Hutch78,Hutchinson & Knopoff (1978),interference,#B50000,Pure tones
11.76951951951952,-0,Hutch78,Hutchinson & Knopoff (1978),interference,#B50000,Pure tones
11.77002002002002,-0,Hutch78,Hutchinson & Knopoff (1978),interference,#B50000,Pure tones
11.77052052052052,-0,Hutch78,Hutchinson & Knopoff (1978),interference,#B50000,Pure tones
11.77102102102102,-0,Hutch78,Hutchinson & Knopoff (1978),interference,#B50000,Pure tones
11.771521521521521,-0,Hutch78,Hutchinson & Knopoff (1978),interference,#B50000,Pure tones
11.772022022022021,-0,Hutch78,Hutchinson & Knopoff (1978),interference,#B50000,Pure tones
11.772522522522523,-0,Hutch78,Hutchinson & Knopoff (1978),interference,#B50000,Pure tones
11.773023023023024,-0,Hutch78,Hutchinson & Knopoff (1978),interference,#B50000,Pure tones
11.773523523523524,-0,Hutch78,Hutchinson & Knopoff (1978),interference,#B50000,Pure tones
11.774024024024024,-0,Hutch78,Hutchinson & Knopoff (1978),interference,#B50000,Pure tones
11.774524524524525,-0,Hutch78,Hutchinson & Knopoff (1978),interference,#B50000,Pure tones
11.775025025025025,-0,Hutch78,Hutchinson & Knopoff (1978),interference,#B50000,Pure tones
11.775525525525525,-0,Hutch78,Hutchinson & Knopoff (1978),interference,#B50000,Pure tones
11.776026026026026,-0,Hutch78,Hutchinson & Knopoff (1978),interference,#B50000,Pure tones
11.776526526526526,-0,Hutch78,Hutchinson & Knopoff (1978),interference,#B50000,Pure tones
11.777027027027026,-0,Hutch78,Hutchinson & Knopoff (1978),interference,#B50000,Pure tones
11.777527527527528,-0,Hutch78,Hutchinson & Knopoff (1978),interference,#B50000,Pure tones
11.778028028028029,-0,Hutch78,Hutchinson & Knopoff (1978),interference,#B50000,Pure tones
11.778528528528529,-0,Hutch78,Hutchinson & Knopoff (1978),interference,#B50000,Pure tones
11.77902902902903,-0,Hutch78,Hutchinson & Knopoff (1978),interference,#B50000,Pure tones
11.77952952952953,-0,Hutch78,Hutchinson & Knopoff (1978),interference,#B50000,Pure tones
11.78003003003003,-0,Hutch78,Hutchinson & Knopoff (1978),interference,#B50000,Pure tones
11.78053053053053,-0,Hutch78,Hutchinson & Knopoff (1978),interference,#B50000,Pure tones
11.78103103103103,-0,Hutch78,Hutchinson & Knopoff (1978),interference,#B50000,Pure tones
11.781531531531531,-0,Hutch78,Hutchinson & Knopoff (1978),interference,#B50000,Pure tones
11.782032032032031,-0,Hutch78,Hutchinson & Knopoff (1978),interference,#B50000,Pure tones
11.782532532532533,-0,Hutch78,Hutchinson & Knopoff (1978),interference,#B50000,Pure tones
11.783033033033034,-0,Hutch78,Hutchinson & Knopoff (1978),interference,#B50000,Pure tones
11.783533533533534,-0,Hutch78,Hutchinson & Knopoff (1978),interference,#B50000,Pure tones
11.784034034034034,-0,Hutch78,Hutchinson & Knopoff (1978),interference,#B50000,Pure tones
11.784534534534535,-0,Hutch78,Hutchinson & Knopoff (1978),interference,#B50000,Pure tones
11.785035035035035,-0,Hutch78,Hutchinson & Knopoff (1978),interference,#B50000,Pure tones
11.785535535535535,-0,Hutch78,Hutchinson & Knopoff (1978),interference,#B50000,Pure tones
11.786036036036036,-0,Hutch78,Hutchinson & Knopoff (1978),interference,#B50000,Pure tones
11.786536536536536,-0,Hutch78,Hutchinson & Knopoff (1978),interference,#B50000,Pure tones
11.787037037037036,-0,Hutch78,Hutchinson & Knopoff (1978),interference,#B50000,Pure tones
11.787537537537538,-0,Hutch78,Hutchinson & Knopoff (1978),interference,#B50000,Pure tones
11.788038038038039,-0,Hutch78,Hutchinson & Knopoff (1978),interference,#B50000,Pure tones
11.788538538538539,-0,Hutch78,Hutchinson & Knopoff (1978),interference,#B50000,Pure tones
11.78903903903904,-0,Hutch78,Hutchinson & Knopoff (1978),interference,#B50000,Pure tones
11.78953953953954,-0,Hutch78,Hutchinson & Knopoff (1978),interference,#B50000,Pure tones
11.79004004004004,-0,Hutch78,Hutchinson & Knopoff (1978),interference,#B50000,Pure tones
11.79054054054054,-0,Hutch78,Hutchinson & Knopoff (1978),interference,#B50000,Pure tones
11.79104104104104,-0,Hutch78,Hutchinson & Knopoff (1978),interference,#B50000,Pure tones
11.791541541541541,-0,Hutch78,Hutchinson & Knopoff (1978),interference,#B50000,Pure tones
11.792042042042041,-0,Hutch78,Hutchinson & Knopoff (1978),interference,#B50000,Pure tones
11.792542542542543,-0,Hutch78,Hutchinson & Knopoff (1978),interference,#B50000,Pure tones
11.793043043043044,-0,Hutch78,Hutchinson & Knopoff (1978),interference,#B50000,Pure tones
11.793543543543544,-0,Hutch78,Hutchinson & Knopoff (1978),interference,#B50000,Pure tones
11.794044044044044,-0,Hutch78,Hutchinson & Knopoff (1978),interference,#B50000,Pure tones
11.794544544544545,-0,Hutch78,Hutchinson & Knopoff (1978),interference,#B50000,Pure tones
11.795045045045045,-0,Hutch78,Hutchinson & Knopoff (1978),interference,#B50000,Pure tones
11.795545545545545,-0,Hutch78,Hutchinson & Knopoff (1978),interference,#B50000,Pure tones
11.796046046046046,-0,Hutch78,Hutchinson & Knopoff (1978),interference,#B50000,Pure tones
11.796546546546546,-0,Hutch78,Hutchinson & Knopoff (1978),interference,#B50000,Pure tones
11.797047047047046,-0,Hutch78,Hutchinson & Knopoff (1978),interference,#B50000,Pure tones
11.797547547547548,-0,Hutch78,Hutchinson & Knopoff (1978),interference,#B50000,Pure tones
11.798048048048049,-0,Hutch78,Hutchinson & Knopoff (1978),interference,#B50000,Pure tones
11.798548548548549,-0,Hutch78,Hutchinson & Knopoff (1978),interference,#B50000,Pure tones
11.79904904904905,-0,Hutch78,Hutchinson & Knopoff (1978),interference,#B50000,Pure tones
11.79954954954955,-0,Hutch78,Hutchinson & Knopoff (1978),interference,#B50000,Pure tones
11.80005005005005,-0,Hutch78,Hutchinson & Knopoff (1978),interference,#B50000,Pure tones
11.80055055055055,-0,Hutch78,Hutchinson & Knopoff (1978),interference,#B50000,Pure tones
11.80105105105105,-0,Hutch78,Hutchinson & Knopoff (1978),interference,#B50000,Pure tones
11.801551551551551,-0,Hutch78,Hutchinson & Knopoff (1978),interference,#B50000,Pure tones
11.802052052052051,-0,Hutch78,Hutchinson & Knopoff (1978),interference,#B50000,Pure tones
11.802552552552553,-0,Hutch78,Hutchinson & Knopoff (1978),interference,#B50000,Pure tones
11.803053053053054,-0,Hutch78,Hutchinson & Knopoff (1978),interference,#B50000,Pure tones
11.803553553553554,-0,Hutch78,Hutchinson & Knopoff (1978),interference,#B50000,Pure tones
11.804054054054054,-0,Hutch78,Hutchinson & Knopoff (1978),interference,#B50000,Pure tones
11.804554554554555,-0,Hutch78,Hutchinson & Knopoff (1978),interference,#B50000,Pure tones
11.805055055055055,-0,Hutch78,Hutchinson & Knopoff (1978),interference,#B50000,Pure tones
11.805555555555555,-0,Hutch78,Hutchinson & Knopoff (1978),interference,#B50000,Pure tones
11.806056056056056,-0,Hutch78,Hutchinson & Knopoff (1978),interference,#B50000,Pure tones
11.806556556556556,-0,Hutch78,Hutchinson & Knopoff (1978),interference,#B50000,Pure tones
11.807057057057056,-0,Hutch78,Hutchinson & Knopoff (1978),interference,#B50000,Pure tones
11.807557557557558,-0,Hutch78,Hutchinson & Knopoff (1978),interference,#B50000,Pure tones
11.808058058058059,-0,Hutch78,Hutchinson & Knopoff (1978),interference,#B50000,Pure tones
11.808558558558559,-0,Hutch78,Hutchinson & Knopoff (1978),interference,#B50000,Pure tones
11.80905905905906,-0,Hutch78,Hutchinson & Knopoff (1978),interference,#B50000,Pure tones
11.80955955955956,-0,Hutch78,Hutchinson & Knopoff (1978),interference,#B50000,Pure tones
11.81006006006006,-0,Hutch78,Hutchinson & Knopoff (1978),interference,#B50000,Pure tones
11.81056056056056,-0,Hutch78,Hutchinson & Knopoff (1978),interference,#B50000,Pure tones
11.81106106106106,-0,Hutch78,Hutchinson & Knopoff (1978),interference,#B50000,Pure tones
11.811561561561561,-0,Hutch78,Hutchinson & Knopoff (1978),interference,#B50000,Pure tones
11.812062062062061,-0,Hutch78,Hutchinson & Knopoff (1978),interference,#B50000,Pure tones
11.812562562562563,-0,Hutch78,Hutchinson & Knopoff (1978),interference,#B50000,Pure tones
11.813063063063064,-0,Hutch78,Hutchinson & Knopoff (1978),interference,#B50000,Pure tones
11.813563563563564,-0,Hutch78,Hutchinson & Knopoff (1978),interference,#B50000,Pure tones
11.814064064064064,-0,Hutch78,Hutchinson & Knopoff (1978),interference,#B50000,Pure tones
11.814564564564565,-0,Hutch78,Hutchinson & Knopoff (1978),interference,#B50000,Pure tones
11.815065065065065,-0,Hutch78,Hutchinson & Knopoff (1978),interference,#B50000,Pure tones
11.815565565565565,-0,Hutch78,Hutchinson & Knopoff (1978),interference,#B50000,Pure tones
11.816066066066066,-0,Hutch78,Hutchinson & Knopoff (1978),interference,#B50000,Pure tones
11.816566566566566,-0,Hutch78,Hutchinson & Knopoff (1978),interference,#B50000,Pure tones
11.817067067067066,-0,Hutch78,Hutchinson & Knopoff (1978),interference,#B50000,Pure tones
11.817567567567568,-0,Hutch78,Hutchinson & Knopoff (1978),interference,#B50000,Pure tones
11.818068068068069,-0,Hutch78,Hutchinson & Knopoff (1978),interference,#B50000,Pure tones
11.818568568568569,-0,Hutch78,Hutchinson & Knopoff (1978),interference,#B50000,Pure tones
11.81906906906907,-0,Hutch78,Hutchinson & Knopoff (1978),interference,#B50000,Pure tones
11.81956956956957,-0,Hutch78,Hutchinson & Knopoff (1978),interference,#B50000,Pure tones
11.82007007007007,-0,Hutch78,Hutchinson & Knopoff (1978),interference,#B50000,Pure tones
11.82057057057057,-0,Hutch78,Hutchinson & Knopoff (1978),interference,#B50000,Pure tones
11.82107107107107,-0,Hutch78,Hutchinson & Knopoff (1978),interference,#B50000,Pure tones
11.821571571571571,-0,Hutch78,Hutchinson & Knopoff (1978),interference,#B50000,Pure tones
11.822072072072071,-0,Hutch78,Hutchinson & Knopoff (1978),interference,#B50000,Pure tones
11.822572572572573,-0,Hutch78,Hutchinson & Knopoff (1978),interference,#B50000,Pure tones
11.823073073073074,-0,Hutch78,Hutchinson & Knopoff (1978),interference,#B50000,Pure tones
11.823573573573574,-0,Hutch78,Hutchinson & Knopoff (1978),interference,#B50000,Pure tones
11.824074074074074,-0,Hutch78,Hutchinson & Knopoff (1978),interference,#B50000,Pure tones
11.824574574574575,-0,Hutch78,Hutchinson & Knopoff (1978),interference,#B50000,Pure tones
11.825075075075075,-0,Hutch78,Hutchinson & Knopoff (1978),interference,#B50000,Pure tones
11.825575575575575,-0,Hutch78,Hutchinson & Knopoff (1978),interference,#B50000,Pure tones
11.826076076076076,-0,Hutch78,Hutchinson & Knopoff (1978),interference,#B50000,Pure tones
11.826576576576576,-0,Hutch78,Hutchinson & Knopoff (1978),interference,#B50000,Pure tones
11.827077077077076,-0,Hutch78,Hutchinson & Knopoff (1978),interference,#B50000,Pure tones
11.827577577577578,-0,Hutch78,Hutchinson & Knopoff (1978),interference,#B50000,Pure tones
11.828078078078079,-0,Hutch78,Hutchinson & Knopoff (1978),interference,#B50000,Pure tones
11.828578578578579,-0,Hutch78,Hutchinson & Knopoff (1978),interference,#B50000,Pure tones
11.82907907907908,-0,Hutch78,Hutchinson & Knopoff (1978),interference,#B50000,Pure tones
11.82957957957958,-0,Hutch78,Hutchinson & Knopoff (1978),interference,#B50000,Pure tones
11.83008008008008,-0,Hutch78,Hutchinson & Knopoff (1978),interference,#B50000,Pure tones
11.83058058058058,-0,Hutch78,Hutchinson & Knopoff (1978),interference,#B50000,Pure tones
11.83108108108108,-0,Hutch78,Hutchinson & Knopoff (1978),interference,#B50000,Pure tones
11.831581581581581,-0,Hutch78,Hutchinson & Knopoff (1978),interference,#B50000,Pure tones
11.832082082082081,-0,Hutch78,Hutchinson & Knopoff (1978),interference,#B50000,Pure tones
11.832582582582583,-0,Hutch78,Hutchinson & Knopoff (1978),interference,#B50000,Pure tones
11.833083083083084,-0,Hutch78,Hutchinson & Knopoff (1978),interference,#B50000,Pure tones
11.833583583583584,-0,Hutch78,Hutchinson & Knopoff (1978),interference,#B50000,Pure tones
11.834084084084084,-0,Hutch78,Hutchinson & Knopoff (1978),interference,#B50000,Pure tones
11.834584584584585,-0,Hutch78,Hutchinson & Knopoff (1978),interference,#B50000,Pure tones
11.835085085085085,-0,Hutch78,Hutchinson & Knopoff (1978),interference,#B50000,Pure tones
11.835585585585585,-0,Hutch78,Hutchinson & Knopoff (1978),interference,#B50000,Pure tones
11.836086086086086,-0,Hutch78,Hutchinson & Knopoff (1978),interference,#B50000,Pure tones
11.836586586586586,-0,Hutch78,Hutchinson & Knopoff (1978),interference,#B50000,Pure tones
11.837087087087086,-0,Hutch78,Hutchinson & Knopoff (1978),interference,#B50000,Pure tones
11.837587587587588,-0,Hutch78,Hutchinson & Knopoff (1978),interference,#B50000,Pure tones
11.838088088088089,-0,Hutch78,Hutchinson & Knopoff (1978),interference,#B50000,Pure tones
11.838588588588589,-0,Hutch78,Hutchinson & Knopoff (1978),interference,#B50000,Pure tones
11.83908908908909,-0,Hutch78,Hutchinson & Knopoff (1978),interference,#B50000,Pure tones
11.83958958958959,-0,Hutch78,Hutchinson & Knopoff (1978),interference,#B50000,Pure tones
11.84009009009009,-0,Hutch78,Hutchinson & Knopoff (1978),interference,#B50000,Pure tones
11.84059059059059,-0,Hutch78,Hutchinson & Knopoff (1978),interference,#B50000,Pure tones
11.84109109109109,-0,Hutch78,Hutchinson & Knopoff (1978),interference,#B50000,Pure tones
11.841591591591591,-0,Hutch78,Hutchinson & Knopoff (1978),interference,#B50000,Pure tones
11.842092092092091,-0,Hutch78,Hutchinson & Knopoff (1978),interference,#B50000,Pure tones
11.842592592592593,-0,Hutch78,Hutchinson & Knopoff (1978),interference,#B50000,Pure tones
11.843093093093094,-0,Hutch78,Hutchinson & Knopoff (1978),interference,#B50000,Pure tones
11.843593593593594,-0,Hutch78,Hutchinson & Knopoff (1978),interference,#B50000,Pure tones
11.844094094094094,-0,Hutch78,Hutchinson & Knopoff (1978),interference,#B50000,Pure tones
11.844594594594595,-0,Hutch78,Hutchinson & Knopoff (1978),interference,#B50000,Pure tones
11.845095095095095,-0,Hutch78,Hutchinson & Knopoff (1978),interference,#B50000,Pure tones
11.845595595595595,-0,Hutch78,Hutchinson & Knopoff (1978),interference,#B50000,Pure tones
11.846096096096096,-0,Hutch78,Hutchinson & Knopoff (1978),interference,#B50000,Pure tones
11.846596596596596,-0,Hutch78,Hutchinson & Knopoff (1978),interference,#B50000,Pure tones
11.847097097097096,-0,Hutch78,Hutchinson & Knopoff (1978),interference,#B50000,Pure tones
11.847597597597598,-0,Hutch78,Hutchinson & Knopoff (1978),interference,#B50000,Pure tones
11.848098098098099,-0,Hutch78,Hutchinson & Knopoff (1978),interference,#B50000,Pure tones
11.848598598598599,-0,Hutch78,Hutchinson & Knopoff (1978),interference,#B50000,Pure tones
11.8490990990991,-0,Hutch78,Hutchinson & Knopoff (1978),interference,#B50000,Pure tones
11.8495995995996,-0,Hutch78,Hutchinson & Knopoff (1978),interference,#B50000,Pure tones
11.8501001001001,-0,Hutch78,Hutchinson & Knopoff (1978),interference,#B50000,Pure tones
11.8506006006006,-0,Hutch78,Hutchinson & Knopoff (1978),interference,#B50000,Pure tones
11.8511011011011,-0,Hutch78,Hutchinson & Knopoff (1978),interference,#B50000,Pure tones
11.851601601601601,-0,Hutch78,Hutchinson & Knopoff (1978),interference,#B50000,Pure tones
11.852102102102101,-0,Hutch78,Hutchinson & Knopoff (1978),interference,#B50000,Pure tones
11.852602602602603,-0,Hutch78,Hutchinson & Knopoff (1978),interference,#B50000,Pure tones
11.853103103103104,-0,Hutch78,Hutchinson & Knopoff (1978),interference,#B50000,Pure tones
11.853603603603604,-0,Hutch78,Hutchinson & Knopoff (1978),interference,#B50000,Pure tones
11.854104104104104,-0,Hutch78,Hutchinson & Knopoff (1978),interference,#B50000,Pure tones
11.854604604604605,-0,Hutch78,Hutchinson & Knopoff (1978),interference,#B50000,Pure tones
11.855105105105105,-0,Hutch78,Hutchinson & Knopoff (1978),interference,#B50000,Pure tones
11.855605605605605,-0,Hutch78,Hutchinson & Knopoff (1978),interference,#B50000,Pure tones
11.856106106106106,-0,Hutch78,Hutchinson & Knopoff (1978),interference,#B50000,Pure tones
11.856606606606606,-0,Hutch78,Hutchinson & Knopoff (1978),interference,#B50000,Pure tones
11.857107107107106,-0,Hutch78,Hutchinson & Knopoff (1978),interference,#B50000,Pure tones
11.857607607607608,-0,Hutch78,Hutchinson & Knopoff (1978),interference,#B50000,Pure tones
11.858108108108109,-0,Hutch78,Hutchinson & Knopoff (1978),interference,#B50000,Pure tones
11.858608608608609,-0,Hutch78,Hutchinson & Knopoff (1978),interference,#B50000,Pure tones
11.85910910910911,-0,Hutch78,Hutchinson & Knopoff (1978),interference,#B50000,Pure tones
11.85960960960961,-0,Hutch78,Hutchinson & Knopoff (1978),interference,#B50000,Pure tones
11.86011011011011,-0,Hutch78,Hutchinson & Knopoff (1978),interference,#B50000,Pure tones
11.86061061061061,-0,Hutch78,Hutchinson & Knopoff (1978),interference,#B50000,Pure tones
11.86111111111111,-0,Hutch78,Hutchinson & Knopoff (1978),interference,#B50000,Pure tones
11.861611611611611,-0,Hutch78,Hutchinson & Knopoff (1978),interference,#B50000,Pure tones
11.862112112112111,-0,Hutch78,Hutchinson & Knopoff (1978),interference,#B50000,Pure tones
11.862612612612613,-0,Hutch78,Hutchinson & Knopoff (1978),interference,#B50000,Pure tones
11.863113113113114,-0,Hutch78,Hutchinson & Knopoff (1978),interference,#B50000,Pure tones
11.863613613613614,-0,Hutch78,Hutchinson & Knopoff (1978),interference,#B50000,Pure tones
11.864114114114114,-0,Hutch78,Hutchinson & Knopoff (1978),interference,#B50000,Pure tones
11.864614614614615,-0,Hutch78,Hutchinson & Knopoff (1978),interference,#B50000,Pure tones
11.865115115115115,-0,Hutch78,Hutchinson & Knopoff (1978),interference,#B50000,Pure tones
11.865615615615615,-0,Hutch78,Hutchinson & Knopoff (1978),interference,#B50000,Pure tones
11.866116116116116,-0,Hutch78,Hutchinson & Knopoff (1978),interference,#B50000,Pure tones
11.866616616616616,-0,Hutch78,Hutchinson & Knopoff (1978),interference,#B50000,Pure tones
11.867117117117116,-0,Hutch78,Hutchinson & Knopoff (1978),interference,#B50000,Pure tones
11.867617617617618,-0,Hutch78,Hutchinson & Knopoff (1978),interference,#B50000,Pure tones
11.868118118118119,-0,Hutch78,Hutchinson & Knopoff (1978),interference,#B50000,Pure tones
11.868618618618619,-0,Hutch78,Hutchinson & Knopoff (1978),interference,#B50000,Pure tones
11.86911911911912,-0,Hutch78,Hutchinson & Knopoff (1978),interference,#B50000,Pure tones
11.86961961961962,-0,Hutch78,Hutchinson & Knopoff (1978),interference,#B50000,Pure tones
11.87012012012012,-0,Hutch78,Hutchinson & Knopoff (1978),interference,#B50000,Pure tones
11.87062062062062,-0,Hutch78,Hutchinson & Knopoff (1978),interference,#B50000,Pure tones
11.87112112112112,-0,Hutch78,Hutchinson & Knopoff (1978),interference,#B50000,Pure tones
11.871621621621621,-0,Hutch78,Hutchinson & Knopoff (1978),interference,#B50000,Pure tones
11.872122122122121,-0,Hutch78,Hutchinson & Knopoff (1978),interference,#B50000,Pure tones
11.872622622622623,-0,Hutch78,Hutchinson & Knopoff (1978),interference,#B50000,Pure tones
11.873123123123124,-0,Hutch78,Hutchinson & Knopoff (1978),interference,#B50000,Pure tones
11.873623623623624,-0,Hutch78,Hutchinson & Knopoff (1978),interference,#B50000,Pure tones
11.874124124124124,-0,Hutch78,Hutchinson & Knopoff (1978),interference,#B50000,Pure tones
11.874624624624625,-0,Hutch78,Hutchinson & Knopoff (1978),interference,#B50000,Pure tones
11.875125125125125,-0,Hutch78,Hutchinson & Knopoff (1978),interference,#B50000,Pure tones
11.875625625625625,-0,Hutch78,Hutchinson & Knopoff (1978),interference,#B50000,Pure tones
11.876126126126126,-0,Hutch78,Hutchinson & Knopoff (1978),interference,#B50000,Pure tones
11.876626626626626,-0,Hutch78,Hutchinson & Knopoff (1978),interference,#B50000,Pure tones
11.877127127127126,-0,Hutch78,Hutchinson & Knopoff (1978),interference,#B50000,Pure tones
11.877627627627628,-0,Hutch78,Hutchinson & Knopoff (1978),interference,#B50000,Pure tones
11.878128128128129,-0,Hutch78,Hutchinson & Knopoff (1978),interference,#B50000,Pure tones
11.87862862862863,-0,Hutch78,Hutchinson & Knopoff (1978),interference,#B50000,Pure tones
11.87912912912913,-0,Hutch78,Hutchinson & Knopoff (1978),interference,#B50000,Pure tones
11.87962962962963,-0,Hutch78,Hutchinson & Knopoff (1978),interference,#B50000,Pure tones
11.88013013013013,-0,Hutch78,Hutchinson & Knopoff (1978),interference,#B50000,Pure tones
11.88063063063063,-0,Hutch78,Hutchinson & Knopoff (1978),interference,#B50000,Pure tones
11.88113113113113,-0,Hutch78,Hutchinson & Knopoff (1978),interference,#B50000,Pure tones
11.881631631631631,-0,Hutch78,Hutchinson & Knopoff (1978),interference,#B50000,Pure tones
11.882132132132131,-0,Hutch78,Hutchinson & Knopoff (1978),interference,#B50000,Pure tones
11.882632632632633,-0,Hutch78,Hutchinson & Knopoff (1978),interference,#B50000,Pure tones
11.883133133133134,-0,Hutch78,Hutchinson & Knopoff (1978),interference,#B50000,Pure tones
11.883633633633634,-0,Hutch78,Hutchinson & Knopoff (1978),interference,#B50000,Pure tones
11.884134134134134,-0,Hutch78,Hutchinson & Knopoff (1978),interference,#B50000,Pure tones
11.884634634634635,-0,Hutch78,Hutchinson & Knopoff (1978),interference,#B50000,Pure tones
11.885135135135135,-0,Hutch78,Hutchinson & Knopoff (1978),interference,#B50000,Pure tones
11.885635635635635,-0,Hutch78,Hutchinson & Knopoff (1978),interference,#B50000,Pure tones
11.886136136136136,-0,Hutch78,Hutchinson & Knopoff (1978),interference,#B50000,Pure tones
11.886636636636636,-0,Hutch78,Hutchinson & Knopoff (1978),interference,#B50000,Pure tones
11.887137137137136,-0,Hutch78,Hutchinson & Knopoff (1978),interference,#B50000,Pure tones
11.887637637637638,-0,Hutch78,Hutchinson & Knopoff (1978),interference,#B50000,Pure tones
11.888138138138139,-0,Hutch78,Hutchinson & Knopoff (1978),interference,#B50000,Pure tones
11.88863863863864,-0,Hutch78,Hutchinson & Knopoff (1978),interference,#B50000,Pure tones
11.88913913913914,-0,Hutch78,Hutchinson & Knopoff (1978),interference,#B50000,Pure tones
11.88963963963964,-0,Hutch78,Hutchinson & Knopoff (1978),interference,#B50000,Pure tones
11.89014014014014,-0,Hutch78,Hutchinson & Knopoff (1978),interference,#B50000,Pure tones
11.89064064064064,-0,Hutch78,Hutchinson & Knopoff (1978),interference,#B50000,Pure tones
11.89114114114114,-0,Hutch78,Hutchinson & Knopoff (1978),interference,#B50000,Pure tones
11.891641641641641,-0,Hutch78,Hutchinson & Knopoff (1978),interference,#B50000,Pure tones
11.892142142142141,-0,Hutch78,Hutchinson & Knopoff (1978),interference,#B50000,Pure tones
11.892642642642643,-0,Hutch78,Hutchinson & Knopoff (1978),interference,#B50000,Pure tones
11.893143143143144,-0,Hutch78,Hutchinson & Knopoff (1978),interference,#B50000,Pure tones
11.893643643643644,-0,Hutch78,Hutchinson & Knopoff (1978),interference,#B50000,Pure tones
11.894144144144144,-0,Hutch78,Hutchinson & Knopoff (1978),interference,#B50000,Pure tones
11.894644644644645,-0,Hutch78,Hutchinson & Knopoff (1978),interference,#B50000,Pure tones
11.895145145145145,-0,Hutch78,Hutchinson & Knopoff (1978),interference,#B50000,Pure tones
11.895645645645645,-0,Hutch78,Hutchinson & Knopoff (1978),interference,#B50000,Pure tones
11.896146146146146,-0,Hutch78,Hutchinson & Knopoff (1978),interference,#B50000,Pure tones
11.896646646646646,-0,Hutch78,Hutchinson & Knopoff (1978),interference,#B50000,Pure tones
11.897147147147146,-0,Hutch78,Hutchinson & Knopoff (1978),interference,#B50000,Pure tones
11.897647647647648,-0,Hutch78,Hutchinson & Knopoff (1978),interference,#B50000,Pure tones
11.898148148148149,-0,Hutch78,Hutchinson & Knopoff (1978),interference,#B50000,Pure tones
11.89864864864865,-0,Hutch78,Hutchinson & Knopoff (1978),interference,#B50000,Pure tones
11.89914914914915,-0,Hutch78,Hutchinson & Knopoff (1978),interference,#B50000,Pure tones
11.89964964964965,-0,Hutch78,Hutchinson & Knopoff (1978),interference,#B50000,Pure tones
11.90015015015015,-0,Hutch78,Hutchinson & Knopoff (1978),interference,#B50000,Pure tones
11.90065065065065,-0,Hutch78,Hutchinson & Knopoff (1978),interference,#B50000,Pure tones
11.90115115115115,-0,Hutch78,Hutchinson & Knopoff (1978),interference,#B50000,Pure tones
11.901651651651651,-0,Hutch78,Hutchinson & Knopoff (1978),interference,#B50000,Pure tones
11.902152152152151,-0,Hutch78,Hutchinson & Knopoff (1978),interference,#B50000,Pure tones
11.902652652652653,-0,Hutch78,Hutchinson & Knopoff (1978),interference,#B50000,Pure tones
11.903153153153154,-0,Hutch78,Hutchinson & Knopoff (1978),interference,#B50000,Pure tones
11.903653653653654,-0,Hutch78,Hutchinson & Knopoff (1978),interference,#B50000,Pure tones
11.904154154154154,-0,Hutch78,Hutchinson & Knopoff (1978),interference,#B50000,Pure tones
11.904654654654655,-0,Hutch78,Hutchinson & Knopoff (1978),interference,#B50000,Pure tones
11.905155155155155,-0,Hutch78,Hutchinson & Knopoff (1978),interference,#B50000,Pure tones
11.905655655655655,-0,Hutch78,Hutchinson & Knopoff (1978),interference,#B50000,Pure tones
11.906156156156156,-0,Hutch78,Hutchinson & Knopoff (1978),interference,#B50000,Pure tones
11.906656656656656,-0,Hutch78,Hutchinson & Knopoff (1978),interference,#B50000,Pure tones
11.907157157157156,-0,Hutch78,Hutchinson & Knopoff (1978),interference,#B50000,Pure tones
11.907657657657658,-0,Hutch78,Hutchinson & Knopoff (1978),interference,#B50000,Pure tones
11.908158158158159,-0,Hutch78,Hutchinson & Knopoff (1978),interference,#B50000,Pure tones
11.90865865865866,-0,Hutch78,Hutchinson & Knopoff (1978),interference,#B50000,Pure tones
11.90915915915916,-0,Hutch78,Hutchinson & Knopoff (1978),interference,#B50000,Pure tones
11.90965965965966,-0,Hutch78,Hutchinson & Knopoff (1978),interference,#B50000,Pure tones
11.91016016016016,-0,Hutch78,Hutchinson & Knopoff (1978),interference,#B50000,Pure tones
11.91066066066066,-0,Hutch78,Hutchinson & Knopoff (1978),interference,#B50000,Pure tones
11.91116116116116,-0,Hutch78,Hutchinson & Knopoff (1978),interference,#B50000,Pure tones
11.911661661661661,-0,Hutch78,Hutchinson & Knopoff (1978),interference,#B50000,Pure tones
11.912162162162161,-0,Hutch78,Hutchinson & Knopoff (1978),interference,#B50000,Pure tones
11.912662662662663,-0,Hutch78,Hutchinson & Knopoff (1978),interference,#B50000,Pure tones
11.913163163163164,-0,Hutch78,Hutchinson & Knopoff (1978),interference,#B50000,Pure tones
11.913663663663664,-0,Hutch78,Hutchinson & Knopoff (1978),interference,#B50000,Pure tones
11.914164164164164,-0,Hutch78,Hutchinson & Knopoff (1978),interference,#B50000,Pure tones
11.914664664664665,-0,Hutch78,Hutchinson & Knopoff (1978),interference,#B50000,Pure tones
11.915165165165165,-0,Hutch78,Hutchinson & Knopoff (1978),interference,#B50000,Pure tones
11.915665665665665,-0,Hutch78,Hutchinson & Knopoff (1978),interference,#B50000,Pure tones
11.916166166166166,-0,Hutch78,Hutchinson & Knopoff (1978),interference,#B50000,Pure tones
11.916666666666666,-0,Hutch78,Hutchinson & Knopoff (1978),interference,#B50000,Pure tones
11.917167167167166,-0,Hutch78,Hutchinson & Knopoff (1978),interference,#B50000,Pure tones
11.917667667667668,-0,Hutch78,Hutchinson & Knopoff (1978),interference,#B50000,Pure tones
11.918168168168169,-0,Hutch78,Hutchinson & Knopoff (1978),interference,#B50000,Pure tones
11.91866866866867,-0,Hutch78,Hutchinson & Knopoff (1978),interference,#B50000,Pure tones
11.91916916916917,-0,Hutch78,Hutchinson & Knopoff (1978),interference,#B50000,Pure tones
11.91966966966967,-0,Hutch78,Hutchinson & Knopoff (1978),interference,#B50000,Pure tones
11.92017017017017,-0,Hutch78,Hutchinson & Knopoff (1978),interference,#B50000,Pure tones
11.92067067067067,-0,Hutch78,Hutchinson & Knopoff (1978),interference,#B50000,Pure tones
11.92117117117117,-0,Hutch78,Hutchinson & Knopoff (1978),interference,#B50000,Pure tones
11.921671671671671,-0,Hutch78,Hutchinson & Knopoff (1978),interference,#B50000,Pure tones
11.922172172172171,-0,Hutch78,Hutchinson & Knopoff (1978),interference,#B50000,Pure tones
11.922672672672673,-0,Hutch78,Hutchinson & Knopoff (1978),interference,#B50000,Pure tones
11.923173173173174,-0,Hutch78,Hutchinson & Knopoff (1978),interference,#B50000,Pure tones
11.923673673673674,-0,Hutch78,Hutchinson & Knopoff (1978),interference,#B50000,Pure tones
11.924174174174174,-0,Hutch78,Hutchinson & Knopoff (1978),interference,#B50000,Pure tones
11.924674674674675,-0,Hutch78,Hutchinson & Knopoff (1978),interference,#B50000,Pure tones
11.925175175175175,-0,Hutch78,Hutchinson & Knopoff (1978),interference,#B50000,Pure tones
11.925675675675675,-0,Hutch78,Hutchinson & Knopoff (1978),interference,#B50000,Pure tones
11.926176176176176,-0,Hutch78,Hutchinson & Knopoff (1978),interference,#B50000,Pure tones
11.926676676676676,-0,Hutch78,Hutchinson & Knopoff (1978),interference,#B50000,Pure tones
11.927177177177176,-0,Hutch78,Hutchinson & Knopoff (1978),interference,#B50000,Pure tones
11.927677677677679,-0,Hutch78,Hutchinson & Knopoff (1978),interference,#B50000,Pure tones
11.928178178178179,-0,Hutch78,Hutchinson & Knopoff (1978),interference,#B50000,Pure tones
11.92867867867868,-0,Hutch78,Hutchinson & Knopoff (1978),interference,#B50000,Pure tones
11.92917917917918,-0,Hutch78,Hutchinson & Knopoff (1978),interference,#B50000,Pure tones
11.92967967967968,-0,Hutch78,Hutchinson & Knopoff (1978),interference,#B50000,Pure tones
11.93018018018018,-0,Hutch78,Hutchinson & Knopoff (1978),interference,#B50000,Pure tones
11.93068068068068,-0,Hutch78,Hutchinson & Knopoff (1978),interference,#B50000,Pure tones
11.93118118118118,-0,Hutch78,Hutchinson & Knopoff (1978),interference,#B50000,Pure tones
11.931681681681681,-0,Hutch78,Hutchinson & Knopoff (1978),interference,#B50000,Pure tones
11.932182182182181,-0,Hutch78,Hutchinson & Knopoff (1978),interference,#B50000,Pure tones
11.932682682682684,-0,Hutch78,Hutchinson & Knopoff (1978),interference,#B50000,Pure tones
11.933183183183184,-0,Hutch78,Hutchinson & Knopoff (1978),interference,#B50000,Pure tones
11.933683683683684,-0,Hutch78,Hutchinson & Knopoff (1978),interference,#B50000,Pure tones
11.934184184184184,-0,Hutch78,Hutchinson & Knopoff (1978),interference,#B50000,Pure tones
11.934684684684685,-0,Hutch78,Hutchinson & Knopoff (1978),interference,#B50000,Pure tones
11.935185185185185,-0,Hutch78,Hutchinson & Knopoff (1978),interference,#B50000,Pure tones
11.935685685685685,-0,Hutch78,Hutchinson & Knopoff (1978),interference,#B50000,Pure tones
11.936186186186186,-0,Hutch78,Hutchinson & Knopoff (1978),interference,#B50000,Pure tones
11.936686686686686,-0,Hutch78,Hutchinson & Knopoff (1978),interference,#B50000,Pure tones
11.937187187187186,-0,Hutch78,Hutchinson & Knopoff (1978),interference,#B50000,Pure tones
11.937687687687689,-0,Hutch78,Hutchinson & Knopoff (1978),interference,#B50000,Pure tones
11.938188188188189,-0,Hutch78,Hutchinson & Knopoff (1978),interference,#B50000,Pure tones
11.93868868868869,-0,Hutch78,Hutchinson & Knopoff (1978),interference,#B50000,Pure tones
11.93918918918919,-0,Hutch78,Hutchinson & Knopoff (1978),interference,#B50000,Pure tones
11.93968968968969,-0,Hutch78,Hutchinson & Knopoff (1978),interference,#B50000,Pure tones
11.94019019019019,-0,Hutch78,Hutchinson & Knopoff (1978),interference,#B50000,Pure tones
11.94069069069069,-0,Hutch78,Hutchinson & Knopoff (1978),interference,#B50000,Pure tones
11.94119119119119,-0,Hutch78,Hutchinson & Knopoff (1978),interference,#B50000,Pure tones
11.941691691691691,-0,Hutch78,Hutchinson & Knopoff (1978),interference,#B50000,Pure tones
11.942192192192191,-0,Hutch78,Hutchinson & Knopoff (1978),interference,#B50000,Pure tones
11.942692692692694,-0,Hutch78,Hutchinson & Knopoff (1978),interference,#B50000,Pure tones
11.943193193193194,-0,Hutch78,Hutchinson & Knopoff (1978),interference,#B50000,Pure tones
11.943693693693694,-0,Hutch78,Hutchinson & Knopoff (1978),interference,#B50000,Pure tones
11.944194194194194,-0,Hutch78,Hutchinson & Knopoff (1978),interference,#B50000,Pure tones
11.944694694694695,-0,Hutch78,Hutchinson & Knopoff (1978),interference,#B50000,Pure tones
11.945195195195195,-0,Hutch78,Hutchinson & Knopoff (1978),interference,#B50000,Pure tones
11.945695695695695,-0,Hutch78,Hutchinson & Knopoff (1978),interference,#B50000,Pure tones
11.946196196196196,-0,Hutch78,Hutchinson & Knopoff (1978),interference,#B50000,Pure tones
11.946696696696696,-0,Hutch78,Hutchinson & Knopoff (1978),interference,#B50000,Pure tones
11.947197197197196,-0,Hutch78,Hutchinson & Knopoff (1978),interference,#B50000,Pure tones
11.947697697697699,-0,Hutch78,Hutchinson & Knopoff (1978),interference,#B50000,Pure tones
11.948198198198199,-0,Hutch78,Hutchinson & Knopoff (1978),interference,#B50000,Pure tones
11.9486986986987,-0,Hutch78,Hutchinson & Knopoff (1978),interference,#B50000,Pure tones
11.9491991991992,-0,Hutch78,Hutchinson & Knopoff (1978),interference,#B50000,Pure tones
11.9496996996997,-0,Hutch78,Hutchinson & Knopoff (1978),interference,#B50000,Pure tones
11.9502002002002,-0,Hutch78,Hutchinson & Knopoff (1978),interference,#B50000,Pure tones
11.9507007007007,-0,Hutch78,Hutchinson & Knopoff (1978),interference,#B50000,Pure tones
11.9512012012012,-0,Hutch78,Hutchinson & Knopoff (1978),interference,#B50000,Pure tones
11.951701701701701,-0,Hutch78,Hutchinson & Knopoff (1978),interference,#B50000,Pure tones
11.952202202202201,-0,Hutch78,Hutchinson & Knopoff (1978),interference,#B50000,Pure tones
11.952702702702704,-0,Hutch78,Hutchinson & Knopoff (1978),interference,#B50000,Pure tones
11.953203203203204,-0,Hutch78,Hutchinson & Knopoff (1978),interference,#B50000,Pure tones
11.953703703703704,-0,Hutch78,Hutchinson & Knopoff (1978),interference,#B50000,Pure tones
11.954204204204204,-0,Hutch78,Hutchinson & Knopoff (1978),interference,#B50000,Pure tones
11.954704704704705,-0,Hutch78,Hutchinson & Knopoff (1978),interference,#B50000,Pure tones
11.955205205205205,-0,Hutch78,Hutchinson & Knopoff (1978),interference,#B50000,Pure tones
11.955705705705705,-0,Hutch78,Hutchinson & Knopoff (1978),interference,#B50000,Pure tones
11.956206206206206,-0,Hutch78,Hutchinson & Knopoff (1978),interference,#B50000,Pure tones
11.956706706706706,-0,Hutch78,Hutchinson & Knopoff (1978),interference,#B50000,Pure tones
11.957207207207206,-0,Hutch78,Hutchinson & Knopoff (1978),interference,#B50000,Pure tones
11.957707707707709,-0,Hutch78,Hutchinson & Knopoff (1978),interference,#B50000,Pure tones
11.958208208208209,-0,Hutch78,Hutchinson & Knopoff (1978),interference,#B50000,Pure tones
11.95870870870871,-0,Hutch78,Hutchinson & Knopoff (1978),interference,#B50000,Pure tones
11.95920920920921,-0,Hutch78,Hutchinson & Knopoff (1978),interference,#B50000,Pure tones
11.95970970970971,-0,Hutch78,Hutchinson & Knopoff (1978),interference,#B50000,Pure tones
11.96021021021021,-0,Hutch78,Hutchinson & Knopoff (1978),interference,#B50000,Pure tones
11.96071071071071,-0,Hutch78,Hutchinson & Knopoff (1978),interference,#B50000,Pure tones
11.96121121121121,-0,Hutch78,Hutchinson & Knopoff (1978),interference,#B50000,Pure tones
11.961711711711711,-0,Hutch78,Hutchinson & Knopoff (1978),interference,#B50000,Pure tones
11.962212212212211,-0,Hutch78,Hutchinson & Knopoff (1978),interference,#B50000,Pure tones
11.962712712712714,-0,Hutch78,Hutchinson & Knopoff (1978),interference,#B50000,Pure tones
11.963213213213214,-0,Hutch78,Hutchinson & Knopoff (1978),interference,#B50000,Pure tones
11.963713713713714,-0,Hutch78,Hutchinson & Knopoff (1978),interference,#B50000,Pure tones
11.964214214214214,-0,Hutch78,Hutchinson & Knopoff (1978),interference,#B50000,Pure tones
11.964714714714715,-0,Hutch78,Hutchinson & Knopoff (1978),interference,#B50000,Pure tones
11.965215215215215,-0,Hutch78,Hutchinson & Knopoff (1978),interference,#B50000,Pure tones
11.965715715715715,-0,Hutch78,Hutchinson & Knopoff (1978),interference,#B50000,Pure tones
11.966216216216216,-0,Hutch78,Hutchinson & Knopoff (1978),interference,#B50000,Pure tones
11.966716716716716,-0,Hutch78,Hutchinson & Knopoff (1978),interference,#B50000,Pure tones
11.967217217217216,-0,Hutch78,Hutchinson & Knopoff (1978),interference,#B50000,Pure tones
11.967717717717719,-0,Hutch78,Hutchinson & Knopoff (1978),interference,#B50000,Pure tones
11.968218218218219,-0,Hutch78,Hutchinson & Knopoff (1978),interference,#B50000,Pure tones
11.96871871871872,-0,Hutch78,Hutchinson & Knopoff (1978),interference,#B50000,Pure tones
11.96921921921922,-0,Hutch78,Hutchinson & Knopoff (1978),interference,#B50000,Pure tones
11.96971971971972,-0,Hutch78,Hutchinson & Knopoff (1978),interference,#B50000,Pure tones
11.97022022022022,-0,Hutch78,Hutchinson & Knopoff (1978),interference,#B50000,Pure tones
11.97072072072072,-0,Hutch78,Hutchinson & Knopoff (1978),interference,#B50000,Pure tones
11.97122122122122,-0,Hutch78,Hutchinson & Knopoff (1978),interference,#B50000,Pure tones
11.971721721721721,-0,Hutch78,Hutchinson & Knopoff (1978),interference,#B50000,Pure tones
11.972222222222221,-0,Hutch78,Hutchinson & Knopoff (1978),interference,#B50000,Pure tones
11.972722722722724,-0,Hutch78,Hutchinson & Knopoff (1978),interference,#B50000,Pure tones
11.973223223223224,-0,Hutch78,Hutchinson & Knopoff (1978),interference,#B50000,Pure tones
11.973723723723724,-0,Hutch78,Hutchinson & Knopoff (1978),interference,#B50000,Pure tones
11.974224224224224,-0,Hutch78,Hutchinson & Knopoff (1978),interference,#B50000,Pure tones
11.974724724724725,-0,Hutch78,Hutchinson & Knopoff (1978),interference,#B50000,Pure tones
11.975225225225225,-0,Hutch78,Hutchinson & Knopoff (1978),interference,#B50000,Pure tones
11.975725725725725,-0,Hutch78,Hutchinson & Knopoff (1978),interference,#B50000,Pure tones
11.976226226226226,-0,Hutch78,Hutchinson & Knopoff (1978),interference,#B50000,Pure tones
11.976726726726726,-0,Hutch78,Hutchinson & Knopoff (1978),interference,#B50000,Pure tones
11.977227227227226,-0,Hutch78,Hutchinson & Knopoff (1978),interference,#B50000,Pure tones
11.977727727727729,-0,Hutch78,Hutchinson & Knopoff (1978),interference,#B50000,Pure tones
11.978228228228229,-0,Hutch78,Hutchinson & Knopoff (1978),interference,#B50000,Pure tones
11.97872872872873,-0,Hutch78,Hutchinson & Knopoff (1978),interference,#B50000,Pure tones
11.97922922922923,-0,Hutch78,Hutchinson & Knopoff (1978),interference,#B50000,Pure tones
11.97972972972973,-0,Hutch78,Hutchinson & Knopoff (1978),interference,#B50000,Pure tones
11.98023023023023,-0,Hutch78,Hutchinson & Knopoff (1978),interference,#B50000,Pure tones
11.98073073073073,-0,Hutch78,Hutchinson & Knopoff (1978),interference,#B50000,Pure tones
11.98123123123123,-0,Hutch78,Hutchinson & Knopoff (1978),interference,#B50000,Pure tones
11.981731731731731,-0,Hutch78,Hutchinson & Knopoff (1978),interference,#B50000,Pure tones
11.982232232232231,-0,Hutch78,Hutchinson & Knopoff (1978),interference,#B50000,Pure tones
11.982732732732734,-0,Hutch78,Hutchinson & Knopoff (1978),interference,#B50000,Pure tones
11.983233233233234,-0,Hutch78,Hutchinson & Knopoff (1978),interference,#B50000,Pure tones
11.983733733733734,-0,Hutch78,Hutchinson & Knopoff (1978),interference,#B50000,Pure tones
11.984234234234235,-0,Hutch78,Hutchinson & Knopoff (1978),interference,#B50000,Pure tones
11.984734734734735,-0,Hutch78,Hutchinson & Knopoff (1978),interference,#B50000,Pure tones
11.985235235235235,-0,Hutch78,Hutchinson & Knopoff (1978),interference,#B50000,Pure tones
11.985735735735735,-0,Hutch78,Hutchinson & Knopoff (1978),interference,#B50000,Pure tones
11.986236236236236,-0,Hutch78,Hutchinson & Knopoff (1978),interference,#B50000,Pure tones
11.986736736736736,-0,Hutch78,Hutchinson & Knopoff (1978),interference,#B50000,Pure tones
11.987237237237236,-0,Hutch78,Hutchinson & Knopoff (1978),interference,#B50000,Pure tones
11.987737737737739,-0,Hutch78,Hutchinson & Knopoff (1978),interference,#B50000,Pure tones
11.988238238238239,-0,Hutch78,Hutchinson & Knopoff (1978),interference,#B50000,Pure tones
11.98873873873874,-0,Hutch78,Hutchinson & Knopoff (1978),interference,#B50000,Pure tones
11.98923923923924,-0,Hutch78,Hutchinson & Knopoff (1978),interference,#B50000,Pure tones
11.98973973973974,-0,Hutch78,Hutchinson & Knopoff (1978),interference,#B50000,Pure tones
11.99024024024024,-0,Hutch78,Hutchinson & Knopoff (1978),interference,#B50000,Pure tones
11.99074074074074,-0,Hutch78,Hutchinson & Knopoff (1978),interference,#B50000,Pure tones
11.99124124124124,-0,Hutch78,Hutchinson & Knopoff (1978),interference,#B50000,Pure tones
11.991741741741741,-0,Hutch78,Hutchinson & Knopoff (1978),interference,#B50000,Pure tones
11.992242242242241,-0,Hutch78,Hutchinson & Knopoff (1978),interference,#B50000,Pure tones
11.992742742742744,-0,Hutch78,Hutchinson & Knopoff (1978),interference,#B50000,Pure tones
11.993243243243244,-0,Hutch78,Hutchinson & Knopoff (1978),interference,#B50000,Pure tones
11.993743743743744,-0,Hutch78,Hutchinson & Knopoff (1978),interference,#B50000,Pure tones
11.994244244244245,-0,Hutch78,Hutchinson & Knopoff (1978),interference,#B50000,Pure tones
11.994744744744745,-0,Hutch78,Hutchinson & Knopoff (1978),interference,#B50000,Pure tones
11.995245245245245,-0,Hutch78,Hutchinson & Knopoff (1978),interference,#B50000,Pure tones
11.995745745745745,-0,Hutch78,Hutchinson & Knopoff (1978),interference,#B50000,Pure tones
11.996246246246246,-0,Hutch78,Hutchinson & Knopoff (1978),interference,#B50000,Pure tones
11.996746746746746,-0,Hutch78,Hutchinson & Knopoff (1978),interference,#B50000,Pure tones
11.997247247247246,-0,Hutch78,Hutchinson & Knopoff (1978),interference,#B50000,Pure tones
11.997747747747749,-0,Hutch78,Hutchinson & Knopoff (1978),interference,#B50000,Pure tones
11.998248248248249,-0,Hutch78,Hutchinson & Knopoff (1978),interference,#B50000,Pure tones
11.99874874874875,-0,Hutch78,Hutchinson & Knopoff (1978),interference,#B50000,Pure tones
11.99924924924925,-0,Hutch78,Hutchinson & Knopoff (1978),interference,#B50000,Pure tones
11.99974974974975,-0,Hutch78,Hutchinson & Knopoff (1978),interference,#B50000,Pure tones
12.00025025025025,-0,Hutch78,Hutchinson & Knopoff (1978),interference,#B50000,Pure tones
12.00075075075075,-0,Hutch78,Hutchinson & Knopoff (1978),interference,#B50000,Pure tones
12.00125125125125,-0,Hutch78,Hutchinson & Knopoff (1978),interference,#B50000,Pure tones
12.001751751751751,-0,Hutch78,Hutchinson & Knopoff (1978),interference,#B50000,Pure tones
12.002252252252251,-0,Hutch78,Hutchinson & Knopoff (1978),interference,#B50000,Pure tones
12.002752752752754,-0,Hutch78,Hutchinson & Knopoff (1978),interference,#B50000,Pure tones
12.003253253253254,-0,Hutch78,Hutchinson & Knopoff (1978),interference,#B50000,Pure tones
12.003753753753754,-0,Hutch78,Hutchinson & Knopoff (1978),interference,#B50000,Pure tones
12.004254254254255,-0,Hutch78,Hutchinson & Knopoff (1978),interference,#B50000,Pure tones
12.004754754754755,-0,Hutch78,Hutchinson & Knopoff (1978),interference,#B50000,Pure tones
12.005255255255255,-0,Hutch78,Hutchinson & Knopoff (1978),interference,#B50000,Pure tones
12.005755755755755,-0,Hutch78,Hutchinson & Knopoff (1978),interference,#B50000,Pure tones
12.006256256256256,-0,Hutch78,Hutchinson & Knopoff (1978),interference,#B50000,Pure tones
12.006756756756756,-0,Hutch78,Hutchinson & Knopoff (1978),interference,#B50000,Pure tones
12.007257257257256,-0,Hutch78,Hutchinson & Knopoff (1978),interference,#B50000,Pure tones
12.007757757757759,-0,Hutch78,Hutchinson & Knopoff (1978),interference,#B50000,Pure tones
12.008258258258259,-0,Hutch78,Hutchinson & Knopoff (1978),interference,#B50000,Pure tones
12.00875875875876,-0,Hutch78,Hutchinson & Knopoff (1978),interference,#B50000,Pure tones
12.00925925925926,-0,Hutch78,Hutchinson & Knopoff (1978),interference,#B50000,Pure tones
12.00975975975976,-0,Hutch78,Hutchinson & Knopoff (1978),interference,#B50000,Pure tones
12.01026026026026,-0,Hutch78,Hutchinson & Knopoff (1978),interference,#B50000,Pure tones
12.01076076076076,-0,Hutch78,Hutchinson & Knopoff (1978),interference,#B50000,Pure tones
12.01126126126126,-0,Hutch78,Hutchinson & Knopoff (1978),interference,#B50000,Pure tones
12.011761761761761,-0,Hutch78,Hutchinson & Knopoff (1978),interference,#B50000,Pure tones
12.012262262262261,-0,Hutch78,Hutchinson & Knopoff (1978),interference,#B50000,Pure tones
12.012762762762764,-0,Hutch78,Hutchinson & Knopoff (1978),interference,#B50000,Pure tones
12.013263263263264,-0,Hutch78,Hutchinson & Knopoff (1978),interference,#B50000,Pure tones
12.013763763763764,-0,Hutch78,Hutchinson & Knopoff (1978),interference,#B50000,Pure tones
12.014264264264265,-0,Hutch78,Hutchinson & Knopoff (1978),interference,#B50000,Pure tones
12.014764764764765,-0,Hutch78,Hutchinson & Knopoff (1978),interference,#B50000,Pure tones
12.015265265265265,-0,Hutch78,Hutchinson & Knopoff (1978),interference,#B50000,Pure tones
12.015765765765765,-0,Hutch78,Hutchinson & Knopoff (1978),interference,#B50000,Pure tones
12.016266266266266,-0,Hutch78,Hutchinson & Knopoff (1978),interference,#B50000,Pure tones
12.016766766766766,-0,Hutch78,Hutchinson & Knopoff (1978),interference,#B50000,Pure tones
12.017267267267266,-0,Hutch78,Hutchinson & Knopoff (1978),interference,#B50000,Pure tones
12.017767767767769,-0,Hutch78,Hutchinson & Knopoff (1978),interference,#B50000,Pure tones
12.018268268268269,-0,Hutch78,Hutchinson & Knopoff (1978),interference,#B50000,Pure tones
12.01876876876877,-0,Hutch78,Hutchinson & Knopoff (1978),interference,#B50000,Pure tones
12.01926926926927,-0,Hutch78,Hutchinson & Knopoff (1978),interference,#B50000,Pure tones
12.01976976976977,-0,Hutch78,Hutchinson & Knopoff (1978),interference,#B50000,Pure tones
12.02027027027027,-0,Hutch78,Hutchinson & Knopoff (1978),interference,#B50000,Pure tones
12.02077077077077,-0,Hutch78,Hutchinson & Knopoff (1978),interference,#B50000,Pure tones
12.02127127127127,-0,Hutch78,Hutchinson & Knopoff (1978),interference,#B50000,Pure tones
12.021771771771771,-0,Hutch78,Hutchinson & Knopoff (1978),interference,#B50000,Pure tones
12.022272272272271,-0,Hutch78,Hutchinson & Knopoff (1978),interference,#B50000,Pure tones
12.022772772772774,-0,Hutch78,Hutchinson & Knopoff (1978),interference,#B50000,Pure tones
12.023273273273274,-0,Hutch78,Hutchinson & Knopoff (1978),interference,#B50000,Pure tones
12.023773773773774,-0,Hutch78,Hutchinson & Knopoff (1978),interference,#B50000,Pure tones
12.024274274274275,-0,Hutch78,Hutchinson & Knopoff (1978),interference,#B50000,Pure tones
12.024774774774775,-0,Hutch78,Hutchinson & Knopoff (1978),interference,#B50000,Pure tones
12.025275275275275,-0,Hutch78,Hutchinson & Knopoff (1978),interference,#B50000,Pure tones
12.025775775775776,-0,Hutch78,Hutchinson & Knopoff (1978),interference,#B50000,Pure tones
12.026276276276276,-0,Hutch78,Hutchinson & Knopoff (1978),interference,#B50000,Pure tones
12.026776776776776,-0,Hutch78,Hutchinson & Knopoff (1978),interference,#B50000,Pure tones
12.027277277277276,-0,Hutch78,Hutchinson & Knopoff (1978),interference,#B50000,Pure tones
12.027777777777779,-0,Hutch78,Hutchinson & Knopoff (1978),interference,#B50000,Pure tones
12.028278278278279,-0,Hutch78,Hutchinson & Knopoff (1978),interference,#B50000,Pure tones
12.02877877877878,-0,Hutch78,Hutchinson & Knopoff (1978),interference,#B50000,Pure tones
12.02927927927928,-0,Hutch78,Hutchinson & Knopoff (1978),interference,#B50000,Pure tones
12.02977977977978,-0,Hutch78,Hutchinson & Knopoff (1978),interference,#B50000,Pure tones
12.03028028028028,-0,Hutch78,Hutchinson & Knopoff (1978),interference,#B50000,Pure tones
12.03078078078078,-0,Hutch78,Hutchinson & Knopoff (1978),interference,#B50000,Pure tones
12.03128128128128,-0,Hutch78,Hutchinson & Knopoff (1978),interference,#B50000,Pure tones
12.031781781781781,-0,Hutch78,Hutchinson & Knopoff (1978),interference,#B50000,Pure tones
12.032282282282281,-0,Hutch78,Hutchinson & Knopoff (1978),interference,#B50000,Pure tones
12.032782782782784,-0,Hutch78,Hutchinson & Knopoff (1978),interference,#B50000,Pure tones
12.033283283283284,-0,Hutch78,Hutchinson & Knopoff (1978),interference,#B50000,Pure tones
12.033783783783784,-0,Hutch78,Hutchinson & Knopoff (1978),interference,#B50000,Pure tones
12.034284284284285,-0,Hutch78,Hutchinson & Knopoff (1978),interference,#B50000,Pure tones
12.034784784784785,-0,Hutch78,Hutchinson & Knopoff (1978),interference,#B50000,Pure tones
12.035285285285285,-0,Hutch78,Hutchinson & Knopoff (1978),interference,#B50000,Pure tones
12.035785785785786,-0,Hutch78,Hutchinson & Knopoff (1978),interference,#B50000,Pure tones
12.036286286286286,-0,Hutch78,Hutchinson & Knopoff (1978),interference,#B50000,Pure tones
12.036786786786786,-0,Hutch78,Hutchinson & Knopoff (1978),interference,#B50000,Pure tones
12.037287287287286,-0,Hutch78,Hutchinson & Knopoff (1978),interference,#B50000,Pure tones
12.037787787787789,-0,Hutch78,Hutchinson & Knopoff (1978),interference,#B50000,Pure tones
12.038288288288289,-0,Hutch78,Hutchinson & Knopoff (1978),interference,#B50000,Pure tones
12.03878878878879,-0,Hutch78,Hutchinson & Knopoff (1978),interference,#B50000,Pure tones
12.03928928928929,-0,Hutch78,Hutchinson & Knopoff (1978),interference,#B50000,Pure tones
12.03978978978979,-0,Hutch78,Hutchinson & Knopoff (1978),interference,#B50000,Pure tones
12.04029029029029,-0,Hutch78,Hutchinson & Knopoff (1978),interference,#B50000,Pure tones
12.04079079079079,-0,Hutch78,Hutchinson & Knopoff (1978),interference,#B50000,Pure tones
12.04129129129129,-0,Hutch78,Hutchinson & Knopoff (1978),interference,#B50000,Pure tones
12.041791791791791,-0,Hutch78,Hutchinson & Knopoff (1978),interference,#B50000,Pure tones
12.042292292292291,-0,Hutch78,Hutchinson & Knopoff (1978),interference,#B50000,Pure tones
12.042792792792794,-0,Hutch78,Hutchinson & Knopoff (1978),interference,#B50000,Pure tones
12.043293293293294,-0,Hutch78,Hutchinson & Knopoff (1978),interference,#B50000,Pure tones
12.043793793793794,-0,Hutch78,Hutchinson & Knopoff (1978),interference,#B50000,Pure tones
12.044294294294295,-0,Hutch78,Hutchinson & Knopoff (1978),interference,#B50000,Pure tones
12.044794794794795,-0,Hutch78,Hutchinson & Knopoff (1978),interference,#B50000,Pure tones
12.045295295295295,-0,Hutch78,Hutchinson & Knopoff (1978),interference,#B50000,Pure tones
12.045795795795796,-0,Hutch78,Hutchinson & Knopoff (1978),interference,#B50000,Pure tones
12.046296296296296,-0,Hutch78,Hutchinson & Knopoff (1978),interference,#B50000,Pure tones
12.046796796796796,-0,Hutch78,Hutchinson & Knopoff (1978),interference,#B50000,Pure tones
12.047297297297296,-0,Hutch78,Hutchinson & Knopoff (1978),interference,#B50000,Pure tones
12.047797797797799,-0,Hutch78,Hutchinson & Knopoff (1978),interference,#B50000,Pure tones
12.048298298298299,-0,Hutch78,Hutchinson & Knopoff (1978),interference,#B50000,Pure tones
12.0487987987988,-0,Hutch78,Hutchinson & Knopoff (1978),interference,#B50000,Pure tones
12.0492992992993,-0,Hutch78,Hutchinson & Knopoff (1978),interference,#B50000,Pure tones
12.0497997997998,-0,Hutch78,Hutchinson & Knopoff (1978),interference,#B50000,Pure tones
12.0503003003003,-0,Hutch78,Hutchinson & Knopoff (1978),interference,#B50000,Pure tones
12.0508008008008,-0,Hutch78,Hutchinson & Knopoff (1978),interference,#B50000,Pure tones
12.0513013013013,-0,Hutch78,Hutchinson & Knopoff (1978),interference,#B50000,Pure tones
12.051801801801801,-0,Hutch78,Hutchinson & Knopoff (1978),interference,#B50000,Pure tones
12.052302302302301,-0,Hutch78,Hutchinson & Knopoff (1978),interference,#B50000,Pure tones
12.052802802802804,-0,Hutch78,Hutchinson & Knopoff (1978),interference,#B50000,Pure tones
12.053303303303304,-0,Hutch78,Hutchinson & Knopoff (1978),interference,#B50000,Pure tones
12.053803803803804,-0,Hutch78,Hutchinson & Knopoff (1978),interference,#B50000,Pure tones
12.054304304304305,-0,Hutch78,Hutchinson & Knopoff (1978),interference,#B50000,Pure tones
12.054804804804805,-0,Hutch78,Hutchinson & Knopoff (1978),interference,#B50000,Pure tones
12.055305305305305,-0,Hutch78,Hutchinson & Knopoff (1978),interference,#B50000,Pure tones
12.055805805805806,-0,Hutch78,Hutchinson & Knopoff (1978),interference,#B50000,Pure tones
12.056306306306306,-0,Hutch78,Hutchinson & Knopoff (1978),interference,#B50000,Pure tones
12.056806806806806,-0,Hutch78,Hutchinson & Knopoff (1978),interference,#B50000,Pure tones
12.057307307307306,-0,Hutch78,Hutchinson & Knopoff (1978),interference,#B50000,Pure tones
12.057807807807809,-0,Hutch78,Hutchinson & Knopoff (1978),interference,#B50000,Pure tones
12.058308308308309,-0,Hutch78,Hutchinson & Knopoff (1978),interference,#B50000,Pure tones
12.05880880880881,-0,Hutch78,Hutchinson & Knopoff (1978),interference,#B50000,Pure tones
12.05930930930931,-0,Hutch78,Hutchinson & Knopoff (1978),interference,#B50000,Pure tones
12.05980980980981,-0,Hutch78,Hutchinson & Knopoff (1978),interference,#B50000,Pure tones
12.06031031031031,-0,Hutch78,Hutchinson & Knopoff (1978),interference,#B50000,Pure tones
12.06081081081081,-0,Hutch78,Hutchinson & Knopoff (1978),interference,#B50000,Pure tones
12.06131131131131,-0,Hutch78,Hutchinson & Knopoff (1978),interference,#B50000,Pure tones
12.061811811811811,-0,Hutch78,Hutchinson & Knopoff (1978),interference,#B50000,Pure tones
12.062312312312311,-0,Hutch78,Hutchinson & Knopoff (1978),interference,#B50000,Pure tones
12.062812812812814,-0,Hutch78,Hutchinson & Knopoff (1978),interference,#B50000,Pure tones
12.063313313313314,-0,Hutch78,Hutchinson & Knopoff (1978),interference,#B50000,Pure tones
12.063813813813814,-0,Hutch78,Hutchinson & Knopoff (1978),interference,#B50000,Pure tones
12.064314314314315,-0,Hutch78,Hutchinson & Knopoff (1978),interference,#B50000,Pure tones
12.064814814814815,-0,Hutch78,Hutchinson & Knopoff (1978),interference,#B50000,Pure tones
12.065315315315315,-0,Hutch78,Hutchinson & Knopoff (1978),interference,#B50000,Pure tones
12.065815815815816,-0,Hutch78,Hutchinson & Knopoff (1978),interference,#B50000,Pure tones
12.066316316316316,-0,Hutch78,Hutchinson & Knopoff (1978),interference,#B50000,Pure tones
12.066816816816816,-0,Hutch78,Hutchinson & Knopoff (1978),interference,#B50000,Pure tones
12.067317317317316,-0,Hutch78,Hutchinson & Knopoff (1978),interference,#B50000,Pure tones
12.067817817817819,-0,Hutch78,Hutchinson & Knopoff (1978),interference,#B50000,Pure tones
12.068318318318319,-0,Hutch78,Hutchinson & Knopoff (1978),interference,#B50000,Pure tones
12.06881881881882,-0,Hutch78,Hutchinson & Knopoff (1978),interference,#B50000,Pure tones
12.06931931931932,-0,Hutch78,Hutchinson & Knopoff (1978),interference,#B50000,Pure tones
12.06981981981982,-0,Hutch78,Hutchinson & Knopoff (1978),interference,#B50000,Pure tones
12.07032032032032,-0,Hutch78,Hutchinson & Knopoff (1978),interference,#B50000,Pure tones
12.07082082082082,-0,Hutch78,Hutchinson & Knopoff (1978),interference,#B50000,Pure tones
12.07132132132132,-0,Hutch78,Hutchinson & Knopoff (1978),interference,#B50000,Pure tones
12.071821821821821,-0,Hutch78,Hutchinson & Knopoff (1978),interference,#B50000,Pure tones
12.072322322322321,-0,Hutch78,Hutchinson & Knopoff (1978),interference,#B50000,Pure tones
12.072822822822824,-0,Hutch78,Hutchinson & Knopoff (1978),interference,#B50000,Pure tones
12.073323323323324,-0,Hutch78,Hutchinson & Knopoff (1978),interference,#B50000,Pure tones
12.073823823823824,-0,Hutch78,Hutchinson & Knopoff (1978),interference,#B50000,Pure tones
12.074324324324325,-0,Hutch78,Hutchinson & Knopoff (1978),interference,#B50000,Pure tones
12.074824824824825,-0,Hutch78,Hutchinson & Knopoff (1978),interference,#B50000,Pure tones
12.075325325325325,-0,Hutch78,Hutchinson & Knopoff (1978),interference,#B50000,Pure tones
12.075825825825826,-0,Hutch78,Hutchinson & Knopoff (1978),interference,#B50000,Pure tones
12.076326326326326,-0,Hutch78,Hutchinson & Knopoff (1978),interference,#B50000,Pure tones
12.076826826826826,-0,Hutch78,Hutchinson & Knopoff (1978),interference,#B50000,Pure tones
12.077327327327327,-0,Hutch78,Hutchinson & Knopoff (1978),interference,#B50000,Pure tones
12.077827827827829,-0,Hutch78,Hutchinson & Knopoff (1978),interference,#B50000,Pure tones
12.078328328328329,-0,Hutch78,Hutchinson & Knopoff (1978),interference,#B50000,Pure tones
12.07882882882883,-0,Hutch78,Hutchinson & Knopoff (1978),interference,#B50000,Pure tones
12.07932932932933,-0,Hutch78,Hutchinson & Knopoff (1978),interference,#B50000,Pure tones
12.07982982982983,-0,Hutch78,Hutchinson & Knopoff (1978),interference,#B50000,Pure tones
12.08033033033033,-0,Hutch78,Hutchinson & Knopoff (1978),interference,#B50000,Pure tones
12.08083083083083,-0,Hutch78,Hutchinson & Knopoff (1978),interference,#B50000,Pure tones
12.08133133133133,-0,Hutch78,Hutchinson & Knopoff (1978),interference,#B50000,Pure tones
12.081831831831831,-0,Hutch78,Hutchinson & Knopoff (1978),interference,#B50000,Pure tones
12.082332332332332,-0,Hutch78,Hutchinson & Knopoff (1978),interference,#B50000,Pure tones
12.082832832832834,-0,Hutch78,Hutchinson & Knopoff (1978),interference,#B50000,Pure tones
12.083333333333334,-0,Hutch78,Hutchinson & Knopoff (1978),interference,#B50000,Pure tones
12.083833833833834,-0,Hutch78,Hutchinson & Knopoff (1978),interference,#B50000,Pure tones
12.084334334334335,-0,Hutch78,Hutchinson & Knopoff (1978),interference,#B50000,Pure tones
12.084834834834835,-0,Hutch78,Hutchinson & Knopoff (1978),interference,#B50000,Pure tones
12.085335335335335,-0,Hutch78,Hutchinson & Knopoff (1978),interference,#B50000,Pure tones
12.085835835835836,-0,Hutch78,Hutchinson & Knopoff (1978),interference,#B50000,Pure tones
12.086336336336336,-0,Hutch78,Hutchinson & Knopoff (1978),interference,#B50000,Pure tones
12.086836836836836,-0,Hutch78,Hutchinson & Knopoff (1978),interference,#B50000,Pure tones
12.087337337337337,-0,Hutch78,Hutchinson & Knopoff (1978),interference,#B50000,Pure tones
12.087837837837839,-0,Hutch78,Hutchinson & Knopoff (1978),interference,#B50000,Pure tones
12.088338338338339,-0,Hutch78,Hutchinson & Knopoff (1978),interference,#B50000,Pure tones
12.08883883883884,-0,Hutch78,Hutchinson & Knopoff (1978),interference,#B50000,Pure tones
12.08933933933934,-0,Hutch78,Hutchinson & Knopoff (1978),interference,#B50000,Pure tones
12.08983983983984,-0,Hutch78,Hutchinson & Knopoff (1978),interference,#B50000,Pure tones
12.09034034034034,-0,Hutch78,Hutchinson & Knopoff (1978),interference,#B50000,Pure tones
12.09084084084084,-0,Hutch78,Hutchinson & Knopoff (1978),interference,#B50000,Pure tones
12.09134134134134,-0,Hutch78,Hutchinson & Knopoff (1978),interference,#B50000,Pure tones
12.091841841841841,-0,Hutch78,Hutchinson & Knopoff (1978),interference,#B50000,Pure tones
12.092342342342342,-0,Hutch78,Hutchinson & Knopoff (1978),interference,#B50000,Pure tones
12.092842842842844,-0,Hutch78,Hutchinson & Knopoff (1978),interference,#B50000,Pure tones
12.093343343343344,-0,Hutch78,Hutchinson & Knopoff (1978),interference,#B50000,Pure tones
12.093843843843844,-0,Hutch78,Hutchinson & Knopoff (1978),interference,#B50000,Pure tones
12.094344344344345,-0,Hutch78,Hutchinson & Knopoff (1978),interference,#B50000,Pure tones
12.094844844844845,-0,Hutch78,Hutchinson & Knopoff (1978),interference,#B50000,Pure tones
12.095345345345345,-0,Hutch78,Hutchinson & Knopoff (1978),interference,#B50000,Pure tones
12.095845845845846,-0,Hutch78,Hutchinson & Knopoff (1978),interference,#B50000,Pure tones
12.096346346346346,-0,Hutch78,Hutchinson & Knopoff (1978),interference,#B50000,Pure tones
12.096846846846846,-0,Hutch78,Hutchinson & Knopoff (1978),interference,#B50000,Pure tones
12.097347347347347,-0,Hutch78,Hutchinson & Knopoff (1978),interference,#B50000,Pure tones
12.097847847847849,-0,Hutch78,Hutchinson & Knopoff (1978),interference,#B50000,Pure tones
12.098348348348349,-0,Hutch78,Hutchinson & Knopoff (1978),interference,#B50000,Pure tones
12.09884884884885,-0,Hutch78,Hutchinson & Knopoff (1978),interference,#B50000,Pure tones
12.09934934934935,-0,Hutch78,Hutchinson & Knopoff (1978),interference,#B50000,Pure tones
12.09984984984985,-0,Hutch78,Hutchinson & Knopoff (1978),interference,#B50000,Pure tones
12.10035035035035,-0,Hutch78,Hutchinson & Knopoff (1978),interference,#B50000,Pure tones
12.10085085085085,-0,Hutch78,Hutchinson & Knopoff (1978),interference,#B50000,Pure tones
12.10135135135135,-0,Hutch78,Hutchinson & Knopoff (1978),interference,#B50000,Pure tones
12.101851851851851,-0,Hutch78,Hutchinson & Knopoff (1978),interference,#B50000,Pure tones
12.102352352352352,-0,Hutch78,Hutchinson & Knopoff (1978),interference,#B50000,Pure tones
12.102852852852854,-0,Hutch78,Hutchinson & Knopoff (1978),interference,#B50000,Pure tones
12.103353353353354,-0,Hutch78,Hutchinson & Knopoff (1978),interference,#B50000,Pure tones
12.103853853853854,-0,Hutch78,Hutchinson & Knopoff (1978),interference,#B50000,Pure tones
12.104354354354355,-0,Hutch78,Hutchinson & Knopoff (1978),interference,#B50000,Pure tones
12.104854854854855,-0,Hutch78,Hutchinson & Knopoff (1978),interference,#B50000,Pure tones
12.105355355355355,-0,Hutch78,Hutchinson & Knopoff (1978),interference,#B50000,Pure tones
12.105855855855856,-0,Hutch78,Hutchinson & Knopoff (1978),interference,#B50000,Pure tones
12.106356356356356,-0,Hutch78,Hutchinson & Knopoff (1978),interference,#B50000,Pure tones
12.106856856856856,-0,Hutch78,Hutchinson & Knopoff (1978),interference,#B50000,Pure tones
12.107357357357357,-0,Hutch78,Hutchinson & Knopoff (1978),interference,#B50000,Pure tones
12.107857857857859,-0,Hutch78,Hutchinson & Knopoff (1978),interference,#B50000,Pure tones
12.108358358358359,-0,Hutch78,Hutchinson & Knopoff (1978),interference,#B50000,Pure tones
12.10885885885886,-0,Hutch78,Hutchinson & Knopoff (1978),interference,#B50000,Pure tones
12.10935935935936,-0,Hutch78,Hutchinson & Knopoff (1978),interference,#B50000,Pure tones
12.10985985985986,-0,Hutch78,Hutchinson & Knopoff (1978),interference,#B50000,Pure tones
12.11036036036036,-0,Hutch78,Hutchinson & Knopoff (1978),interference,#B50000,Pure tones
12.11086086086086,-0,Hutch78,Hutchinson & Knopoff (1978),interference,#B50000,Pure tones
12.11136136136136,-0,Hutch78,Hutchinson & Knopoff (1978),interference,#B50000,Pure tones
12.111861861861861,-0,Hutch78,Hutchinson & Knopoff (1978),interference,#B50000,Pure tones
12.112362362362362,-0,Hutch78,Hutchinson & Knopoff (1978),interference,#B50000,Pure tones
12.112862862862864,-0,Hutch78,Hutchinson & Knopoff (1978),interference,#B50000,Pure tones
12.113363363363364,-0,Hutch78,Hutchinson & Knopoff (1978),interference,#B50000,Pure tones
12.113863863863864,-0,Hutch78,Hutchinson & Knopoff (1978),interference,#B50000,Pure tones
12.114364364364365,-0,Hutch78,Hutchinson & Knopoff (1978),interference,#B50000,Pure tones
12.114864864864865,-0,Hutch78,Hutchinson & Knopoff (1978),interference,#B50000,Pure tones
12.115365365365365,-0,Hutch78,Hutchinson & Knopoff (1978),interference,#B50000,Pure tones
12.115865865865866,-0,Hutch78,Hutchinson & Knopoff (1978),interference,#B50000,Pure tones
12.116366366366366,-0,Hutch78,Hutchinson & Knopoff (1978),interference,#B50000,Pure tones
12.116866866866866,-0,Hutch78,Hutchinson & Knopoff (1978),interference,#B50000,Pure tones
12.117367367367367,-0,Hutch78,Hutchinson & Knopoff (1978),interference,#B50000,Pure tones
12.117867867867869,-0,Hutch78,Hutchinson & Knopoff (1978),interference,#B50000,Pure tones
12.118368368368369,-0,Hutch78,Hutchinson & Knopoff (1978),interference,#B50000,Pure tones
12.11886886886887,-0,Hutch78,Hutchinson & Knopoff (1978),interference,#B50000,Pure tones
12.11936936936937,-0,Hutch78,Hutchinson & Knopoff (1978),interference,#B50000,Pure tones
12.11986986986987,-0,Hutch78,Hutchinson & Knopoff (1978),interference,#B50000,Pure tones
12.12037037037037,-0,Hutch78,Hutchinson & Knopoff (1978),interference,#B50000,Pure tones
12.12087087087087,-0,Hutch78,Hutchinson & Knopoff (1978),interference,#B50000,Pure tones
12.121371371371371,-0,Hutch78,Hutchinson & Knopoff (1978),interference,#B50000,Pure tones
12.121871871871871,-0,Hutch78,Hutchinson & Knopoff (1978),interference,#B50000,Pure tones
12.122372372372372,-0,Hutch78,Hutchinson & Knopoff (1978),interference,#B50000,Pure tones
12.122872872872874,-0,Hutch78,Hutchinson & Knopoff (1978),interference,#B50000,Pure tones
12.123373373373374,-0,Hutch78,Hutchinson & Knopoff (1978),interference,#B50000,Pure tones
12.123873873873874,-0,Hutch78,Hutchinson & Knopoff (1978),interference,#B50000,Pure tones
12.124374374374375,-0,Hutch78,Hutchinson & Knopoff (1978),interference,#B50000,Pure tones
12.124874874874875,-0,Hutch78,Hutchinson & Knopoff (1978),interference,#B50000,Pure tones
12.125375375375375,-0,Hutch78,Hutchinson & Knopoff (1978),interference,#B50000,Pure tones
12.125875875875876,-0,Hutch78,Hutchinson & Knopoff (1978),interference,#B50000,Pure tones
12.126376376376376,-0,Hutch78,Hutchinson & Knopoff (1978),interference,#B50000,Pure tones
12.126876876876876,-0,Hutch78,Hutchinson & Knopoff (1978),interference,#B50000,Pure tones
12.127377377377377,-0,Hutch78,Hutchinson & Knopoff (1978),interference,#B50000,Pure tones
12.127877877877879,-0,Hutch78,Hutchinson & Knopoff (1978),interference,#B50000,Pure tones
12.128378378378379,-0,Hutch78,Hutchinson & Knopoff (1978),interference,#B50000,Pure tones
12.12887887887888,-0,Hutch78,Hutchinson & Knopoff (1978),interference,#B50000,Pure tones
12.12937937937938,-0,Hutch78,Hutchinson & Knopoff (1978),interference,#B50000,Pure tones
12.12987987987988,-0,Hutch78,Hutchinson & Knopoff (1978),interference,#B50000,Pure tones
12.13038038038038,-0,Hutch78,Hutchinson & Knopoff (1978),interference,#B50000,Pure tones
12.13088088088088,-0,Hutch78,Hutchinson & Knopoff (1978),interference,#B50000,Pure tones
12.131381381381381,-0,Hutch78,Hutchinson & Knopoff (1978),interference,#B50000,Pure tones
12.131881881881881,-0,Hutch78,Hutchinson & Knopoff (1978),interference,#B50000,Pure tones
12.132382382382382,-0,Hutch78,Hutchinson & Knopoff (1978),interference,#B50000,Pure tones
12.132882882882884,-0,Hutch78,Hutchinson & Knopoff (1978),interference,#B50000,Pure tones
12.133383383383384,-0,Hutch78,Hutchinson & Knopoff (1978),interference,#B50000,Pure tones
12.133883883883884,-0,Hutch78,Hutchinson & Knopoff (1978),interference,#B50000,Pure tones
12.134384384384385,-0,Hutch78,Hutchinson & Knopoff (1978),interference,#B50000,Pure tones
12.134884884884885,-0,Hutch78,Hutchinson & Knopoff (1978),interference,#B50000,Pure tones
12.135385385385385,-0,Hutch78,Hutchinson & Knopoff (1978),interference,#B50000,Pure tones
12.135885885885886,-0,Hutch78,Hutchinson & Knopoff (1978),interference,#B50000,Pure tones
12.136386386386386,-0,Hutch78,Hutchinson & Knopoff (1978),interference,#B50000,Pure tones
12.136886886886886,-0,Hutch78,Hutchinson & Knopoff (1978),interference,#B50000,Pure tones
12.137387387387387,-0,Hutch78,Hutchinson & Knopoff (1978),interference,#B50000,Pure tones
12.137887887887889,-0,Hutch78,Hutchinson & Knopoff (1978),interference,#B50000,Pure tones
12.138388388388389,-0,Hutch78,Hutchinson & Knopoff (1978),interference,#B50000,Pure tones
12.13888888888889,-0,Hutch78,Hutchinson & Knopoff (1978),interference,#B50000,Pure tones
12.13938938938939,-0,Hutch78,Hutchinson & Knopoff (1978),interference,#B50000,Pure tones
12.13988988988989,-0,Hutch78,Hutchinson & Knopoff (1978),interference,#B50000,Pure tones
12.14039039039039,-0,Hutch78,Hutchinson & Knopoff (1978),interference,#B50000,Pure tones
12.14089089089089,-0,Hutch78,Hutchinson & Knopoff (1978),interference,#B50000,Pure tones
12.141391391391391,-0,Hutch78,Hutchinson & Knopoff (1978),interference,#B50000,Pure tones
12.141891891891891,-0,Hutch78,Hutchinson & Knopoff (1978),interference,#B50000,Pure tones
12.142392392392392,-0,Hutch78,Hutchinson & Knopoff (1978),interference,#B50000,Pure tones
12.142892892892894,-0,Hutch78,Hutchinson & Knopoff (1978),interference,#B50000,Pure tones
12.143393393393394,-0,Hutch78,Hutchinson & Knopoff (1978),interference,#B50000,Pure tones
12.143893893893894,-0,Hutch78,Hutchinson & Knopoff (1978),interference,#B50000,Pure tones
12.144394394394395,-0,Hutch78,Hutchinson & Knopoff (1978),interference,#B50000,Pure tones
12.144894894894895,-0,Hutch78,Hutchinson & Knopoff (1978),interference,#B50000,Pure tones
12.145395395395395,-0,Hutch78,Hutchinson & Knopoff (1978),interference,#B50000,Pure tones
12.145895895895896,-0,Hutch78,Hutchinson & Knopoff (1978),interference,#B50000,Pure tones
12.146396396396396,-0,Hutch78,Hutchinson & Knopoff (1978),interference,#B50000,Pure tones
12.146896896896896,-0,Hutch78,Hutchinson & Knopoff (1978),interference,#B50000,Pure tones
12.147397397397397,-0,Hutch78,Hutchinson & Knopoff (1978),interference,#B50000,Pure tones
12.147897897897899,-0,Hutch78,Hutchinson & Knopoff (1978),interference,#B50000,Pure tones
12.148398398398399,-0,Hutch78,Hutchinson & Knopoff (1978),interference,#B50000,Pure tones
12.1488988988989,-0,Hutch78,Hutchinson & Knopoff (1978),interference,#B50000,Pure tones
12.1493993993994,-0,Hutch78,Hutchinson & Knopoff (1978),interference,#B50000,Pure tones
12.1498998998999,-0,Hutch78,Hutchinson & Knopoff (1978),interference,#B50000,Pure tones
12.1504004004004,-0,Hutch78,Hutchinson & Knopoff (1978),interference,#B50000,Pure tones
12.1509009009009,-0,Hutch78,Hutchinson & Knopoff (1978),interference,#B50000,Pure tones
12.151401401401401,-0,Hutch78,Hutchinson & Knopoff (1978),interference,#B50000,Pure tones
12.151901901901901,-0,Hutch78,Hutchinson & Knopoff (1978),interference,#B50000,Pure tones
12.152402402402402,-0,Hutch78,Hutchinson & Knopoff (1978),interference,#B50000,Pure tones
12.152902902902904,-0,Hutch78,Hutchinson & Knopoff (1978),interference,#B50000,Pure tones
12.153403403403404,-0,Hutch78,Hutchinson & Knopoff (1978),interference,#B50000,Pure tones
12.153903903903904,-0,Hutch78,Hutchinson & Knopoff (1978),interference,#B50000,Pure tones
12.154404404404405,-0,Hutch78,Hutchinson & Knopoff (1978),interference,#B50000,Pure tones
12.154904904904905,-0,Hutch78,Hutchinson & Knopoff (1978),interference,#B50000,Pure tones
12.155405405405405,-0,Hutch78,Hutchinson & Knopoff (1978),interference,#B50000,Pure tones
12.155905905905906,-0,Hutch78,Hutchinson & Knopoff (1978),interference,#B50000,Pure tones
12.156406406406406,-0,Hutch78,Hutchinson & Knopoff (1978),interference,#B50000,Pure tones
12.156906906906906,-0,Hutch78,Hutchinson & Knopoff (1978),interference,#B50000,Pure tones
12.157407407407407,-0,Hutch78,Hutchinson & Knopoff (1978),interference,#B50000,Pure tones
12.157907907907909,-0,Hutch78,Hutchinson & Knopoff (1978),interference,#B50000,Pure tones
12.158408408408409,-0,Hutch78,Hutchinson & Knopoff (1978),interference,#B50000,Pure tones
12.15890890890891,-0,Hutch78,Hutchinson & Knopoff (1978),interference,#B50000,Pure tones
12.15940940940941,-0,Hutch78,Hutchinson & Knopoff (1978),interference,#B50000,Pure tones
12.15990990990991,-0,Hutch78,Hutchinson & Knopoff (1978),interference,#B50000,Pure tones
12.16041041041041,-0,Hutch78,Hutchinson & Knopoff (1978),interference,#B50000,Pure tones
12.16091091091091,-0,Hutch78,Hutchinson & Knopoff (1978),interference,#B50000,Pure tones
12.161411411411411,-0,Hutch78,Hutchinson & Knopoff (1978),interference,#B50000,Pure tones
12.161911911911911,-0,Hutch78,Hutchinson & Knopoff (1978),interference,#B50000,Pure tones
12.162412412412412,-0,Hutch78,Hutchinson & Knopoff (1978),interference,#B50000,Pure tones
12.162912912912914,-0,Hutch78,Hutchinson & Knopoff (1978),interference,#B50000,Pure tones
12.163413413413414,-0,Hutch78,Hutchinson & Knopoff (1978),interference,#B50000,Pure tones
12.163913913913914,-0,Hutch78,Hutchinson & Knopoff (1978),interference,#B50000,Pure tones
12.164414414414415,-0,Hutch78,Hutchinson & Knopoff (1978),interference,#B50000,Pure tones
12.164914914914915,-0,Hutch78,Hutchinson & Knopoff (1978),interference,#B50000,Pure tones
12.165415415415415,-0,Hutch78,Hutchinson & Knopoff (1978),interference,#B50000,Pure tones
12.165915915915916,-0,Hutch78,Hutchinson & Knopoff (1978),interference,#B50000,Pure tones
12.166416416416416,-0,Hutch78,Hutchinson & Knopoff (1978),interference,#B50000,Pure tones
12.166916916916916,-0,Hutch78,Hutchinson & Knopoff (1978),interference,#B50000,Pure tones
12.167417417417417,-0,Hutch78,Hutchinson & Knopoff (1978),interference,#B50000,Pure tones
12.167917917917919,-0,Hutch78,Hutchinson & Knopoff (1978),interference,#B50000,Pure tones
12.168418418418419,-0,Hutch78,Hutchinson & Knopoff (1978),interference,#B50000,Pure tones
12.16891891891892,-0,Hutch78,Hutchinson & Knopoff (1978),interference,#B50000,Pure tones
12.16941941941942,-0,Hutch78,Hutchinson & Knopoff (1978),interference,#B50000,Pure tones
12.16991991991992,-0,Hutch78,Hutchinson & Knopoff (1978),interference,#B50000,Pure tones
12.17042042042042,-0,Hutch78,Hutchinson & Knopoff (1978),interference,#B50000,Pure tones
12.17092092092092,-0,Hutch78,Hutchinson & Knopoff (1978),interference,#B50000,Pure tones
12.171421421421421,-0,Hutch78,Hutchinson & Knopoff (1978),interference,#B50000,Pure tones
12.171921921921921,-0,Hutch78,Hutchinson & Knopoff (1978),interference,#B50000,Pure tones
12.172422422422422,-0,Hutch78,Hutchinson & Knopoff (1978),interference,#B50000,Pure tones
12.172922922922924,-0,Hutch78,Hutchinson & Knopoff (1978),interference,#B50000,Pure tones
12.173423423423424,-0,Hutch78,Hutchinson & Knopoff (1978),interference,#B50000,Pure tones
12.173923923923924,-0,Hutch78,Hutchinson & Knopoff (1978),interference,#B50000,Pure tones
12.174424424424425,-0,Hutch78,Hutchinson & Knopoff (1978),interference,#B50000,Pure tones
12.174924924924925,-0,Hutch78,Hutchinson & Knopoff (1978),interference,#B50000,Pure tones
12.175425425425425,-0,Hutch78,Hutchinson & Knopoff (1978),interference,#B50000,Pure tones
12.175925925925926,-0,Hutch78,Hutchinson & Knopoff (1978),interference,#B50000,Pure tones
12.176426426426426,-0,Hutch78,Hutchinson & Knopoff (1978),interference,#B50000,Pure tones
12.176926926926926,-0,Hutch78,Hutchinson & Knopoff (1978),interference,#B50000,Pure tones
12.177427427427427,-0,Hutch78,Hutchinson & Knopoff (1978),interference,#B50000,Pure tones
12.177927927927929,-0,Hutch78,Hutchinson & Knopoff (1978),interference,#B50000,Pure tones
12.178428428428429,-0,Hutch78,Hutchinson & Knopoff (1978),interference,#B50000,Pure tones
12.17892892892893,-0,Hutch78,Hutchinson & Knopoff (1978),interference,#B50000,Pure tones
12.17942942942943,-0,Hutch78,Hutchinson & Knopoff (1978),interference,#B50000,Pure tones
12.17992992992993,-0,Hutch78,Hutchinson & Knopoff (1978),interference,#B50000,Pure tones
12.18043043043043,-0,Hutch78,Hutchinson & Knopoff (1978),interference,#B50000,Pure tones
12.18093093093093,-0,Hutch78,Hutchinson & Knopoff (1978),interference,#B50000,Pure tones
12.181431431431431,-0,Hutch78,Hutchinson & Knopoff (1978),interference,#B50000,Pure tones
12.181931931931931,-0,Hutch78,Hutchinson & Knopoff (1978),interference,#B50000,Pure tones
12.182432432432432,-0,Hutch78,Hutchinson & Knopoff (1978),interference,#B50000,Pure tones
12.182932932932934,-0,Hutch78,Hutchinson & Knopoff (1978),interference,#B50000,Pure tones
12.183433433433434,-0,Hutch78,Hutchinson & Knopoff (1978),interference,#B50000,Pure tones
12.183933933933934,-0,Hutch78,Hutchinson & Knopoff (1978),interference,#B50000,Pure tones
12.184434434434435,-0,Hutch78,Hutchinson & Knopoff (1978),interference,#B50000,Pure tones
12.184934934934935,-0,Hutch78,Hutchinson & Knopoff (1978),interference,#B50000,Pure tones
12.185435435435435,-0,Hutch78,Hutchinson & Knopoff (1978),interference,#B50000,Pure tones
12.185935935935936,-0,Hutch78,Hutchinson & Knopoff (1978),interference,#B50000,Pure tones
12.186436436436436,-0,Hutch78,Hutchinson & Knopoff (1978),interference,#B50000,Pure tones
12.186936936936936,-0,Hutch78,Hutchinson & Knopoff (1978),interference,#B50000,Pure tones
12.187437437437438,-0,Hutch78,Hutchinson & Knopoff (1978),interference,#B50000,Pure tones
12.187937937937939,-0,Hutch78,Hutchinson & Knopoff (1978),interference,#B50000,Pure tones
12.188438438438439,-0,Hutch78,Hutchinson & Knopoff (1978),interference,#B50000,Pure tones
12.18893893893894,-0,Hutch78,Hutchinson & Knopoff (1978),interference,#B50000,Pure tones
12.18943943943944,-0,Hutch78,Hutchinson & Knopoff (1978),interference,#B50000,Pure tones
12.18993993993994,-0,Hutch78,Hutchinson & Knopoff (1978),interference,#B50000,Pure tones
12.19044044044044,-0,Hutch78,Hutchinson & Knopoff (1978),interference,#B50000,Pure tones
12.19094094094094,-0,Hutch78,Hutchinson & Knopoff (1978),interference,#B50000,Pure tones
12.191441441441441,-0,Hutch78,Hutchinson & Knopoff (1978),interference,#B50000,Pure tones
12.191941941941941,-0,Hutch78,Hutchinson & Knopoff (1978),interference,#B50000,Pure tones
12.192442442442442,-0,Hutch78,Hutchinson & Knopoff (1978),interference,#B50000,Pure tones
12.192942942942944,-0,Hutch78,Hutchinson & Knopoff (1978),interference,#B50000,Pure tones
12.193443443443444,-0,Hutch78,Hutchinson & Knopoff (1978),interference,#B50000,Pure tones
12.193943943943944,-0,Hutch78,Hutchinson & Knopoff (1978),interference,#B50000,Pure tones
12.194444444444445,-0,Hutch78,Hutchinson & Knopoff (1978),interference,#B50000,Pure tones
12.194944944944945,-0,Hutch78,Hutchinson & Knopoff (1978),interference,#B50000,Pure tones
12.195445445445445,-0,Hutch78,Hutchinson & Knopoff (1978),interference,#B50000,Pure tones
12.195945945945946,-0,Hutch78,Hutchinson & Knopoff (1978),interference,#B50000,Pure tones
12.196446446446446,-0,Hutch78,Hutchinson & Knopoff (1978),interference,#B50000,Pure tones
12.196946946946946,-0,Hutch78,Hutchinson & Knopoff (1978),interference,#B50000,Pure tones
12.197447447447448,-0,Hutch78,Hutchinson & Knopoff (1978),interference,#B50000,Pure tones
12.197947947947949,-0,Hutch78,Hutchinson & Knopoff (1978),interference,#B50000,Pure tones
12.198448448448449,-0,Hutch78,Hutchinson & Knopoff (1978),interference,#B50000,Pure tones
12.19894894894895,-0,Hutch78,Hutchinson & Knopoff (1978),interference,#B50000,Pure tones
12.19944944944945,-0,Hutch78,Hutchinson & Knopoff (1978),interference,#B50000,Pure tones
12.19994994994995,-0,Hutch78,Hutchinson & Knopoff (1978),interference,#B50000,Pure tones
12.20045045045045,-0,Hutch78,Hutchinson & Knopoff (1978),interference,#B50000,Pure tones
12.20095095095095,-0,Hutch78,Hutchinson & Knopoff (1978),interference,#B50000,Pure tones
12.201451451451451,-0,Hutch78,Hutchinson & Knopoff (1978),interference,#B50000,Pure tones
12.201951951951951,-0,Hutch78,Hutchinson & Knopoff (1978),interference,#B50000,Pure tones
12.202452452452452,-0,Hutch78,Hutchinson & Knopoff (1978),interference,#B50000,Pure tones
12.202952952952954,-0,Hutch78,Hutchinson & Knopoff (1978),interference,#B50000,Pure tones
12.203453453453454,-0,Hutch78,Hutchinson & Knopoff (1978),interference,#B50000,Pure tones
12.203953953953954,-0,Hutch78,Hutchinson & Knopoff (1978),interference,#B50000,Pure tones
12.204454454454455,-0,Hutch78,Hutchinson & Knopoff (1978),interference,#B50000,Pure tones
12.204954954954955,-0,Hutch78,Hutchinson & Knopoff (1978),interference,#B50000,Pure tones
12.205455455455455,-0,Hutch78,Hutchinson & Knopoff (1978),interference,#B50000,Pure tones
12.205955955955956,-0,Hutch78,Hutchinson & Knopoff (1978),interference,#B50000,Pure tones
12.206456456456456,-0,Hutch78,Hutchinson & Knopoff (1978),interference,#B50000,Pure tones
12.206956956956956,-0,Hutch78,Hutchinson & Knopoff (1978),interference,#B50000,Pure tones
12.207457457457458,-0,Hutch78,Hutchinson & Knopoff (1978),interference,#B50000,Pure tones
12.207957957957959,-0,Hutch78,Hutchinson & Knopoff (1978),interference,#B50000,Pure tones
12.208458458458459,-0,Hutch78,Hutchinson & Knopoff (1978),interference,#B50000,Pure tones
12.20895895895896,-0,Hutch78,Hutchinson & Knopoff (1978),interference,#B50000,Pure tones
12.20945945945946,-0,Hutch78,Hutchinson & Knopoff (1978),interference,#B50000,Pure tones
12.20995995995996,-0,Hutch78,Hutchinson & Knopoff (1978),interference,#B50000,Pure tones
12.21046046046046,-0,Hutch78,Hutchinson & Knopoff (1978),interference,#B50000,Pure tones
12.21096096096096,-0,Hutch78,Hutchinson & Knopoff (1978),interference,#B50000,Pure tones
12.211461461461461,-0,Hutch78,Hutchinson & Knopoff (1978),interference,#B50000,Pure tones
12.211961961961961,-0,Hutch78,Hutchinson & Knopoff (1978),interference,#B50000,Pure tones
12.212462462462462,-0,Hutch78,Hutchinson & Knopoff (1978),interference,#B50000,Pure tones
12.212962962962964,-0,Hutch78,Hutchinson & Knopoff (1978),interference,#B50000,Pure tones
12.213463463463464,-0,Hutch78,Hutchinson & Knopoff (1978),interference,#B50000,Pure tones
12.213963963963964,-0,Hutch78,Hutchinson & Knopoff (1978),interference,#B50000,Pure tones
12.214464464464465,-0,Hutch78,Hutchinson & Knopoff (1978),interference,#B50000,Pure tones
12.214964964964965,-0,Hutch78,Hutchinson & Knopoff (1978),interference,#B50000,Pure tones
12.215465465465465,-0,Hutch78,Hutchinson & Knopoff (1978),interference,#B50000,Pure tones
12.215965965965966,-0,Hutch78,Hutchinson & Knopoff (1978),interference,#B50000,Pure tones
12.216466466466466,-0,Hutch78,Hutchinson & Knopoff (1978),interference,#B50000,Pure tones
12.216966966966966,-0,Hutch78,Hutchinson & Knopoff (1978),interference,#B50000,Pure tones
12.217467467467468,-0,Hutch78,Hutchinson & Knopoff (1978),interference,#B50000,Pure tones
12.217967967967969,-0,Hutch78,Hutchinson & Knopoff (1978),interference,#B50000,Pure tones
12.218468468468469,-0,Hutch78,Hutchinson & Knopoff (1978),interference,#B50000,Pure tones
12.21896896896897,-0,Hutch78,Hutchinson & Knopoff (1978),interference,#B50000,Pure tones
12.21946946946947,-0,Hutch78,Hutchinson & Knopoff (1978),interference,#B50000,Pure tones
12.21996996996997,-0,Hutch78,Hutchinson & Knopoff (1978),interference,#B50000,Pure tones
12.22047047047047,-0,Hutch78,Hutchinson & Knopoff (1978),interference,#B50000,Pure tones
12.22097097097097,-0,Hutch78,Hutchinson & Knopoff (1978),interference,#B50000,Pure tones
12.221471471471471,-0,Hutch78,Hutchinson & Knopoff (1978),interference,#B50000,Pure tones
12.221971971971971,-0,Hutch78,Hutchinson & Knopoff (1978),interference,#B50000,Pure tones
12.222472472472472,-0,Hutch78,Hutchinson & Knopoff (1978),interference,#B50000,Pure tones
12.222972972972974,-0,Hutch78,Hutchinson & Knopoff (1978),interference,#B50000,Pure tones
12.223473473473474,-0,Hutch78,Hutchinson & Knopoff (1978),interference,#B50000,Pure tones
12.223973973973974,-0,Hutch78,Hutchinson & Knopoff (1978),interference,#B50000,Pure tones
12.224474474474475,-0,Hutch78,Hutchinson & Knopoff (1978),interference,#B50000,Pure tones
12.224974974974975,-0,Hutch78,Hutchinson & Knopoff (1978),interference,#B50000,Pure tones
12.225475475475475,-0,Hutch78,Hutchinson & Knopoff (1978),interference,#B50000,Pure tones
12.225975975975976,-0,Hutch78,Hutchinson & Knopoff (1978),interference,#B50000,Pure tones
12.226476476476476,-0,Hutch78,Hutchinson & Knopoff (1978),interference,#B50000,Pure tones
12.226976976976976,-0,Hutch78,Hutchinson & Knopoff (1978),interference,#B50000,Pure tones
12.227477477477478,-0,Hutch78,Hutchinson & Knopoff (1978),interference,#B50000,Pure tones
12.227977977977979,-0,Hutch78,Hutchinson & Knopoff (1978),interference,#B50000,Pure tones
12.228478478478479,-0,Hutch78,Hutchinson & Knopoff (1978),interference,#B50000,Pure tones
12.22897897897898,-0,Hutch78,Hutchinson & Knopoff (1978),interference,#B50000,Pure tones
12.22947947947948,-0,Hutch78,Hutchinson & Knopoff (1978),interference,#B50000,Pure tones
12.22997997997998,-0,Hutch78,Hutchinson & Knopoff (1978),interference,#B50000,Pure tones
12.23048048048048,-0,Hutch78,Hutchinson & Knopoff (1978),interference,#B50000,Pure tones
12.23098098098098,-0,Hutch78,Hutchinson & Knopoff (1978),interference,#B50000,Pure tones
12.231481481481481,-0,Hutch78,Hutchinson & Knopoff (1978),interference,#B50000,Pure tones
12.231981981981981,-0,Hutch78,Hutchinson & Knopoff (1978),interference,#B50000,Pure tones
12.232482482482482,-0,Hutch78,Hutchinson & Knopoff (1978),interference,#B50000,Pure tones
12.232982982982984,-0,Hutch78,Hutchinson & Knopoff (1978),interference,#B50000,Pure tones
12.233483483483484,-0,Hutch78,Hutchinson & Knopoff (1978),interference,#B50000,Pure tones
12.233983983983984,-0,Hutch78,Hutchinson & Knopoff (1978),interference,#B50000,Pure tones
12.234484484484485,-0,Hutch78,Hutchinson & Knopoff (1978),interference,#B50000,Pure tones
12.234984984984985,-0,Hutch78,Hutchinson & Knopoff (1978),interference,#B50000,Pure tones
12.235485485485485,-0,Hutch78,Hutchinson & Knopoff (1978),interference,#B50000,Pure tones
12.235985985985986,-0,Hutch78,Hutchinson & Knopoff (1978),interference,#B50000,Pure tones
12.236486486486486,-0,Hutch78,Hutchinson & Knopoff (1978),interference,#B50000,Pure tones
12.236986986986986,-0,Hutch78,Hutchinson & Knopoff (1978),interference,#B50000,Pure tones
12.237487487487488,-0,Hutch78,Hutchinson & Knopoff (1978),interference,#B50000,Pure tones
12.237987987987989,-0,Hutch78,Hutchinson & Knopoff (1978),interference,#B50000,Pure tones
12.238488488488489,-0,Hutch78,Hutchinson & Knopoff (1978),interference,#B50000,Pure tones
12.23898898898899,-0,Hutch78,Hutchinson & Knopoff (1978),interference,#B50000,Pure tones
12.23948948948949,-0,Hutch78,Hutchinson & Knopoff (1978),interference,#B50000,Pure tones
12.23998998998999,-0,Hutch78,Hutchinson & Knopoff (1978),interference,#B50000,Pure tones
12.24049049049049,-0,Hutch78,Hutchinson & Knopoff (1978),interference,#B50000,Pure tones
12.24099099099099,-0,Hutch78,Hutchinson & Knopoff (1978),interference,#B50000,Pure tones
12.241491491491491,-0,Hutch78,Hutchinson & Knopoff (1978),interference,#B50000,Pure tones
12.241991991991991,-0,Hutch78,Hutchinson & Knopoff (1978),interference,#B50000,Pure tones
12.242492492492492,-0,Hutch78,Hutchinson & Knopoff (1978),interference,#B50000,Pure tones
12.242992992992994,-0,Hutch78,Hutchinson & Knopoff (1978),interference,#B50000,Pure tones
12.243493493493494,-0,Hutch78,Hutchinson & Knopoff (1978),interference,#B50000,Pure tones
12.243993993993994,-0,Hutch78,Hutchinson & Knopoff (1978),interference,#B50000,Pure tones
12.244494494494495,-0,Hutch78,Hutchinson & Knopoff (1978),interference,#B50000,Pure tones
12.244994994994995,-0,Hutch78,Hutchinson & Knopoff (1978),interference,#B50000,Pure tones
12.245495495495495,-0,Hutch78,Hutchinson & Knopoff (1978),interference,#B50000,Pure tones
12.245995995995996,-0,Hutch78,Hutchinson & Knopoff (1978),interference,#B50000,Pure tones
12.246496496496496,-0,Hutch78,Hutchinson & Knopoff (1978),interference,#B50000,Pure tones
12.246996996996996,-0,Hutch78,Hutchinson & Knopoff (1978),interference,#B50000,Pure tones
12.247497497497498,-0,Hutch78,Hutchinson & Knopoff (1978),interference,#B50000,Pure tones
12.247997997997999,-0,Hutch78,Hutchinson & Knopoff (1978),interference,#B50000,Pure tones
12.248498498498499,-0,Hutch78,Hutchinson & Knopoff (1978),interference,#B50000,Pure tones
12.248998998999,-0,Hutch78,Hutchinson & Knopoff (1978),interference,#B50000,Pure tones
12.2494994994995,-0,Hutch78,Hutchinson & Knopoff (1978),interference,#B50000,Pure tones
12.25,-0,Hutch78,Hutchinson & Knopoff (1978),interference,#B50000,Pure tones
