interval,output,model_id,model_label,model_theory,model_colour,timbre_label
3.65,-1.11676543432987,Vass01,Vassilakis (2001),interference,#B50000,3 dB roll-off
3.6505005005005002,-1.1164649468311718,Vass01,Vassilakis (2001),interference,#B50000,3 dB roll-off
3.651001001001001,-1.1161642927416844,Vass01,Vassilakis (2001),interference,#B50000,3 dB roll-off
3.6515015015015013,-1.1158622683571517,Vass01,Vassilakis (2001),interference,#B50000,3 dB roll-off
3.652002002002002,-1.1155600782761155,Vass01,Vassilakis (2001),interference,#B50000,3 dB roll-off
3.6525025025025024,-1.1152565126450762,Vass01,Vassilakis (2001),interference,#B50000,3 dB roll-off
3.6530030030030027,-1.114952782209976,Vass01,Vassilakis (2001),interference,#B50000,3 dB roll-off
3.6535035035035035,-1.1146476709505986,Vass01,Vassilakis (2001),interference,#B50000,3 dB roll-off
3.654004004004004,-1.1143423957777745,Vass01,Vassilakis (2001),interference,#B50000,3 dB roll-off
3.6545045045045046,-1.114035734487034,Vass01,Vassilakis (2001),interference,#B50000,3 dB roll-off
3.655005005005005,-1.1137289101716517,Vass01,Vassilakis (2001),interference,#B50000,3 dB roll-off
3.6555055055055052,-1.1134206944252794,Vass01,Vassilakis (2001),interference,#B50000,3 dB roll-off
3.656006006006006,-1.1131123165412973,Vass01,Vassilakis (2001),interference,#B50000,3 dB roll-off
3.6565065065065063,-1.1128025418937535,Vass01,Vassilakis (2001),interference,#B50000,3 dB roll-off
3.657007007007007,-1.1124926059938853,Vass01,Vassilakis (2001),interference,#B50000,3 dB roll-off
3.6575075075075074,-1.1121812679783145,Vass01,Vassilakis (2001),interference,#B50000,3 dB roll-off
3.6580080080080077,-1.111869769593968,Vass01,Vassilakis (2001),interference,#B50000,3 dB roll-off
3.6585085085085085,-1.1115568637221886,Vass01,Vassilakis (2001),interference,#B50000,3 dB roll-off
3.659009009009009,-1.1112437983634473,Vass01,Vassilakis (2001),interference,#B50000,3 dB roll-off
3.6595095095095096,-1.1109293201258628,Vass01,Vassilakis (2001),interference,#B50000,3 dB roll-off
3.66001001001001,-1.1106146832814625,Vass01,Vassilakis (2001),interference,#B50000,3 dB roll-off
3.6605105105105102,-1.110298628147059,Vass01,Vassilakis (2001),interference,#B50000,3 dB roll-off
3.661011011011011,-1.1099824152843238,Vass01,Vassilakis (2001),interference,#B50000,3 dB roll-off
3.6615115115115113,-1.109664778700626,Vass01,Vassilakis (2001),interference,#B50000,3 dB roll-off
3.662012012012012,-1.1093469852654398,Vass01,Vassilakis (2001),interference,#B50000,3 dB roll-off
3.6625125125125124,-1.1090277626584626,Vass01,Vassilakis (2001),interference,#B50000,3 dB roll-off
3.6630130130130127,-1.1087083840752299,Vass01,Vassilakis (2001),interference,#B50000,3 dB roll-off
3.6635135135135135,-1.108387570849449,Vass01,Vassilakis (2001),interference,#B50000,3 dB roll-off
3.664014014014014,-1.108066602521061,Vass01,Vassilakis (2001),interference,#B50000,3 dB roll-off
3.6645145145145146,-1.107744194059371,Vass01,Vassilakis (2001),interference,#B50000,3 dB roll-off
3.665015015015015,-1.1074216313671346,Vass01,Vassilakis (2001),interference,#B50000,3 dB roll-off
3.6655155155155152,-1.107097623030809,Vass01,Vassilakis (2001),interference,#B50000,3 dB roll-off
3.666016016016016,-1.1067734613344595,Vass01,Vassilakis (2001),interference,#B50000,3 dB roll-off
3.6665165165165163,-1.1064478484631106,Vass01,Vassilakis (2001),interference,#B50000,3 dB roll-off
3.667017017017017,-1.106122083100741,Vass01,Vassilakis (2001),interference,#B50000,3 dB roll-off
3.6675175175175174,-1.1057948610122754,Vass01,Vassilakis (2001),interference,#B50000,3 dB roll-off
3.6680180180180177,-1.105467487300299,Vass01,Vassilakis (2001),interference,#B50000,3 dB roll-off
3.6685185185185185,-1.1051386512908936,Vass01,Vassilakis (2001),interference,#B50000,3 dB roll-off
3.669019019019019,-1.1048096645240035,Vass01,Vassilakis (2001),interference,#B50000,3 dB roll-off
3.6695195195195196,-1.1044792098680485,Vass01,Vassilakis (2001),interference,#B50000,3 dB roll-off
3.67002002002002,-1.1041486053191996,Vass01,Vassilakis (2001),interference,#B50000,3 dB roll-off
3.6705205205205202,-1.1038165272692622,Vass01,Vassilakis (2001),interference,#B50000,3 dB roll-off
3.671021021021021,-1.1034843001895762,Vass01,Vassilakis (2001),interference,#B50000,3 dB roll-off
3.6715215215215213,-1.1031505939763706,Vass01,Vassilakis (2001),interference,#B50000,3 dB roll-off
3.672022022022022,-1.102816739595162,Vass01,Vassilakis (2001),interference,#B50000,3 dB roll-off
3.6725225225225224,-1.1024814004274957,Vass01,Vassilakis (2001),interference,#B50000,3 dB roll-off
3.6730230230230227,-1.1021459139521965,Vass01,Vassilakis (2001),interference,#B50000,3 dB roll-off
3.6735235235235235,-1.1018089370169395,Vass01,Vassilakis (2001),interference,#B50000,3 dB roll-off
3.674024024024024,-1.1014718136330603,Vass01,Vassilakis (2001),interference,#B50000,3 dB roll-off
3.6745245245245246,-1.1011331940950913,Vass01,Vassilakis (2001),interference,#B50000,3 dB roll-off
3.675025025025025,-1.100794428966181,Vass01,Vassilakis (2001),interference,#B50000,3 dB roll-off
3.6755255255255253,-1.100454161968369,Vass01,Vassilakis (2001),interference,#B50000,3 dB roll-off
3.676026026026026,-1.100113750235987,Vass01,Vassilakis (2001),interference,#B50000,3 dB roll-off
3.6765265265265263,-1.0997718308991264,Vass01,Vassilakis (2001),interference,#B50000,3 dB roll-off
3.677027027027027,-1.0994297676827682,Vass01,Vassilakis (2001),interference,#B50000,3 dB roll-off
3.6775275275275274,-1.0990861911055478,Vass01,Vassilakis (2001),interference,#B50000,3 dB roll-off
3.6780280280280278,-1.0987424715026481,Vass01,Vassilakis (2001),interference,#B50000,3 dB roll-off
3.6785285285285285,-1.0983972327616132,Vass01,Vassilakis (2001),interference,#B50000,3 dB roll-off
3.679029029029029,-1.0980518518474747,Vass01,Vassilakis (2001),interference,#B50000,3 dB roll-off
3.6795295295295296,-1.0977049459969797,Vass01,Vassilakis (2001),interference,#B50000,3 dB roll-off
3.68003003003003,-1.0973578988247399,Vass01,Vassilakis (2001),interference,#B50000,3 dB roll-off
3.6805305305305303,-1.0970093208969072,Vass01,Vassilakis (2001),interference,#B50000,3 dB roll-off
3.681031031031031,-1.0966606024974999,Vass01,Vassilakis (2001),interference,#B50000,3 dB roll-off
3.6815315315315313,-1.0963103475021785,Vass01,Vassilakis (2001),interference,#B50000,3 dB roll-off
3.682032032032032,-1.095959952884279,Vass01,Vassilakis (2001),interference,#B50000,3 dB roll-off
3.6825325325325324,-1.0956080158090047,Vass01,Vassilakis (2001),interference,#B50000,3 dB roll-off
3.6830330330330328,-1.095255939959013,Vass01,Vassilakis (2001),interference,#B50000,3 dB roll-off
3.6835335335335335,-1.094902315768965,Vass01,Vassilakis (2001),interference,#B50000,3 dB roll-off
3.684034034034034,-1.0945485536509156,Vass01,Vassilakis (2001),interference,#B50000,3 dB roll-off
3.6845345345345346,-1.0941932372888665,Vass01,Vassilakis (2001),interference,#B50000,3 dB roll-off
3.685035035035035,-1.0938377838444502,Vass01,Vassilakis (2001),interference,#B50000,3 dB roll-off
3.6855355355355357,-1.0934807702307354,Vass01,Vassilakis (2001),interference,#B50000,3 dB roll-off
3.686036036036036,-1.093123620379206,Vass01,Vassilakis (2001),interference,#B50000,3 dB roll-off
3.6865365365365363,-1.092764904411678,Vass01,Vassilakis (2001),interference,#B50000,3 dB roll-off
3.687037037037037,-1.0924060530498318,Vass01,Vassilakis (2001),interference,#B50000,3 dB roll-off
3.6875375375375374,-1.0920456296038084,Vass01,Vassilakis (2001),interference,#B50000,3 dB roll-off
3.688038038038038,-1.091685071605938,Vass01,Vassilakis (2001),interference,#B50000,3 dB roll-off
3.6885385385385385,-1.0913229355341625,Vass01,Vassilakis (2001),interference,#B50000,3 dB roll-off
3.689039039039039,-1.0909606657520183,Vass01,Vassilakis (2001),interference,#B50000,3 dB roll-off
3.6895395395395396,-1.0905968118846272,Vass01,Vassilakis (2001),interference,#B50000,3 dB roll-off
3.69004004004004,-1.0902328251473414,Vass01,Vassilakis (2001),interference,#B50000,3 dB roll-off
3.6905405405405407,-1.089867248291809,Vass01,Vassilakis (2001),interference,#B50000,3 dB roll-off
3.691041041041041,-1.0895015394058998,Vass01,Vassilakis (2001),interference,#B50000,3 dB roll-off
3.6915415415415413,-1.0891342343469965,Vass01,Vassilakis (2001),interference,#B50000,3 dB roll-off
3.692042042042042,-1.0887667980963087,Vass01,Vassilakis (2001),interference,#B50000,3 dB roll-off
3.6925425425425424,-1.0883977595960517,Vass01,Vassilakis (2001),interference,#B50000,3 dB roll-off
3.693043043043043,-1.0880285907416922,Vass01,Vassilakis (2001),interference,#B50000,3 dB roll-off
3.6935435435435435,-1.0876578135393233,Vass01,Vassilakis (2001),interference,#B50000,3 dB roll-off
3.694044044044044,-1.0872869068196345,Vass01,Vassilakis (2001),interference,#B50000,3 dB roll-off
3.6945445445445446,-1.0869143856315477,Vass01,Vassilakis (2001),interference,#B50000,3 dB roll-off
3.695045045045045,-1.0865417357620737,Vass01,Vassilakis (2001),interference,#B50000,3 dB roll-off
3.6955455455455457,-1.0861674652817916,Vass01,Vassilakis (2001),interference,#B50000,3 dB roll-off
3.696046046046046,-1.0857930669551914,Vass01,Vassilakis (2001),interference,#B50000,3 dB roll-off
3.6965465465465464,-1.085417041853304,Vass01,Vassilakis (2001),interference,#B50000,3 dB roll-off
3.697047047047047,-1.085040889739361,Vass01,Vassilakis (2001),interference,#B50000,3 dB roll-off
3.6975475475475474,-1.0846631046634982,Vass01,Vassilakis (2001),interference,#B50000,3 dB roll-off
3.698048048048048,-1.0842851934090478,Vass01,Vassilakis (2001),interference,#B50000,3 dB roll-off
3.6985485485485485,-1.0839056429838174,Vass01,Vassilakis (2001),interference,#B50000,3 dB roll-off
3.699049049049049,-1.0835259672126962,Vass01,Vassilakis (2001),interference,#B50000,3 dB roll-off
3.6995495495495496,-1.0831446460396548,Vass01,Vassilakis (2001),interference,#B50000,3 dB roll-off
3.70005005005005,-1.0827632003526675,Vass01,Vassilakis (2001),interference,#B50000,3 dB roll-off
3.7005505505505507,-1.0823801030102629,Vass01,Vassilakis (2001),interference,#B50000,3 dB roll-off
3.701051051051051,-1.0819968819851344,Vass01,Vassilakis (2001),interference,#B50000,3 dB roll-off
3.7015515515515514,-1.0816120030286631,Vass01,Vassilakis (2001),interference,#B50000,3 dB roll-off
3.702052052052052,-1.0812270012200043,Vass01,Vassilakis (2001),interference,#B50000,3 dB roll-off
3.7025525525525524,-1.0808403351815712,Vass01,Vassilakis (2001),interference,#B50000,3 dB roll-off
3.703053053053053,-1.0804535471207852,Vass01,Vassilakis (2001),interference,#B50000,3 dB roll-off
3.7035535535535535,-1.0800650885092509,Vass01,Vassilakis (2001),interference,#B50000,3 dB roll-off
3.704054054054054,-1.0796765087045523,Vass01,Vassilakis (2001),interference,#B50000,3 dB roll-off
3.7045545545545546,-1.0792862520054944,Vass01,Vassilakis (2001),interference,#B50000,3 dB roll-off
3.705055055055055,-1.0788958749418287,Vass01,Vassilakis (2001),interference,#B50000,3 dB roll-off
3.7055555555555557,-1.0785038146174841,Vass01,Vassilakis (2001),interference,#B50000,3 dB roll-off
3.706056056056056,-1.0781116347564874,Vass01,Vassilakis (2001),interference,#B50000,3 dB roll-off
3.7065565565565564,-1.0777177652457182,Vass01,Vassilakis (2001),interference,#B50000,3 dB roll-off
3.707057057057057,-1.0773237770256632,Vass01,Vassilakis (2001),interference,#B50000,3 dB roll-off
3.7075575575575574,-1.0769280927439058,Vass01,Vassilakis (2001),interference,#B50000,3 dB roll-off
3.708058058058058,-1.076532290579674,Vass01,Vassilakis (2001),interference,#B50000,3 dB roll-off
3.7085585585585585,-1.0761347859188857,Vass01,Vassilakis (2001),interference,#B50000,3 dB roll-off
3.709059059059059,-1.0757371642018865,Vass01,Vassilakis (2001),interference,#B50000,3 dB roll-off
3.7095595595595596,-1.0753378335305062,Vass01,Vassilakis (2001),interference,#B50000,3 dB roll-off
3.71006006006006,-1.0749383866286735,Vass01,Vassilakis (2001),interference,#B50000,3 dB roll-off
3.7105605605605607,-1.074537224291575,Vass01,Vassilakis (2001),interference,#B50000,3 dB roll-off
3.711061061061061,-1.0741359465492906,Vass01,Vassilakis (2001),interference,#B50000,3 dB roll-off
3.7115615615615614,-1.0737329468677344,Vass01,Vassilakis (2001),interference,#B50000,3 dB roll-off
3.712062062062062,-1.0733298326057878,Vass01,Vassilakis (2001),interference,#B50000,3 dB roll-off
3.7125625625625625,-1.0729249898773663,Vass01,Vassilakis (2001),interference,#B50000,3 dB roll-off
3.713063063063063,-1.0725200333929135,Vass01,Vassilakis (2001),interference,#B50000,3 dB roll-off
3.7135635635635635,-1.0721133418915147,Vass01,Vassilakis (2001),interference,#B50000,3 dB roll-off
3.714064064064064,-1.0717065374580277,Vass01,Vassilakis (2001),interference,#B50000,3 dB roll-off
3.7145645645645646,-1.0712979914337788,Vass01,Vassilakis (2001),interference,#B50000,3 dB roll-off
3.715065065065065,-1.0708893333009688,Vass01,Vassilakis (2001),interference,#B50000,3 dB roll-off
3.7155655655655657,-1.0704789269801929,Vass01,Vassilakis (2001),interference,#B50000,3 dB roll-off
3.716066066066066,-1.0700684093740187,Vass01,Vassilakis (2001),interference,#B50000,3 dB roll-off
3.7165665665665664,-1.0696561369591782,Vass01,Vassilakis (2001),interference,#B50000,3 dB roll-off
3.717067067067067,-1.0692437540817648,Vass01,Vassilakis (2001),interference,#B50000,3 dB roll-off
3.7175675675675675,-1.0688296097514287,Vass01,Vassilakis (2001),interference,#B50000,3 dB roll-off
3.7180680680680682,-1.068415355781009,Vass01,Vassilakis (2001),interference,#B50000,3 dB roll-off
3.7185685685685685,-1.0679993336897922,Vass01,Vassilakis (2001),interference,#B50000,3 dB roll-off
3.719069069069069,-1.067583202780678,Vass01,Vassilakis (2001),interference,#B50000,3 dB roll-off
3.7195695695695696,-1.0671652970591932,Vass01,Vassilakis (2001),interference,#B50000,3 dB roll-off
3.72007007007007,-1.0667472833417226,Vass01,Vassilakis (2001),interference,#B50000,3 dB roll-off
3.7205705705705707,-1.066327488096533,Vass01,Vassilakis (2001),interference,#B50000,3 dB roll-off
3.721071071071071,-1.0659075856770253,Vass01,Vassilakis (2001),interference,#B50000,3 dB roll-off
3.7215715715715714,-1.0654858949906059,Vass01,Vassilakis (2001),interference,#B50000,3 dB roll-off
3.722072072072072,-1.0650640979512722,Vass01,Vassilakis (2001),interference,#B50000,3 dB roll-off
3.7225725725725725,-1.064640505881941,Vass01,Vassilakis (2001),interference,#B50000,3 dB roll-off
3.7230730730730732,-1.0642168082809078,Vass01,Vassilakis (2001),interference,#B50000,3 dB roll-off
3.7235735735735735,-1.063791308862785,Vass01,Vassilakis (2001),interference,#B50000,3 dB roll-off
3.724074074074074,-1.0633657047339926,Vass01,Vassilakis (2001),interference,#B50000,3 dB roll-off
3.7245745745745746,-1.0629382919769528,Vass01,Vassilakis (2001),interference,#B50000,3 dB roll-off
3.725075075075075,-1.062510775330117,Vass01,Vassilakis (2001),interference,#B50000,3 dB roll-off
3.7255755755755757,-1.0620814432197478,Vass01,Vassilakis (2001),interference,#B50000,3 dB roll-off
3.726076076076076,-1.0616520080403056,Vass01,Vassilakis (2001),interference,#B50000,3 dB roll-off
3.7265765765765764,-1.0612207505378377,Vass01,Vassilakis (2001),interference,#B50000,3 dB roll-off
3.727077077077077,-1.060789390786925,Vass01,Vassilakis (2001),interference,#B50000,3 dB roll-off
3.7275775775775775,-1.0603562018291968,Vass01,Vassilakis (2001),interference,#B50000,3 dB roll-off
3.7280780780780782,-1.0599229114435382,Vass01,Vassilakis (2001),interference,#B50000,3 dB roll-off
3.7285785785785786,-1.0594877849429383,Vass01,Vassilakis (2001),interference,#B50000,3 dB roll-off
3.729079079079079,-1.0590525578348675,Vass01,Vassilakis (2001),interference,#B50000,3 dB roll-off
3.7295795795795796,-1.0586154876792946,Vass01,Vassilakis (2001),interference,#B50000,3 dB roll-off
3.73008008008008,-1.0581783177366586,Vass01,Vassilakis (2001),interference,#B50000,3 dB roll-off
3.7305805805805807,-1.0577392977894513,Vass01,Vassilakis (2001),interference,#B50000,3 dB roll-off
3.731081081081081,-1.0573001788755785,Vass01,Vassilakis (2001),interference,#B50000,3 dB roll-off
3.7315815815815814,-1.05685920297548,Vass01,Vassilakis (2001),interference,#B50000,3 dB roll-off
3.732082082082082,-1.056418128929116,Vass01,Vassilakis (2001),interference,#B50000,3 dB roll-off
3.7325825825825825,-1.055975190890226,Vass01,Vassilakis (2001),interference,#B50000,3 dB roll-off
3.7330830830830832,-1.055532155525502,Vass01,Vassilakis (2001),interference,#B50000,3 dB roll-off
3.7335835835835836,-1.0550872491372076,Vass01,Vassilakis (2001),interference,#B50000,3 dB roll-off
3.734084084084084,-1.054642246243545,Vass01,Vassilakis (2001),interference,#B50000,3 dB roll-off
3.7345845845845846,-1.0541953652704878,Vass01,Vassilakis (2001),interference,#B50000,3 dB roll-off
3.735085085085085,-1.053748388612608,Vass01,Vassilakis (2001),interference,#B50000,3 dB roll-off
3.7355855855855857,-1.0532995267946164,Vass01,Vassilakis (2001),interference,#B50000,3 dB roll-off
3.736086086086086,-1.0528505701124564,Vass01,Vassilakis (2001),interference,#B50000,3 dB roll-off
3.7365865865865864,-1.052399721164506,Vass01,Vassilakis (2001),interference,#B50000,3 dB roll-off
3.737087087087087,-1.0519487781731547,Vass01,Vassilakis (2001),interference,#B50000,3 dB roll-off
3.7375875875875875,-1.0514959357853109,Vass01,Vassilakis (2001),interference,#B50000,3 dB roll-off
3.7380880880880882,-1.0510430001749849,Vass01,Vassilakis (2001),interference,#B50000,3 dB roll-off
3.7385885885885886,-1.0505881580123524,Vass01,Vassilakis (2001),interference,#B50000,3 dB roll-off
3.739089089089089,-1.0501332234483163,Vass01,Vassilakis (2001),interference,#B50000,3 dB roll-off
3.7395895895895896,-1.0496763751509859,Vass01,Vassilakis (2001),interference,#B50000,3 dB roll-off
3.74009009009009,-1.0492194352735382,Vass01,Vassilakis (2001),interference,#B50000,3 dB roll-off
3.7405905905905907,-1.048760574456528,Vass01,Vassilakis (2001),interference,#B50000,3 dB roll-off
3.741091091091091,-1.0483016228808784,Vass01,Vassilakis (2001),interference,#B50000,3 dB roll-off
3.7415915915915914,-1.0478407431340937,Vass01,Vassilakis (2001),interference,#B50000,3 dB roll-off
3.742092092092092,-1.0473797734503987,Vass01,Vassilakis (2001),interference,#B50000,3 dB roll-off
3.7425925925925925,-1.0469168683385603,Vass01,Vassilakis (2001),interference,#B50000,3 dB roll-off
3.7430930930930932,-1.0464538741118141,Vass01,Vassilakis (2001),interference,#B50000,3 dB roll-off
3.7435935935935936,-1.0459889371744304,Vass01,Vassilakis (2001),interference,#B50000,3 dB roll-off
3.744094094094094,-1.0455239119444177,Vass01,Vassilakis (2001),interference,#B50000,3 dB roll-off
3.7445945945945946,-1.0450569366957072,Vass01,Vassilakis (2001),interference,#B50000,3 dB roll-off
3.745095095095095,-1.0445898739769632,Vass01,Vassilakis (2001),interference,#B50000,3 dB roll-off
3.7455955955955957,-1.0441208539058158,Vass01,Vassilakis (2001),interference,#B50000,3 dB roll-off
3.746096096096096,-1.0436517471875686,Vass01,Vassilakis (2001),interference,#B50000,3 dB roll-off
3.7465965965965964,-1.0431806757574842,Vass01,Vassilakis (2001),interference,#B50000,3 dB roll-off
3.747097097097097,-1.042709518503575,Vass01,Vassilakis (2001),interference,#B50000,3 dB roll-off
3.7475975975975975,-1.0422363891526134,Vass01,Vassilakis (2001),interference,#B50000,3 dB roll-off
3.7480980980980982,-1.0417631748014928,Vass01,Vassilakis (2001),interference,#B50000,3 dB roll-off
3.7485985985985986,-1.0412879809422142,Vass01,Vassilakis (2001),interference,#B50000,3 dB roll-off
3.749099099099099,-1.0408127029068508,Vass01,Vassilakis (2001),interference,#B50000,3 dB roll-off
3.7495995995995997,-1.0403354379262673,Vass01,Vassilakis (2001),interference,#B50000,3 dB roll-off
3.7501001001001,-1.0398580895941023,Vass01,Vassilakis (2001),interference,#B50000,3 dB roll-off
3.7506006006006007,-1.0393787468536235,Vass01,Vassilakis (2001),interference,#B50000,3 dB roll-off
3.751101101101101,-1.0388993215865143,Vass01,Vassilakis (2001),interference,#B50000,3 dB roll-off
3.7516016016016014,-1.0384178944218885,Vass01,Vassilakis (2001),interference,#B50000,3 dB roll-off
3.752102102102102,-1.0379363855560748,Vass01,Vassilakis (2001),interference,#B50000,3 dB roll-off
3.7526026026026025,-1.0374528672773302,Vass01,Vassilakis (2001),interference,#B50000,3 dB roll-off
3.7531031031031032,-1.036969268123322,Vass01,Vassilakis (2001),interference,#B50000,3 dB roll-off
3.7536036036036036,-1.0364836520147194,Vass01,Vassilakis (2001),interference,#B50000,3 dB roll-off
3.754104104104104,-1.0359979558573134,Vass01,Vassilakis (2001),interference,#B50000,3 dB roll-off
3.7546046046046047,-1.0355102351772947,Vass01,Vassilakis (2001),interference,#B50000,3 dB roll-off
3.755105105105105,-1.035022435275475,Vass01,Vassilakis (2001),interference,#B50000,3 dB roll-off
3.7556056056056057,-1.0345326032565898,Vass01,Vassilakis (2001),interference,#B50000,3 dB roll-off
3.756106106106106,-1.034042692843485,Vass01,Vassilakis (2001),interference,#B50000,3 dB roll-off
3.7566066066066064,-1.0335507426923507,Vass01,Vassilakis (2001),interference,#B50000,3 dB roll-off
3.757107107107107,-1.0330587149751764,Vass01,Vassilakis (2001),interference,#B50000,3 dB roll-off
3.7576076076076075,-1.0325646398724198,Vass01,Vassilakis (2001),interference,#B50000,3 dB roll-off
3.7581081081081082,-1.0320704880324245,Vass01,Vassilakis (2001),interference,#B50000,3 dB roll-off
3.7586086086086086,-1.0315742811326087,Vass01,Vassilakis (2001),interference,#B50000,3 dB roll-off
3.759109109109109,-1.0310779983250078,Vass01,Vassilakis (2001),interference,#B50000,3 dB roll-off
3.7596096096096097,-1.0305796527566247,Vass01,Vassilakis (2001),interference,#B50000,3 dB roll-off
3.76011011011011,-1.030081232110535,Vass01,Vassilakis (2001),interference,#B50000,3 dB roll-off
3.7606106106106107,-1.0295807409758821,Vass01,Vassilakis (2001),interference,#B50000,3 dB roll-off
3.761111111111111,-1.0290801755943133,Vass01,Vassilakis (2001),interference,#B50000,3 dB roll-off
3.7616116116116114,-1.0285775319694759,Vass01,Vassilakis (2001),interference,#B50000,3 dB roll-off
3.762112112112112,-1.0280748149292323,Vass01,Vassilakis (2001),interference,#B50000,3 dB roll-off
3.7626126126126125,-1.0275700118640205,Vass01,Vassilakis (2001),interference,#B50000,3 dB roll-off
3.7631131131131133,-1.0270651362156542,Vass01,Vassilakis (2001),interference,#B50000,3 dB roll-off
3.7636136136136136,-1.0265581667335406,Vass01,Vassilakis (2001),interference,#B50000,3 dB roll-off
3.764114114114114,-1.0260511255012912,Vass01,Vassilakis (2001),interference,#B50000,3 dB roll-off
3.7646146146146147,-1.0255419825993624,Vass01,Vassilakis (2001),interference,#B50000,3 dB roll-off
3.765115115115115,-1.025032768781111,Vass01,Vassilakis (2001),interference,#B50000,3 dB roll-off
3.7656156156156158,-1.0245214454300073,Vass01,Vassilakis (2001),interference,#B50000,3 dB roll-off
3.766116116116116,-1.024010051997179,Vass01,Vassilakis (2001),interference,#B50000,3 dB roll-off
3.766616616616617,-1.0234965411410286,Vass01,Vassilakis (2001),interference,#B50000,3 dB roll-off
3.767117117117117,-1.0229829610385994,Vass01,Vassilakis (2001),interference,#B50000,3 dB roll-off
3.7676176176176175,-1.0224672555949628,Vass01,Vassilakis (2001),interference,#B50000,3 dB roll-off
3.7681181181181183,-1.021951481741355,Vass01,Vassilakis (2001),interference,#B50000,3 dB roll-off
3.7686186186186186,-1.0214335746011827,Vass01,Vassilakis (2001),interference,#B50000,3 dB roll-off
3.7691191191191193,-1.0209155998882253,Vass01,Vassilakis (2001),interference,#B50000,3 dB roll-off
3.7696196196196197,-1.0203954839157685,Vass01,Vassilakis (2001),interference,#B50000,3 dB roll-off
3.77012012012012,-1.0198753012086283,Vass01,Vassilakis (2001),interference,#B50000,3 dB roll-off
3.7706206206206208,-1.0193529692414118,Vass01,Vassilakis (2001),interference,#B50000,3 dB roll-off
3.771121121121121,-1.0188305713785522,Vass01,Vassilakis (2001),interference,#B50000,3 dB roll-off
3.771621621621622,-1.0183060162272954,Vass01,Vassilakis (2001),interference,#B50000,3 dB roll-off
3.772122122122122,-1.0177813960203679,Vass01,Vassilakis (2001),interference,#B50000,3 dB roll-off
3.7726226226226225,-1.0172546104689377,Vass01,Vassilakis (2001),interference,#B50000,3 dB roll-off
3.7731231231231233,-1.0167277607027914,Vass01,Vassilakis (2001),interference,#B50000,3 dB roll-off
3.7736236236236236,-1.016198737508131,Vass01,Vassilakis (2001),interference,#B50000,3 dB roll-off
3.7741241241241243,-1.0156696509407197,Vass01,Vassilakis (2001),interference,#B50000,3 dB roll-off
3.7746246246246247,-1.0151383828328011,Vass01,Vassilakis (2001),interference,#B50000,3 dB roll-off
3.775125125125125,-1.014607052195119,Vass01,Vassilakis (2001),interference,#B50000,3 dB roll-off
3.7756256256256258,-1.0140735318768686,Vass01,Vassilakis (2001),interference,#B50000,3 dB roll-off
3.776126126126126,-1.0135399498729,Vass01,Vassilakis (2001),interference,#B50000,3 dB roll-off
3.776626626626627,-1.0130041700201584,Vass01,Vassilakis (2001),interference,#B50000,3 dB roll-off
3.777127127127127,-1.0124683293268306,Vass01,Vassilakis (2001),interference,#B50000,3 dB roll-off
3.7776276276276275,-1.0119302825882575,Vass01,Vassilakis (2001),interference,#B50000,3 dB roll-off
3.7781281281281283,-1.011392175855333,Vass01,Vassilakis (2001),interference,#B50000,3 dB roll-off
3.7786286286286286,-1.0108518548524237,Vass01,Vassilakis (2001),interference,#B50000,3 dB roll-off
3.7791291291291293,-1.0103114747024748,Vass01,Vassilakis (2001),interference,#B50000,3 dB roll-off
3.7796296296296297,-1.0097688720293978,Vass01,Vassilakis (2001),interference,#B50000,3 dB roll-off
3.78013013013013,-1.0092262110577668,Vass01,Vassilakis (2001),interference,#B50000,3 dB roll-off
3.7806306306306308,-1.008681319281374,Vass01,Vassilakis (2001),interference,#B50000,3 dB roll-off
3.781131131131131,-1.0081363700560857,Vass01,Vassilakis (2001),interference,#B50000,3 dB roll-off
3.781631631631632,-1.0075891817158154,Vass01,Vassilakis (2001),interference,#B50000,3 dB roll-off
3.782132132132132,-1.0070419367775125,Vass01,Vassilakis (2001),interference,#B50000,3 dB roll-off
3.7826326326326325,-1.006492444385358,Vass01,Vassilakis (2001),interference,#B50000,3 dB roll-off
3.7831331331331333,-1.0059428962472434,Vass01,Vassilakis (2001),interference,#B50000,3 dB roll-off
3.7836336336336336,-1.005391092287666,Vass01,Vassilakis (2001),interference,#B50000,3 dB roll-off
3.7841341341341344,-1.0048392334354708,Vass01,Vassilakis (2001),interference,#B50000,3 dB roll-off
3.7846346346346347,-1.0042851103653558,Vass01,Vassilakis (2001),interference,#B50000,3 dB roll-off
3.785135135135135,-1.003730933257198,Vass01,Vassilakis (2001),interference,#B50000,3 dB roll-off
3.7856356356356358,-1.0031744835057808,Vass01,Vassilakis (2001),interference,#B50000,3 dB roll-off
3.786136136136136,-1.0026179805722042,Vass01,Vassilakis (2001),interference,#B50000,3 dB roll-off
3.786636636636637,-1.0020591965410188,Vass01,Vassilakis (2001),interference,#B50000,3 dB roll-off
3.787137137137137,-1.001500360184872,Vass01,Vassilakis (2001),interference,#B50000,3 dB roll-off
3.7876376376376375,-1.0009392342476766,Vass01,Vassilakis (2001),interference,#B50000,3 dB roll-off
3.7881381381381383,-1.0003780568440617,Vass01,Vassilakis (2001),interference,#B50000,3 dB roll-off
3.7886386386386386,-0.9998145813467849,Vass01,Vassilakis (2001),interference,#B50000,3 dB roll-off
3.7891391391391394,-0.9992510552430016,Vass01,Vassilakis (2001),interference,#B50000,3 dB roll-off
3.7896396396396397,-0.9986852225036783,Vass01,Vassilakis (2001),interference,#B50000,3 dB roll-off
3.79014014014014,-0.9981193400191654,Vass01,Vassilakis (2001),interference,#B50000,3 dB roll-off
3.7906406406406408,-0.9975511423278718,Vass01,Vassilakis (2001),interference,#B50000,3 dB roll-off
3.791141141141141,-0.9969828957540907,Vass01,Vassilakis (2001),interference,#B50000,3 dB roll-off
3.791641641641642,-0.9964123253728866,Vass01,Vassilakis (2001),interference,#B50000,3 dB roll-off
3.792142142142142,-0.9958417069733516,Vass01,Vassilakis (2001),interference,#B50000,3 dB roll-off
3.7926426426426425,-0.9952687561362127,Vass01,Vassilakis (2001),interference,#B50000,3 dB roll-off
3.7931431431431433,-0.994695758146356,Vass01,Vassilakis (2001),interference,#B50000,3 dB roll-off
3.7936436436436436,-0.9941204190591092,Vass01,Vassilakis (2001),interference,#B50000,3 dB roll-off
3.7941441441441444,-0.9935450336862474,Vass01,Vassilakis (2001),interference,#B50000,3 dB roll-off
3.7946446446446447,-0.9929672985265097,Vass01,Vassilakis (2001),interference,#B50000,3 dB roll-off
3.795145145145145,-0.9923895179497793,Vass01,Vassilakis (2001),interference,#B50000,3 dB roll-off
3.7956456456456458,-0.9918093788668896,Vass01,Vassilakis (2001),interference,#B50000,3 dB roll-off
3.796146146146146,-0.9912291952371783,Vass01,Vassilakis (2001),interference,#B50000,3 dB roll-off
3.796646646646647,-0.9906466443521414,Vass01,Vassilakis (2001),interference,#B50000,3 dB roll-off
3.797147147147147,-0.9900640497919824,Vass01,Vassilakis (2001),interference,#B50000,3 dB roll-off
3.7976476476476475,-0.9894790791974,Vass01,Vassilakis (2001),interference,#B50000,3 dB roll-off
3.7981481481481483,-0.9888940658009976,Vass01,Vassilakis (2001),interference,#B50000,3 dB roll-off
3.7986486486486486,-0.9883066675610023,Vass01,Vassilakis (2001),interference,#B50000,3 dB roll-off
3.7991491491491494,-0.9877192273941011,Vass01,Vassilakis (2001),interference,#B50000,3 dB roll-off
3.7996496496496497,-0.9871293935442932,Vass01,Vassilakis (2001),interference,#B50000,3 dB roll-off
3.80015015015015,-0.9865395186441265,Vass01,Vassilakis (2001),interference,#B50000,3 dB roll-off
3.8006506506506508,-0.9859472411915089,Vass01,Vassilakis (2001),interference,#B50000,3 dB roll-off
3.801151151151151,-0.9853549235667369,Vass01,Vassilakis (2001),interference,#B50000,3 dB roll-off
3.801651651651652,-0.9847601944896487,Vass01,Vassilakis (2001),interference,#B50000,3 dB roll-off
3.802152152152152,-0.9841654261202999,Vass01,Vassilakis (2001),interference,#B50000,3 dB roll-off
3.8026526526526525,-0.9835682373683501,Vass01,Vassilakis (2001),interference,#B50000,3 dB roll-off
3.8031531531531533,-0.9829710102057652,Vass01,Vassilakis (2001),interference,#B50000,3 dB roll-off
3.8036536536536536,-0.9823713536997776,Vass01,Vassilakis (2001),interference,#B50000,3 dB roll-off
3.8041541541541544,-0.9817716596664613,Vass01,Vassilakis (2001),interference,#B50000,3 dB roll-off
3.8046546546546547,-0.9811695272984001,Vass01,Vassilakis (2001),interference,#B50000,3 dB roll-off
3.805155155155155,-0.9805673582880947,Vass01,Vassilakis (2001),interference,#B50000,3 dB roll-off
3.8056556556556558,-0.9799627419209845,Vass01,Vassilakis (2001),interference,#B50000,3 dB roll-off
3.806156156156156,-0.9793580897985108,Vass01,Vassilakis (2001),interference,#B50000,3 dB roll-off
3.806656656656657,-0.9787509812663886,Vass01,Vassilakis (2001),interference,#B50000,3 dB roll-off
3.807157157157157,-0.9781438378675921,Vass01,Vassilakis (2001),interference,#B50000,3 dB roll-off
3.8076576576576575,-0.9775342289754486,Vass01,Vassilakis (2001),interference,#B50000,3 dB roll-off
3.8081581581581583,-0.9769245861071406,Vass01,Vassilakis (2001),interference,#B50000,3 dB roll-off
3.8086586586586586,-0.9763124686308304,Vass01,Vassilakis (2001),interference,#B50000,3 dB roll-off
3.8091591591591594,-0.9757003180707451,Vass01,Vassilakis (2001),interference,#B50000,3 dB roll-off
3.8096596596596597,-0.9750856837569365,Vass01,Vassilakis (2001),interference,#B50000,3 dB roll-off
3.81016016016016,-0.9744710172535823,Vass01,Vassilakis (2001),interference,#B50000,3 dB roll-off
3.810660660660661,-0.973853857819676,Vass01,Vassilakis (2001),interference,#B50000,3 dB roll-off
3.811161161161161,-0.9732366670923853,Vass01,Vassilakis (2001),interference,#B50000,3 dB roll-off
3.811661661661662,-0.9726169742264626,Vass01,Vassilakis (2001),interference,#B50000,3 dB roll-off
3.812162162162162,-0.9719972509652439,Vass01,Vassilakis (2001),interference,#B50000,3 dB roll-off
3.8126626626626625,-0.971375016325987,Vass01,Vassilakis (2001),interference,#B50000,3 dB roll-off
3.8131631631631633,-0.9707527521914868,Vass01,Vassilakis (2001),interference,#B50000,3 dB roll-off
3.8136636636636636,-0.9701279674081186,Vass01,Vassilakis (2001),interference,#B50000,3 dB roll-off
3.8141641641641644,-0.9695031540315279,Vass01,Vassilakis (2001),interference,#B50000,3 dB roll-off
3.8146646646646647,-0.9688758107037373,Vass01,Vassilakis (2001),interference,#B50000,3 dB roll-off
3.815165165165165,-0.968248439686775,Vass01,Vassilakis (2001),interference,#B50000,3 dB roll-off
3.815665665665666,-0.9676185293846588,Vass01,Vassilakis (2001),interference,#B50000,3 dB roll-off
3.816166166166166,-0.9669885922994129,Vass01,Vassilakis (2001),interference,#B50000,3 dB roll-off
3.816666666666667,-0.9663561065633939,Vass01,Vassilakis (2001),interference,#B50000,3 dB roll-off
3.817167167167167,-0.9657235949523595,Vass01,Vassilakis (2001),interference,#B50000,3 dB roll-off
3.8176676676676675,-0.9650885252931221,Vass01,Vassilakis (2001),interference,#B50000,3 dB roll-off
3.8181681681681683,-0.9644534306690776,Vass01,Vassilakis (2001),interference,#B50000,3 dB roll-off
3.8186686686686686,-0.9638157685675058,Vass01,Vassilakis (2001),interference,#B50000,3 dB roll-off
3.8191691691691694,-0.9631780824134281,Vass01,Vassilakis (2001),interference,#B50000,3 dB roll-off
3.8196696696696697,-0.9625378193205376,Vass01,Vassilakis (2001),interference,#B50000,3 dB roll-off
3.82017017017017,-0.9618975330895729,Vass01,Vassilakis (2001),interference,#B50000,3 dB roll-off
3.820670670670671,-0.9612546604264212,Vass01,Vassilakis (2001),interference,#B50000,3 dB roll-off
3.821171171171171,-0.9606117655417868,Vass01,Vassilakis (2001),interference,#B50000,3 dB roll-off
3.821671671671672,-0.9599662746994246,Vass01,Vassilakis (2001),interference,#B50000,3 dB roll-off
3.822172172172172,-0.9593207625543732,Vass01,Vassilakis (2001),interference,#B50000,3 dB roll-off
3.822672672672673,-0.9586726448937749,Vass01,Vassilakis (2001),interference,#B50000,3 dB roll-off
3.8231731731731733,-0.958024506851438,Vass01,Vassilakis (2001),interference,#B50000,3 dB roll-off
3.8236736736736736,-0.9573737537034125,Vass01,Vassilakis (2001),interference,#B50000,3 dB roll-off
3.8241741741741744,-0.9567229810968577,Vass01,Vassilakis (2001),interference,#B50000,3 dB roll-off
3.8246746746746747,-0.9560695837619941,Vass01,Vassilakis (2001),interference,#B50000,3 dB roll-off
3.8251751751751755,-0.9554161678940672,Vass01,Vassilakis (2001),interference,#B50000,3 dB roll-off
3.825675675675676,-0.9547601176426675,Vass01,Vassilakis (2001),interference,#B50000,3 dB roll-off
3.826176176176176,-0.9541040497859398,Vass01,Vassilakis (2001),interference,#B50000,3 dB roll-off
3.826676676676677,-0.9534453378579313,Vass01,Vassilakis (2001),interference,#B50000,3 dB roll-off
3.827177177177177,-0.9527866092546434,Vass01,Vassilakis (2001),interference,#B50000,3 dB roll-off
3.827677677677678,-0.9521252268595127,Vass01,Vassilakis (2001),interference,#B50000,3 dB roll-off
3.8281781781781783,-0.9514638287215129,Vass01,Vassilakis (2001),interference,#B50000,3 dB roll-off
3.8286786786786786,-0.9507997670382489,Vass01,Vassilakis (2001),interference,#B50000,3 dB roll-off
3.8291791791791794,-0.9501356905468359,Vass01,Vassilakis (2001),interference,#B50000,3 dB roll-off
3.8296796796796797,-0.949468940723848,Vass01,Vassilakis (2001),interference,#B50000,3 dB roll-off
3.8301801801801805,-0.9488021770298279,Vass01,Vassilakis (2001),interference,#B50000,3 dB roll-off
3.830680680680681,-0.9481327301848745,Vass01,Vassilakis (2001),interference,#B50000,3 dB roll-off
3.831181181181181,-0.9474632704084085,Vass01,Vassilakis (2001),interference,#B50000,3 dB roll-off
3.831681681681682,-0.9467911176285114,Vass01,Vassilakis (2001),interference,#B50000,3 dB roll-off
3.832182182182182,-0.9461189528590729,Vass01,Vassilakis (2001),interference,#B50000,3 dB roll-off
3.832682682682683,-0.9454440852004785,Vass01,Vassilakis (2001),interference,#B50000,3 dB roll-off
3.8331831831831833,-0.9447692064967513,Vass01,Vassilakis (2001),interference,#B50000,3 dB roll-off
3.8336836836836836,-0.9440916149848227,Vass01,Vassilakis (2001),interference,#B50000,3 dB roll-off
3.8341841841841844,-0.943414013374683,Vass01,Vassilakis (2001),interference,#B50000,3 dB roll-off
3.8346846846846847,-0.9427336890038522,Vass01,Vassilakis (2001),interference,#B50000,3 dB roll-off
3.8351851851851855,-0.942053355484198,Vass01,Vassilakis (2001),interference,#B50000,3 dB roll-off
3.835685685685686,-0.9413702892178785,Vass01,Vassilakis (2001),interference,#B50000,3 dB roll-off
3.836186186186186,-0.940687214754682,Vass01,Vassilakis (2001),interference,#B50000,3 dB roll-off
3.836686686686687,-0.9400013975252007,Vass01,Vassilakis (2001),interference,#B50000,3 dB roll-off
3.837187187187187,-0.9393155730533451,Vass01,Vassilakis (2001),interference,#B50000,3 dB roll-off
3.837687687687688,-0.938626995761875,Vass01,Vassilakis (2001),interference,#B50000,3 dB roll-off
3.8381881881881883,-0.937938412185115,Vass01,Vassilakis (2001),interference,#B50000,3 dB roll-off
3.8386886886886886,-0.9372470657015836,Vass01,Vassilakis (2001),interference,#B50000,3 dB roll-off
3.8391891891891894,-0.9365557138924662,Vass01,Vassilakis (2001),interference,#B50000,3 dB roll-off
3.8396896896896897,-0.9358615890555098,Vass01,Vassilakis (2001),interference,#B50000,3 dB roll-off
3.8401901901901905,-0.9351674598552955,Vass01,Vassilakis (2001),interference,#B50000,3 dB roll-off
3.840690690690691,-0.9344705474721549,Vass01,Vassilakis (2001),interference,#B50000,3 dB roll-off
3.841191191191191,-0.9337736316907677,Vass01,Vassilakis (2001),interference,#B50000,3 dB roll-off
3.841691691691692,-0.9330739225372346,Vass01,Vassilakis (2001),interference,#B50000,3 dB roll-off
3.842192192192192,-0.9323742109531236,Vass01,Vassilakis (2001),interference,#B50000,3 dB roll-off
3.842692692692693,-0.9316716957734512,Vass01,Vassilakis (2001),interference,#B50000,3 dB roll-off
3.8431931931931933,-0.930969179133601,Vass01,Vassilakis (2001),interference,#B50000,3 dB roll-off
3.8436936936936936,-0.9302638486404531,Vass01,Vassilakis (2001),interference,#B50000,3 dB roll-off
3.8441941941941944,-0.9295585176602569,Vass01,Vassilakis (2001),interference,#B50000,3 dB roll-off
3.8446946946946947,-0.9288503625345998,Vass01,Vassilakis (2001),interference,#B50000,3 dB roll-off
3.8451951951951955,-0.9281422078977966,Vass01,Vassilakis (2001),interference,#B50000,3 dB roll-off
3.845695695695696,-0.9274312187888503,Vass01,Vassilakis (2001),interference,#B50000,3 dB roll-off
3.846196196196196,-0.9267202311474471,Vass01,Vassilakis (2001),interference,#B50000,3 dB roll-off
3.846696696696697,-0.926006398672601,Vass01,Vassilakis (2001),interference,#B50000,3 dB roll-off
3.847197197197197,-0.9252925686468131,Vass01,Vassilakis (2001),interference,#B50000,3 dB roll-off
3.847697697697698,-0.9245758833915438,Vass01,Vassilakis (2001),interference,#B50000,3 dB roll-off
3.8481981981981983,-0.9238592015696612,Vass01,Vassilakis (2001),interference,#B50000,3 dB roll-off
3.8486986986986986,-0.9231396540874655,Vass01,Vassilakis (2001),interference,#B50000,3 dB roll-off
3.8491991991991994,-0.9224201110258706,Vass01,Vassilakis (2001),interference,#B50000,3 dB roll-off
3.8496996996996997,-0.9216976918381864,Vass01,Vassilakis (2001),interference,#B50000,3 dB roll-off
3.8502002002002005,-0.9209752780612035,Vass01,Vassilakis (2001),interference,#B50000,3 dB roll-off
3.850700700700701,-0.9202499776573333,Vass01,Vassilakis (2001),interference,#B50000,3 dB roll-off
3.851201201201201,-0.9195246836571844,Vass01,Vassilakis (2001),interference,#B50000,3 dB roll-off
3.851701701701702,-0.9187964924942129,Vass01,Vassilakis (2001),interference,#B50000,3 dB roll-off
3.852202202202202,-0.9180683087309359,Vass01,Vassilakis (2001),interference,#B50000,3 dB roll-off
3.852702702702703,-0.917337217233658,Vass01,Vassilakis (2001),interference,#B50000,3 dB roll-off
3.8532032032032033,-0.9166061341350366,Vass01,Vassilakis (2001),interference,#B50000,3 dB roll-off
3.8537037037037036,-0.9158721326958945,Vass01,Vassilakis (2001),interference,#B50000,3 dB roll-off
3.8542042042042044,-0.9151381406573182,Vass01,Vassilakis (2001),interference,#B50000,3 dB roll-off
3.8547047047047047,-0.9144012196362926,Vass01,Vassilakis (2001),interference,#B50000,3 dB roll-off
3.8552052052052055,-0.9136643090207937,Vass01,Vassilakis (2001),interference,#B50000,3 dB roll-off
3.855705705705706,-0.912924458745352,Vass01,Vassilakis (2001),interference,#B50000,3 dB roll-off
3.856206206206206,-0.9121846198834388,Vass01,Vassilakis (2001),interference,#B50000,3 dB roll-off
3.856706706706707,-0.9114418306484471,Vass01,Vassilakis (2001),interference,#B50000,3 dB roll-off
3.8572072072072072,-0.9106990538380667,Vass01,Vassilakis (2001),interference,#B50000,3 dB roll-off
3.857707707707708,-0.9099533159057047,Vass01,Vassilakis (2001),interference,#B50000,3 dB roll-off
3.8582082082082083,-0.9092075914121346,Vass01,Vassilakis (2001),interference,#B50000,3 dB roll-off
3.8587087087087086,-0.9084588950118369,Vass01,Vassilakis (2001),interference,#B50000,3 dB roll-off
3.8592092092092094,-0.9077102130676475,Vass01,Vassilakis (2001),interference,#B50000,3 dB roll-off
3.8597097097097097,-0.9069585483960075,Vass01,Vassilakis (2001),interference,#B50000,3 dB roll-off
3.8602102102102105,-0.9062068992009545,Vass01,Vassilakis (2001),interference,#B50000,3 dB roll-off
3.860710710710711,-0.9054522564216494,Vass01,Vassilakis (2001),interference,#B50000,3 dB roll-off
3.861211211211211,-0.904697630142557,Vass01,Vassilakis (2001),interference,#B50000,3 dB roll-off
3.861711711711712,-0.9039399993862732,Vass01,Vassilakis (2001),interference,#B50000,3 dB roll-off
3.8622122122122122,-0.9031823861570473,Vass01,Vassilakis (2001),interference,#B50000,3 dB roll-off
3.862712712712713,-0.902421757521403,Vass01,Vassilakis (2001),interference,#B50000,3 dB roll-off
3.8632132132132133,-0.9018724570766335,Vass01,Vassilakis (2001),interference,#B50000,3 dB roll-off
3.8637137137137136,-0.9025018047483622,Vass01,Vassilakis (2001),interference,#B50000,3 dB roll-off
3.8642142142142144,-0.903128410010864,Vass01,Vassilakis (2001),interference,#B50000,3 dB roll-off
3.8647147147147147,-0.9037547812839912,Vass01,Vassilakis (2001),interference,#B50000,3 dB roll-off
3.8652152152152155,-0.9043784200732323,Vass01,Vassilakis (2001),interference,#B50000,3 dB roll-off
3.865715715715716,-0.9050018229247386,Vass01,Vassilakis (2001),interference,#B50000,3 dB roll-off
3.866216216216216,-0.9056225031861851,Vass01,Vassilakis (2001),interference,#B50000,3 dB roll-off
3.866716716716717,-0.9062429455618474,Vass01,Vassilakis (2001),interference,#B50000,3 dB roll-off
3.8672172172172172,-0.9068606752099078,Vass01,Vassilakis (2001),interference,#B50000,3 dB roll-off
3.867717717717718,-0.9074781650243791,Vass01,Vassilakis (2001),interference,#B50000,3 dB roll-off
3.8682182182182183,-0.9080929519423585,Vass01,Vassilakis (2001),interference,#B50000,3 dB roll-off
3.8687187187187186,-0.9087074970791803,Vass01,Vassilakis (2001),interference,#B50000,3 dB roll-off
3.8692192192192194,-0.9093193491194049,Vass01,Vassilakis (2001),interference,#B50000,3 dB roll-off
3.8697197197197197,-0.909930957431098,Vass01,Vassilakis (2001),interference,#B50000,3 dB roll-off
3.8702202202202205,-0.9105398824149475,Vass01,Vassilakis (2001),interference,#B50000,3 dB roll-off
3.870720720720721,-0.9111485617230519,Vass01,Vassilakis (2001),interference,#B50000,3 dB roll-off
3.871221221221221,-0.9117545674410119,Vass01,Vassilakis (2001),interference,#B50000,3 dB roll-off
3.871721721721722,-0.912360325536141,Vass01,Vassilakis (2001),interference,#B50000,3 dB roll-off
3.8722222222222222,-0.9129634197478502,Vass01,Vassilakis (2001),interference,#B50000,3 dB roll-off
3.872722722722723,-0.9135662643897372,Vass01,Vassilakis (2001),interference,#B50000,3 dB roll-off
3.8732232232232233,-0.9141664548240996,Vass01,Vassilakis (2001),interference,#B50000,3 dB roll-off
3.8737237237237236,-0.9147663937416779,Vass01,Vassilakis (2001),interference,#B50000,3 dB roll-off
3.8742242242242244,-0.9153636880968015,Vass01,Vassilakis (2001),interference,#B50000,3 dB roll-off
3.8747247247247247,-0.9159607289882243,Vass01,Vassilakis (2001),interference,#B50000,3 dB roll-off
3.8752252252252255,-0.9165551349315791,Vass01,Vassilakis (2001),interference,#B50000,3 dB roll-off
3.875725725725726,-0.9171492854642914,Vass01,Vassilakis (2001),interference,#B50000,3 dB roll-off
3.876226226226226,-0.9177408106327131,Vass01,Vassilakis (2001),interference,#B50000,3 dB roll-off
3.876726726726727,-0.9183320784435013,Vass01,Vassilakis (2001),interference,#B50000,3 dB roll-off
3.8772272272272272,-0.9189207304432425,Vass01,Vassilakis (2001),interference,#B50000,3 dB roll-off
3.877727727727728,-0.9195091231382883,Vass01,Vassilakis (2001),interference,#B50000,3 dB roll-off
3.8782282282282283,-0.9200949095450834,Vass01,Vassilakis (2001),interference,#B50000,3 dB roll-off
3.8787287287287286,-0.9206804347000201,Vass01,Vassilakis (2001),interference,#B50000,3 dB roll-off
3.8792292292292294,-0.9212633630591597,Vass01,Vassilakis (2001),interference,#B50000,3 dB roll-off
3.8797297297297297,-0.9218460282190817,Vass01,Vassilakis (2001),interference,#B50000,3 dB roll-off
3.8802302302302305,-0.9224261060454437,Vass01,Vassilakis (2001),interference,#B50000,3 dB roll-off
3.880730730730731,-0.9230059187250339,Vass01,Vassilakis (2001),interference,#B50000,3 dB roll-off
3.881231231231231,-0.9235831535030977,Vass01,Vassilakis (2001),interference,#B50000,3 dB roll-off
3.881731731731732,-0.9241601211866315,Vass01,Vassilakis (2001),interference,#B50000,3 dB roll-off
3.8822322322322322,-0.9247345203705796,Vass01,Vassilakis (2001),interference,#B50000,3 dB roll-off
3.882732732732733,-0.92530865051198,Vass01,Vassilakis (2001),interference,#B50000,3 dB roll-off
3.8832332332332333,-0.9258802215257412,Vass01,Vassilakis (2001),interference,#B50000,3 dB roll-off
3.8837337337337337,-0.9264515215486337,Vass01,Vassilakis (2001),interference,#B50000,3 dB roll-off
3.8842342342342344,-0.9270202717859107,Vass01,Vassilakis (2001),interference,#B50000,3 dB roll-off
3.8847347347347347,-0.9275887490836913,Vass01,Vassilakis (2001),interference,#B50000,3 dB roll-off
3.8852352352352355,-0.9281546859080231,Vass01,Vassilakis (2001),interference,#B50000,3 dB roll-off
3.885735735735736,-0.9287203478438768,Vass01,Vassilakis (2001),interference,#B50000,3 dB roll-off
3.886236236236236,-0.9292834785887449,Vass01,Vassilakis (2001),interference,#B50000,3 dB roll-off
3.886736736736737,-0.9298463324957149,Vass01,Vassilakis (2001),interference,#B50000,3 dB roll-off
3.8872372372372372,-0.9304066644644923,Vass01,Vassilakis (2001),interference,#B50000,3 dB roll-off
3.887737737737738,-0.9309667176455347,Vass01,Vassilakis (2001),interference,#B50000,3 dB roll-off
3.8882382382382383,-0.9315242581115968,Vass01,Vassilakis (2001),interference,#B50000,3 dB roll-off
3.8887387387387387,-0.9320815178396287,Vass01,Vassilakis (2001),interference,#B50000,3 dB roll-off
3.8892392392392394,-0.9326362740464026,Vass01,Vassilakis (2001),interference,#B50000,3 dB roll-off
3.8897397397397397,-0.9331907475643284,Vass01,Vassilakis (2001),interference,#B50000,3 dB roll-off
3.8902402402402405,-0.9337427267253333,Vass01,Vassilakis (2001),interference,#B50000,3 dB roll-off
3.890740740740741,-0.9342944212461416,Vass01,Vassilakis (2001),interference,#B50000,3 dB roll-off
3.891241241241241,-0.9348436305450032,Vass01,Vassilakis (2001),interference,#B50000,3 dB roll-off
3.891741741741742,-0.9353925532517786,Vass01,Vassilakis (2001),interference,#B50000,3 dB roll-off
3.8922422422422422,-0.9359389998423874,Vass01,Vassilakis (2001),interference,#B50000,3 dB roll-off
3.892742742742743,-0.9364851578883662,Vass01,Vassilakis (2001),interference,#B50000,3 dB roll-off
3.8932432432432433,-0.9370288488947909,Vass01,Vassilakis (2001),interference,#B50000,3 dB roll-off
3.8937437437437437,-0.9375722494034171,Vass01,Vassilakis (2001),interference,#B50000,3 dB roll-off
3.8942442442442444,-0.9381131919200412,Vass01,Vassilakis (2001),interference,#B50000,3 dB roll-off
3.8947447447447447,-0.938653841985016,Vass01,Vassilakis (2001),interference,#B50000,3 dB roll-off
3.8952452452452455,-0.9391920430765527,Vass01,Vassilakis (2001),interference,#B50000,3 dB roll-off
3.895745745745746,-0.9397299497618851,Vass01,Vassilakis (2001),interference,#B50000,3 dB roll-off
3.896246246246246,-0.9402654164634329,Vass01,Vassilakis (2001),interference,#B50000,3 dB roll-off
3.896746746746747,-0.9408005868034711,Vass01,Vassilakis (2001),interference,#B50000,3 dB roll-off
3.8972472472472472,-0.9413333261205604,Vass01,Vassilakis (2001),interference,#B50000,3 dB roll-off
3.897747747747748,-0.9418657671200793,Vass01,Vassilakis (2001),interference,#B50000,3 dB roll-off
3.8982482482482483,-0.9423957860287439,Vass01,Vassilakis (2001),interference,#B50000,3 dB roll-off
3.8987487487487487,-0.9429255046629191,Vass01,Vassilakis (2001),interference,#B50000,3 dB roll-off
3.8992492492492494,-0.9434528101097279,Vass01,Vassilakis (2001),interference,#B50000,3 dB roll-off
3.8997497497497497,-0.9439798133242767,Vass01,Vassilakis (2001),interference,#B50000,3 dB roll-off
3.9002502502502505,-0.9445044122263483,Vass01,Vassilakis (2001),interference,#B50000,3 dB roll-off
3.900750750750751,-0.9450287069375083,Vass01,Vassilakis (2001),interference,#B50000,3 dB roll-off
3.901251251251251,-0.9455506061826074,Vass01,Vassilakis (2001),interference,#B50000,3 dB roll-off
3.901751751751752,-0.9460721992772226,Vass01,Vassilakis (2001),interference,#B50000,3 dB roll-off
3.9022522522522523,-0.946591405723778,Vass01,Vassilakis (2001),interference,#B50000,3 dB roll-off
3.902752752752753,-0.9471103040593244,Vass01,Vassilakis (2001),interference,#B50000,3 dB roll-off
3.9032532532532533,-0.9476268245364912,Vass01,Vassilakis (2001),interference,#B50000,3 dB roll-off
3.9037537537537537,-0.94814303494113,Vass01,Vassilakis (2001),interference,#B50000,3 dB roll-off
3.9042542542542544,-0.9486568762488162,Vass01,Vassilakis (2001),interference,#B50000,3 dB roll-off
3.9047547547547548,-0.9491704055214434,Vass01,Vassilakis (2001),interference,#B50000,3 dB roll-off
3.9052552552552555,-0.9496815744304213,Vass01,Vassilakis (2001),interference,#B50000,3 dB roll-off
3.905755755755756,-0.9501924293407165,Vass01,Vassilakis (2001),interference,#B50000,3 dB roll-off
3.906256256256256,-0.9507009325925673,Vass01,Vassilakis (2001),interference,#B50000,3 dB roll-off
3.906756756756757,-0.9512091198810275,Vass01,Vassilakis (2001),interference,#B50000,3 dB roll-off
3.9072572572572573,-0.9517149641882678,Vass01,Vassilakis (2001),interference,#B50000,3 dB roll-off
3.907757757757758,-0.9522204905662692,Vass01,Vassilakis (2001),interference,#B50000,3 dB roll-off
3.9082582582582583,-0.9527236826123572,Vass01,Vassilakis (2001),interference,#B50000,3 dB roll-off
3.9087587587587587,-0.9532265547621953,Vass01,Vassilakis (2001),interference,#B50000,3 dB roll-off
3.9092592592592594,-0.9537271012015894,Vass01,Vassilakis (2001),interference,#B50000,3 dB roll-off
3.9097597597597598,-0.9542273257765265,Vass01,Vassilakis (2001),interference,#B50000,3 dB roll-off
3.9102602602602605,-0.9547252332347186,Vass01,Vassilakis (2001),interference,#B50000,3 dB roll-off
3.910760760760761,-0.9552228168590234,Vass01,Vassilakis (2001),interference,#B50000,3 dB roll-off
3.911261261261261,-0.9557180919326471,Vass01,Vassilakis (2001),interference,#B50000,3 dB roll-off
3.911761761761762,-0.9562130412016451,Vass01,Vassilakis (2001),interference,#B50000,3 dB roll-off
3.9122622622622623,-0.9567056904584189,Vass01,Vassilakis (2001),interference,#B50000,3 dB roll-off
3.912762762762763,-0.9571980119385357,Vass01,Vassilakis (2001),interference,#B50000,3 dB roll-off
3.9132632632632633,-0.9576880419173769,Vass01,Vassilakis (2001),interference,#B50000,3 dB roll-off
3.9137637637637637,-0.958177742146188,Vass01,Vassilakis (2001),interference,#B50000,3 dB roll-off
3.9142642642642644,-0.9586651593572431,Vass01,Vassilakis (2001),interference,#B50000,3 dB roll-off
3.9147647647647648,-0.9591522448435109,Vass01,Vassilakis (2001),interference,#B50000,3 dB roll-off
3.9152652652652655,-0.9596370557681922,Vass01,Vassilakis (2001),interference,#B50000,3 dB roll-off
3.915765765765766,-0.9601215329919223,Vass01,Vassilakis (2001),interference,#B50000,3 dB roll-off
3.916266266266266,-0.9606037440829406,Vass01,Vassilakis (2001),interference,#B50000,3 dB roll-off
3.916766766766767,-0.9610856194954104,Vass01,Vassilakis (2001),interference,#B50000,3 dB roll-off
3.9172672672672673,-0.9615652371768958,Vass01,Vassilakis (2001),interference,#B50000,3 dB roll-off
3.917767767767768,-0.9620445172007166,Vass01,Vassilakis (2001),interference,#B50000,3 dB roll-off
3.9182682682682684,-0.9625215478681393,Vass01,Vassilakis (2001),interference,#B50000,3 dB roll-off
3.9187687687687687,-0.962998238897285,Vass01,Vassilakis (2001),interference,#B50000,3 dB roll-off
3.9192692692692694,-0.9634726889175975,Vass01,Vassilakis (2001),interference,#B50000,3 dB roll-off
3.9197697697697698,-0.9639467973174533,Vass01,Vassilakis (2001),interference,#B50000,3 dB roll-off
3.9202702702702705,-0.9644186730290797,Vass01,Vassilakis (2001),interference,#B50000,3 dB roll-off
3.920770770770771,-0.9648902051364942,Vass01,Vassilakis (2001),interference,#B50000,3 dB roll-off
3.921271271271271,-0.9653595128494106,Vass01,Vassilakis (2001),interference,#B50000,3 dB roll-off
3.921771771771772,-0.9658284749727268,Vass01,Vassilakis (2001),interference,#B50000,3 dB roll-off
3.9222722722722723,-0.9662952209684835,Vass01,Vassilakis (2001),interference,#B50000,3 dB roll-off
3.922772772772773,-0.9667616193875899,Vass01,Vassilakis (2001),interference,#B50000,3 dB roll-off
3.9232732732732734,-0.9672258099193319,Vass01,Vassilakis (2001),interference,#B50000,3 dB roll-off
3.9237737737737737,-0.9676896508857044,Vass01,Vassilakis (2001),interference,#B50000,3 dB roll-off
3.9242742742742744,-0.9681512921783009,Vass01,Vassilakis (2001),interference,#B50000,3 dB roll-off
3.9247747747747748,-0.9686125819150446,Vass01,Vassilakis (2001),interference,#B50000,3 dB roll-off
3.9252752752752755,-0.9690716801650209,Vass01,Vassilakis (2001),interference,#B50000,3 dB roll-off
3.925775775775776,-0.9695304248669049,Vass01,Vassilakis (2001),interference,#B50000,3 dB roll-off
3.926276276276276,-0.9699869862425566,Vass01,Vassilakis (2001),interference,#B50000,3 dB roll-off
3.926776776776777,-0.9704431920760748,Vass01,Vassilakis (2001),interference,#B50000,3 dB roll-off
3.9272772772772773,-0.9708972227174791,Vass01,Vassilakis (2001),interference,#B50000,3 dB roll-off
3.927777777777778,-0.9713508958208782,Vass01,Vassilakis (2001),interference,#B50000,3 dB roll-off
3.9282782782782784,-0.9718024018399549,Vass01,Vassilakis (2001),interference,#B50000,3 dB roll-off
3.9287787787787787,-0.9722535483232794,Vass01,Vassilakis (2001),interference,#B50000,3 dB roll-off
3.9292792792792794,-0.9727025358038045,Vass01,Vassilakis (2001),interference,#B50000,3 dB roll-off
3.9297797797797798,-0.9731511617489376,Vass01,Vassilakis (2001),interference,#B50000,3 dB roll-off
3.9302802802802805,-0.9735976367466513,Vass01,Vassilakis (2001),interference,#B50000,3 dB roll-off
3.930780780780781,-0.974043748207367,Vass01,Vassilakis (2001),interference,#B50000,3 dB roll-off
3.9312812812812816,-0.9744877167499246,Vass01,Vassilakis (2001),interference,#B50000,3 dB roll-off
3.931781781781782,-0.9749313197519079,Vass01,Vassilakis (2001),interference,#B50000,3 dB roll-off
3.9322822822822823,-0.9753727878389802,Vass01,Vassilakis (2001),interference,#B50000,3 dB roll-off
3.932782782782783,-0.9758138883798932,Vass01,Vassilakis (2001),interference,#B50000,3 dB roll-off
3.9332832832832834,-0.9762528619831903,Vass01,Vassilakis (2001),interference,#B50000,3 dB roll-off
3.933783783783784,-0.9766914660326902,Vass01,Vassilakis (2001),interference,#B50000,3 dB roll-off
3.9342842842842844,-0.9771279510960085,Vass01,Vassilakis (2001),interference,#B50000,3 dB roll-off
3.9347847847847848,-0.9775640645958107,Vass01,Vassilakis (2001),interference,#B50000,3 dB roll-off
3.9352852852852855,-0.9779980670350465,Vass01,Vassilakis (2001),interference,#B50000,3 dB roll-off
3.935785785785786,-0.9784316958989476,Vass01,Vassilakis (2001),interference,#B50000,3 dB roll-off
3.9362862862862866,-0.9788632216022103,Vass01,Vassilakis (2001),interference,#B50000,3 dB roll-off
3.936786786786787,-0.979294371716138,Vass01,Vassilakis (2001),interference,#B50000,3 dB roll-off
3.9372872872872873,-0.9797234265437006,Vass01,Vassilakis (2001),interference,#B50000,3 dB roll-off
3.937787787787788,-0.9801521037657462,Vass01,Vassilakis (2001),interference,#B50000,3 dB roll-off
3.9382882882882884,-0.9805786935501392,Vass01,Vassilakis (2001),interference,#B50000,3 dB roll-off
3.938788788788789,-0.9810049037106054,Vass01,Vassilakis (2001),interference,#B50000,3 dB roll-off
3.9392892892892895,-0.9814290342566376,Vass01,Vassilakis (2001),interference,#B50000,3 dB roll-off
3.9397897897897898,-0.9818527831580767,Vass01,Vassilakis (2001),interference,#B50000,3 dB roll-off
3.9402902902902905,-0.9822744602428894,Vass01,Vassilakis (2001),interference,#B50000,3 dB roll-off
3.940790790790791,-0.9826957536601358,Vass01,Vassilakis (2001),interference,#B50000,3 dB roll-off
3.9412912912912916,-0.9831149830332223,Vass01,Vassilakis (2001),interference,#B50000,3 dB roll-off
3.941791791791792,-0.9835338267134476,Vass01,Vassilakis (2001),interference,#B50000,3 dB roll-off
3.9422922922922923,-0.9839506140966983,Vass01,Vassilakis (2001),interference,#B50000,3 dB roll-off
3.942792792792793,-0.9843670137594361,Vass01,Vassilakis (2001),interference,#B50000,3 dB roll-off
3.9432932932932934,-0.9847813648472202,Vass01,Vassilakis (2001),interference,#B50000,3 dB roll-off
3.943793793793794,-0.985195326184412,Vass01,Vassilakis (2001),interference,#B50000,3 dB roll-off
3.9442942942942945,-0.9856072466435414,Vass01,Vassilakis (2001),interference,#B50000,3 dB roll-off
3.944794794794795,-0.9860187753195665,Vass01,Vassilakis (2001),interference,#B50000,3 dB roll-off
3.9452952952952955,-0.9864282707893847,Vass01,Vassilakis (2001),interference,#B50000,3 dB roll-off
3.945795795795796,-0.9868373724411152,Vass01,Vassilakis (2001),interference,#B50000,3 dB roll-off
3.9462962962962966,-0.987244448533523,Vass01,Vassilakis (2001),interference,#B50000,3 dB roll-off
3.946796796796797,-0.9876511287703506,Vass01,Vassilakis (2001),interference,#B50000,3 dB roll-off
3.9472972972972973,-0.9880557910698451,Vass01,Vassilakis (2001),interference,#B50000,3 dB roll-off
3.947797797797798,-0.9884600554737186,Vass01,Vassilakis (2001),interference,#B50000,3 dB roll-off
3.9482982982982984,-0.9888623095374152,Vass01,Vassilakis (2001),interference,#B50000,3 dB roll-off
3.948798798798799,-0.9892641636628878,Vass01,Vassilakis (2001),interference,#B50000,3 dB roll-off
3.9492992992992995,-0.9896640150206187,Vass01,Vassilakis (2001),interference,#B50000,3 dB roll-off
3.9497997997998,-0.9900634643948777,Vass01,Vassilakis (2001),interference,#B50000,3 dB roll-off
3.9503003003003005,-0.9904609185491445,Vass01,Vassilakis (2001),interference,#B50000,3 dB roll-off
3.950800800800801,-0.9908579686720458,Vass01,Vassilakis (2001),interference,#B50000,3 dB roll-off
3.9513013013013016,-0.9912530310981085,Vass01,Vassilakis (2001),interference,#B50000,3 dB roll-off
3.951801801801802,-0.9916476874422292,Vass01,Vassilakis (2001),interference,#B50000,3 dB roll-off
3.9523023023023023,-0.9920403635881366,Vass01,Vassilakis (2001),interference,#B50000,3 dB roll-off
3.952802802802803,-0.9924326315987936,Vass01,Vassilakis (2001),interference,#B50000,3 dB roll-off
3.9533033033033034,-0.9928229268854158,Vass01,Vassilakis (2001),interference,#B50000,3 dB roll-off
3.953803803803804,-0.9932128119807204,Vass01,Vassilakis (2001),interference,#B50000,3 dB roll-off
3.9543043043043045,-0.9936007318017677,Vass01,Vassilakis (2001),interference,#B50000,3 dB roll-off
3.954804804804805,-0.9939882393726512,Vass01,Vassilakis (2001),interference,#B50000,3 dB roll-off
3.9553053053053056,-0.9943737890947788,Vass01,Vassilakis (2001),interference,#B50000,3 dB roll-off
3.955805805805806,-0.9947589245050338,Vass01,Vassilakis (2001),interference,#B50000,3 dB roll-off
3.9563063063063066,-0.9951421094677765,Vass01,Vassilakis (2001),interference,#B50000,3 dB roll-off
3.956806806806807,-0.9955248780540906,Vass01,Vassilakis (2001),interference,#B50000,3 dB roll-off
3.9573073073073077,-0.9959057035699848,Vass01,Vassilakis (2001),interference,#B50000,3 dB roll-off
3.957807807807808,-0.9962861106419795,Vass01,Vassilakis (2001),interference,#B50000,3 dB roll-off
3.9583083083083084,-0.9966645819965491,Vass01,Vassilakis (2001),interference,#B50000,3 dB roll-off
3.958808808808809,-0.9970426328368162,Vass01,Vassilakis (2001),interference,#B50000,3 dB roll-off
3.9593093093093095,-0.9974187552886327,Vass01,Vassilakis (2001),interference,#B50000,3 dB roll-off
3.9598098098098102,-0.9977944551527674,Vass01,Vassilakis (2001),interference,#B50000,3 dB roll-off
3.9603103103103106,-0.9981682339334826,Vass01,Vassilakis (2001),interference,#B50000,3 dB roll-off
3.960810810810811,-0.9985415880501193,Vass01,Vassilakis (2001),interference,#B50000,3 dB roll-off
3.9613113113113116,-0.99891302836448,Vass01,Vassilakis (2001),interference,#B50000,3 dB roll-off
3.961811811811812,-0.9992840419353362,Vass01,Vassilakis (2001),interference,#B50000,3 dB roll-off
3.9623123123123127,-0.9996531489612787,Vass01,Vassilakis (2001),interference,#B50000,3 dB roll-off
3.962812812812813,-1.0000218271611794,Vass01,Vassilakis (2001),interference,#B50000,3 dB roll-off
3.9633133133133134,-1.0003886060497795,Vass01,Vassilakis (2001),interference,#B50000,3 dB roll-off
3.963813813813814,-1.000754954026698,Vass01,Vassilakis (2001),interference,#B50000,3 dB roll-off
3.9643143143143145,-1.001119409902271,Vass01,Vassilakis (2001),interference,#B50000,3 dB roll-off
3.9648148148148152,-1.0014834327773623,Vass01,Vassilakis (2001),interference,#B50000,3 dB roll-off
3.9653153153153156,-1.0018455707374734,Vass01,Vassilakis (2001),interference,#B50000,3 dB roll-off
3.965815815815816,-1.0022072736051113,Vass01,Vassilakis (2001),interference,#B50000,3 dB roll-off
3.9663163163163166,-1.0025670987206083,Vass01,Vassilakis (2001),interference,#B50000,3 dB roll-off
3.966816816816817,-1.002926486648416,Vass01,Vassilakis (2001),interference,#B50000,3 dB roll-off
3.9673173173173177,-1.0032840039634652,Vass01,Vassilakis (2001),interference,#B50000,3 dB roll-off
3.967817817817818,-1.0036410819923534,Vass01,Vassilakis (2001),interference,#B50000,3 dB roll-off
3.9683183183183184,-1.0039962965245128,Vass01,Vassilakis (2001),interference,#B50000,3 dB roll-off
3.968818818818819,-1.0043510696687084,Vass01,Vassilakis (2001),interference,#B50000,3 dB roll-off
3.9693193193193195,-1.0047039864088847,Vass01,Vassilakis (2001),interference,#B50000,3 dB roll-off
3.9698198198198202,-1.0050564596559792,Vass01,Vassilakis (2001),interference,#B50000,3 dB roll-off
3.9703203203203206,-1.0054070835685214,Vass01,Vassilakis (2001),interference,#B50000,3 dB roll-off
3.970820820820821,-1.0057572618794899,Vass01,Vassilakis (2001),interference,#B50000,3 dB roll-off
3.9713213213213217,-1.0061055979022,Vass01,Vassilakis (2001),interference,#B50000,3 dB roll-off
3.971821821821822,-1.0064534862114358,Vass01,Vassilakis (2001),interference,#B50000,3 dB roll-off
3.9723223223223227,-1.0067995392556166,Vass01,Vassilakis (2001),interference,#B50000,3 dB roll-off
3.972822822822823,-1.0071451424709739,Vass01,Vassilakis (2001),interference,#B50000,3 dB roll-off
3.9733233233233234,-1.0074889174214334,Vass01,Vassilakis (2001),interference,#B50000,3 dB roll-off
3.973823823823824,-1.0078322404242515,Vass01,Vassilakis (2001),interference,#B50000,3 dB roll-off
3.9743243243243245,-1.0081737421393948,Vass01,Vassilakis (2001),interference,#B50000,3 dB roll-off
3.9748248248248252,-1.0085147897845372,Vass01,Vassilakis (2001),interference,#B50000,3 dB roll-off
3.9753253253253256,-1.0088540230963279,Vass01,Vassilakis (2001),interference,#B50000,3 dB roll-off
3.975825825825826,-1.009192800212211,Vass01,Vassilakis (2001),interference,#B50000,3 dB roll-off
3.9763263263263267,-1.0095297699262453,Vass01,Vassilakis (2001),interference,#B50000,3 dB roll-off
3.976826826826827,-1.0098662813148829,Vass01,Vassilakis (2001),interference,#B50000,3 dB roll-off
3.9773273273273277,-1.0102009922104096,Vass01,Vassilakis (2001),interference,#B50000,3 dB roll-off
3.977827827827828,-1.0105352426474215,Vass01,Vassilakis (2001),interference,#B50000,3 dB roll-off
3.9783283283283284,-1.0108676994773906,Vass01,Vassilakis (2001),interference,#B50000,3 dB roll-off
3.978828828828829,-1.0111996937120575,Vass01,Vassilakis (2001),interference,#B50000,3 dB roll-off
3.9793293293293295,-1.0115299012031307,Vass01,Vassilakis (2001),interference,#B50000,3 dB roll-off
3.9798298298298302,-1.0118596439584169,Vass01,Vassilakis (2001),interference,#B50000,3 dB roll-off
3.9803303303303306,-1.0121876068109998,Vass01,Vassilakis (2001),interference,#B50000,3 dB roll-off
3.980830830830831,-1.0125151027835855,Vass01,Vassilakis (2001),interference,#B50000,3 dB roll-off
3.9813313313313317,-1.012840825671905,Vass01,Vassilakis (2001),interference,#B50000,3 dB roll-off
3.981831831831832,-1.0131660795322228,Vass01,Vassilakis (2001),interference,#B50000,3 dB roll-off
3.9823323323323327,-1.013489567104287,Vass01,Vassilakis (2001),interference,#B50000,3 dB roll-off
3.982832832832833,-1.0138125834965412,Vass01,Vassilakis (2001),interference,#B50000,3 dB roll-off
3.9833333333333334,-1.0141338403742182,Vass01,Vassilakis (2001),interference,#B50000,3 dB roll-off
3.983833833833834,-1.0144546239164376,Vass01,Vassilakis (2001),interference,#B50000,3 dB roll-off
3.9843343343343345,-1.0147736546954702,Vass01,Vassilakis (2001),interference,#B50000,3 dB roll-off
3.9848348348348352,-1.0150922099795188,Vass01,Vassilakis (2001),interference,#B50000,3 dB roll-off
3.9853353353353356,-1.0154090192295717,Vass01,Vassilakis (2001),interference,#B50000,3 dB roll-off
3.985835835835836,-1.0157253508211836,Vass01,Vassilakis (2001),interference,#B50000,3 dB roll-off
3.9863363363363367,-1.016039943085844,Vass01,Vassilakis (2001),interference,#B50000,3 dB roll-off
3.986836836836837,-1.0163540555246617,Vass01,Vassilakis (2001),interference,#B50000,3 dB roll-off
3.9873373373373378,-1.0166664353215245,Vass01,Vassilakis (2001),interference,#B50000,3 dB roll-off
3.987837837837838,-1.0169783331211306,Vass01,Vassilakis (2001),interference,#B50000,3 dB roll-off
3.9883383383383384,-1.0172885049417557,Vass01,Vassilakis (2001),interference,#B50000,3 dB roll-off
3.988838838838839,-1.0175981925896942,Vass01,Vassilakis (2001),interference,#B50000,3 dB roll-off
3.9893393393393395,-1.0179061608996947,Vass01,Vassilakis (2001),interference,#B50000,3 dB roll-off
3.9898398398398403,-1.018213642857504,Vass01,Vassilakis (2001),interference,#B50000,3 dB roll-off
3.9903403403403406,-1.0185194120965493,Vass01,Vassilakis (2001),interference,#B50000,3 dB roll-off
3.990840840840841,-1.0188246927997966,Vass01,Vassilakis (2001),interference,#B50000,3 dB roll-off
3.9913413413413417,-1.0191282673816517,Vass01,Vassilakis (2001),interference,#B50000,3 dB roll-off
3.991841841841842,-1.0194313512399626,Vass01,Vassilakis (2001),interference,#B50000,3 dB roll-off
3.9923423423423428,-1.0197327355524977,Vass01,Vassilakis (2001),interference,#B50000,3 dB roll-off
3.992842842842843,-1.0200336269495822,Vass01,Vassilakis (2001),interference,#B50000,3 dB roll-off
3.9933433433433434,-1.0203328253548638,Vass01,Vassilakis (2001),interference,#B50000,3 dB roll-off
3.993843843843844,-1.0206315286485432,Vass01,Vassilakis (2001),interference,#B50000,3 dB roll-off
3.9943443443443445,-1.020928545482782,Vass01,Vassilakis (2001),interference,#B50000,3 dB roll-off
3.9948448448448453,-1.0212250650050292,Vass01,Vassilakis (2001),interference,#B50000,3 dB roll-off
3.9953453453453456,-1.0215199045786547,Vass01,Vassilakis (2001),interference,#B50000,3 dB roll-off
3.995845845845846,-1.0218142446356129,Vass01,Vassilakis (2001),interference,#B50000,3 dB roll-off
3.9963463463463467,-1.0221069112332994,Vass01,Vassilakis (2001),interference,#B50000,3 dB roll-off
3.996846846846847,-1.022399076105315,Vass01,Vassilakis (2001),interference,#B50000,3 dB roll-off
3.9973473473473478,-1.0226895739859985,Vass01,Vassilakis (2001),interference,#B50000,3 dB roll-off
3.997847847847848,-1.0229795679276537,Vass01,Vassilakis (2001),interference,#B50000,3 dB roll-off
3.9983483483483484,-1.023267901324569,Vass01,Vassilakis (2001),interference,#B50000,3 dB roll-off
3.998848848848849,-1.0235557285647066,Vass01,Vassilakis (2001),interference,#B50000,3 dB roll-off
3.9993493493493495,-1.0238419016854272,Vass01,Vassilakis (2001),interference,#B50000,3 dB roll-off
3.9998498498498503,-1.024127566427155,Vass01,Vassilakis (2001),interference,#B50000,3 dB roll-off
4.000350350350351,-1.0244115834536103,Vass01,Vassilakis (2001),interference,#B50000,3 dB roll-off
4.000850850850851,-1.024695089874386,Vass01,Vassilakis (2001),interference,#B50000,3 dB roll-off
4.001351351351351,-1.024976954962864,Vass01,Vassilakis (2001),interference,#B50000,3 dB roll-off
4.001851851851852,-1.025258307214479,Vass01,Vassilakis (2001),interference,#B50000,3 dB roll-off
4.002352352352353,-1.025538024495691,Vass01,Vassilakis (2001),interference,#B50000,3 dB roll-off
4.002852852852853,-1.025817226704306,Vass01,Vassilakis (2001),interference,#B50000,3 dB roll-off
4.003353353353353,-1.0260948002834032,Vass01,Vassilakis (2001),interference,#B50000,3 dB roll-off
4.003853853853854,-1.02637185654958,Vass01,Vassilakis (2001),interference,#B50000,3 dB roll-off
4.004354354354355,-1.0266472905061794,Vass01,Vassilakis (2001),interference,#B50000,3 dB roll-off
4.004854854854855,-1.0269222049049096,Vass01,Vassilakis (2001),interference,#B50000,3 dB roll-off
4.005355355355356,-1.0271955032931064,Vass01,Vassilakis (2001),interference,#B50000,3 dB roll-off
4.005855855855856,-1.0274682798738397,Vass01,Vassilakis (2001),interference,#B50000,3 dB roll-off
4.006356356356356,-1.0277394467222778,Vass01,Vassilakis (2001),interference,#B50000,3 dB roll-off
4.006856856856857,-1.0280100895089423,Vass01,Vassilakis (2001),interference,#B50000,3 dB roll-off
4.007357357357358,-1.028279128820791,Vass01,Vassilakis (2001),interference,#B50000,3 dB roll-off
4.007857857857858,-1.028547641811824,Vass01,Vassilakis (2001),interference,#B50000,3 dB roll-off
4.008358358358358,-1.0288145575648286,Vass01,Vassilakis (2001),interference,#B50000,3 dB roll-off
4.008858858858859,-1.029080944733207,Vass01,Vassilakis (2001),interference,#B50000,3 dB roll-off
4.00935935935936,-1.0293457408797166,Vass01,Vassilakis (2001),interference,#B50000,3 dB roll-off
4.00985985985986,-1.0296100061729765,Vass01,Vassilakis (2001),interference,#B50000,3 dB roll-off
4.010360360360361,-1.0298726866399686,Vass01,Vassilakis (2001),interference,#B50000,3 dB roll-off
4.010860860860861,-1.0301348339802392,Vass01,Vassilakis (2001),interference,#B50000,3 dB roll-off
4.011361361361361,-1.0303953182030916,Vass01,Vassilakis (2001),interference,#B50000,3 dB roll-off
4.0118618618618624,-1.0306554359533486,Vass01,Vassilakis (2001),interference,#B50000,3 dB roll-off
4.012362362362363,-1.0309138122483543,Vass01,Vassilakis (2001),interference,#B50000,3 dB roll-off
4.012862862862863,-1.0311718198400186,Vass01,Vassilakis (2001),interference,#B50000,3 dB roll-off
4.013363363363363,-1.031428092058891,Vass01,Vassilakis (2001),interference,#B50000,3 dB roll-off
4.013863863863864,-1.031683993337301,Vass01,Vassilakis (2001),interference,#B50000,3 dB roll-off
4.014364364364365,-1.0319381653064994,Vass01,Vassilakis (2001),interference,#B50000,3 dB roll-off
4.014864864864865,-1.0321919640916826,Vass01,Vassilakis (2001),interference,#B50000,3 dB roll-off
4.015365365365366,-1.0324440396124144,Vass01,Vassilakis (2001),interference,#B50000,3 dB roll-off
4.015865865865866,-1.032695739699123,Vass01,Vassilakis (2001),interference,#B50000,3 dB roll-off
4.016366366366366,-1.0329457225473775,Vass01,Vassilakis (2001),interference,#B50000,3 dB roll-off
4.0168668668668674,-1.0331953277051102,Vass01,Vassilakis (2001),interference,#B50000,3 dB roll-off
4.017367367367368,-1.0334432216316654,Vass01,Vassilakis (2001),interference,#B50000,3 dB roll-off
4.017867867867868,-1.0336907356047,Vass01,Vassilakis (2001),interference,#B50000,3 dB roll-off
4.018368368368368,-1.0339365443351887,Vass01,Vassilakis (2001),interference,#B50000,3 dB roll-off
4.018868868868869,-1.034181970842571,Vass01,Vassilakis (2001),interference,#B50000,3 dB roll-off
4.01936936936937,-1.034425698077479,Vass01,Vassilakis (2001),interference,#B50000,3 dB roll-off
4.01986986986987,-1.0346690408131003,Vass01,Vassilakis (2001),interference,#B50000,3 dB roll-off
4.020370370370371,-1.0349106902277696,Vass01,Vassilakis (2001),interference,#B50000,3 dB roll-off
4.020870870870871,-1.0351519528603632,Vass01,Vassilakis (2001),interference,#B50000,3 dB roll-off
4.021371371371371,-1.0353915281050534,Vass01,Vassilakis (2001),interference,#B50000,3 dB roll-off
4.0218718718718725,-1.0356307142782113,Vass01,Vassilakis (2001),interference,#B50000,3 dB roll-off
4.022372372372373,-1.0358682189781057,Vass01,Vassilakis (2001),interference,#B50000,3 dB roll-off
4.022872872872873,-1.0361053323103278,Vass01,Vassilakis (2001),interference,#B50000,3 dB roll-off
4.023373373373373,-1.0363407700655616,Vass01,Vassilakis (2001),interference,#B50000,3 dB roll-off
4.023873873873874,-1.0365758141502561,Vass01,Vassilakis (2001),interference,#B50000,3 dB roll-off
4.024374374374375,-1.0368091885359239,Vass01,Vassilakis (2001),interference,#B50000,3 dB roll-off
4.024874874874875,-1.0370421669414436,Vass01,Vassilakis (2001),interference,#B50000,3 dB roll-off
4.025375375375376,-1.0372734815076765,Vass01,Vassilakis (2001),interference,#B50000,3 dB roll-off
4.025875875875876,-1.0375043977773342,Vass01,Vassilakis (2001),interference,#B50000,3 dB roll-off
4.026376376376376,-1.0377336560492563,Vass01,Vassilakis (2001),interference,#B50000,3 dB roll-off
4.0268768768768775,-1.0379625137013606,Vass01,Vassilakis (2001),interference,#B50000,3 dB roll-off
4.027377377377378,-1.0381897191791463,Vass01,Vassilakis (2001),interference,#B50000,3 dB roll-off
4.027877877877878,-1.0384165217070105,Vass01,Vassilakis (2001),interference,#B50000,3 dB roll-off
4.028378378378378,-1.0386416778659047,Vass01,Vassilakis (2001),interference,#B50000,3 dB roll-off
4.028878878878879,-1.0388664287378815,Vass01,Vassilakis (2001),interference,#B50000,3 dB roll-off
4.02937937937938,-1.0390895390282244,Vass01,Vassilakis (2001),interference,#B50000,3 dB roll-off
4.02987987987988,-1.03931224168772,Vass01,Vassilakis (2001),interference,#B50000,3 dB roll-off
4.030380380380381,-1.039533309534949,Vass01,Vassilakis (2001),interference,#B50000,3 dB roll-off
4.030880880880881,-1.0397539674004592,Vass01,Vassilakis (2001),interference,#B50000,3 dB roll-off
4.031381381381381,-1.0399729962051791,Vass01,Vassilakis (2001),interference,#B50000,3 dB roll-off
4.0318818818818825,-1.0401916126702924,Vass01,Vassilakis (2001),interference,#B50000,3 dB roll-off
4.032382382382383,-1.0404086058082413,Vass01,Vassilakis (2001),interference,#B50000,3 dB roll-off
4.032882882882883,-1.0406251842416754,Vass01,Vassilakis (2001),interference,#B50000,3 dB roll-off
4.033383383383383,-1.0408401450637872,Vass01,Vassilakis (2001),interference,#B50000,3 dB roll-off
4.033883883883884,-1.041054688809403,Vass01,Vassilakis (2001),interference,#B50000,3 dB roll-off
4.034384384384385,-1.041267620641807,Vass01,Vassilakis (2001),interference,#B50000,3 dB roll-off
4.034884884884885,-1.041480133018644,Vass01,Vassilakis (2001),interference,#B50000,3 dB roll-off
4.035385385385386,-1.0416910391626968,Vass01,Vassilakis (2001),interference,#B50000,3 dB roll-off
4.035885885885886,-1.0419015234649776,Vass01,Vassilakis (2001),interference,#B50000,3 dB roll-off
4.036386386386386,-1.0421104071972775,Vass01,Vassilakis (2001),interference,#B50000,3 dB roll-off
4.0368868868868875,-1.0423188666944403,Vass01,Vassilakis (2001),interference,#B50000,3 dB roll-off
4.037387387387388,-1.0425257312668745,Vass01,Vassilakis (2001),interference,#B50000,3 dB roll-off
4.037887887887888,-1.0427321692035891,Vass01,Vassilakis (2001),interference,#B50000,3 dB roll-off
4.038388388388388,-1.042937017843315,Vass01,Vassilakis (2001),interference,#B50000,3 dB roll-off
4.038888888888889,-1.043141437439514,Vass01,Vassilakis (2001),interference,#B50000,3 dB roll-off
4.03938938938939,-1.043344273349004,Vass01,Vassilakis (2001),interference,#B50000,3 dB roll-off
4.03988988988989,-1.0435466777998867,Vass01,Vassilakis (2001),interference,#B50000,3 dB roll-off
4.040390390390391,-1.0437475041569497,Vass01,Vassilakis (2001),interference,#B50000,3 dB roll-off
4.040890890890891,-1.043947896633019,Vass01,Vassilakis (2001),interference,#B50000,3 dB roll-off
4.041391391391391,-1.0441467165908114,Vass01,Vassilakis (2001),interference,#B50000,3 dB roll-off
4.0418918918918925,-1.0443451002378874,Vass01,Vassilakis (2001),interference,#B50000,3 dB roll-off
4.042392392392393,-1.0445419169249452,Vass01,Vassilakis (2001),interference,#B50000,3 dB roll-off
4.042892892892893,-1.0447382948641848,Vass01,Vassilakis (2001),interference,#B50000,3 dB roll-off
4.043393393393393,-1.0449331113844216,Vass01,Vassilakis (2001),interference,#B50000,3 dB roll-off
4.043893893893894,-1.0451274867123412,Vass01,Vassilakis (2001),interference,#B50000,3 dB roll-off
4.044394394394395,-1.045320306145114,Vass01,Vassilakis (2001),interference,#B50000,3 dB roll-off
4.044894894894895,-1.0455126819336122,Vass01,Vassilakis (2001),interference,#B50000,3 dB roll-off
4.045395395395396,-1.0457035073336853,Vass01,Vassilakis (2001),interference,#B50000,3 dB roll-off
4.045895895895896,-1.0458938866300578,Vass01,Vassilakis (2001),interference,#B50000,3 dB roll-off
4.046396396396396,-1.0460827210276633,Vass01,Vassilakis (2001),interference,#B50000,3 dB roll-off
4.0468968968968975,-1.0462711068546204,Vass01,Vassilakis (2001),interference,#B50000,3 dB roll-off
4.047397397397398,-1.0464579532554596,Vass01,Vassilakis (2001),interference,#B50000,3 dB roll-off
4.047897897897898,-1.046644348611156,Vass01,Vassilakis (2001),interference,#B50000,3 dB roll-off
4.048398398398398,-1.046829209996422,Vass01,Vassilakis (2001),interference,#B50000,3 dB roll-off
4.048898898898899,-1.0470136178544693,Vass01,Vassilakis (2001),interference,#B50000,3 dB roll-off
4.0493993993994,-1.0471964971808585,Vass01,Vassilakis (2001),interference,#B50000,3 dB roll-off
4.0498998998999,-1.047378920490343,Vass01,Vassilakis (2001),interference,#B50000,3 dB roll-off
4.050400400400401,-1.0475598206901133,Vass01,Vassilakis (2001),interference,#B50000,3 dB roll-off
4.050900900900901,-1.047740262375621,Vass01,Vassilakis (2001),interference,#B50000,3 dB roll-off
4.051401401401401,-1.047919186356549,Vass01,Vassilakis (2001),interference,#B50000,3 dB roll-off
4.0519019019019025,-1.0480976493181802,Vass01,Vassilakis (2001),interference,#B50000,3 dB roll-off
4.052402402402403,-1.0482745999636287,Vass01,Vassilakis (2001),interference,#B50000,3 dB roll-off
4.052902902902903,-1.0484510870770145,Vass01,Vassilakis (2001),interference,#B50000,3 dB roll-off
4.053403403403403,-1.048626067245928,Vass01,Vassilakis (2001),interference,#B50000,3 dB roll-off
4.053903903903904,-1.0488005813622558,Vass01,Vassilakis (2001),interference,#B50000,3 dB roll-off
4.054404404404405,-1.0489735938891882,Vass01,Vassilakis (2001),interference,#B50000,3 dB roll-off
4.054904904904905,-1.049146137835214,Vass01,Vassilakis (2001),interference,#B50000,3 dB roll-off
4.055405405405406,-1.0493171855303334,Vass01,Vassilakis (2001),interference,#B50000,3 dB roll-off
4.055905905905906,-1.0494877621084016,Vass01,Vassilakis (2001),interference,#B50000,3 dB roll-off
4.056406406406406,-1.0496568477575412,Vass01,Vassilakis (2001),interference,#B50000,3 dB roll-off
4.0569069069069075,-1.0498254597456067,Vass01,Vassilakis (2001),interference,#B50000,3 dB roll-off
4.057407407407408,-1.0499925861102426,Vass01,Vassilakis (2001),interference,#B50000,3 dB roll-off
4.057907907907908,-1.0501592362618817,Vass01,Vassilakis (2001),interference,#B50000,3 dB roll-off
4.058408408408408,-1.0503244060791699,Vass01,Vassilakis (2001),interference,#B50000,3 dB roll-off
4.058908908908909,-1.050489097123608,Vass01,Vassilakis (2001),interference,#B50000,3 dB roll-off
4.05940940940941,-1.0506523131064014,Vass01,Vassilakis (2001),interference,#B50000,3 dB roll-off
4.05990990990991,-1.0508150477485139,Vass01,Vassilakis (2001),interference,#B50000,3 dB roll-off
4.060410410410411,-1.0509763125853844,Vass01,Vassilakis (2001),interference,#B50000,3 dB roll-off
4.060910910910911,-1.0511370935057285,Vass01,Vassilakis (2001),interference,#B50000,3 dB roll-off
4.061411411411411,-1.051296409860973,Vass01,Vassilakis (2001),interference,#B50000,3 dB roll-off
4.0619119119119125,-1.051455239715802,Vass01,Vassilakis (2001),interference,#B50000,3 dB roll-off
4.062412412412413,-1.051612610229452,Vass01,Vassilakis (2001),interference,#B50000,3 dB roll-off
4.062912912912913,-1.051769491650731,Vass01,Vassilakis (2001),interference,#B50000,3 dB roll-off
4.0634134134134134,-1.051924918938614,Vass01,Vassilakis (2001),interference,#B50000,3 dB roll-off
4.063913913913914,-1.052079854534034,Vass01,Vassilakis (2001),interference,#B50000,3 dB roll-off
4.064414414414415,-1.0522333411877325,Vass01,Vassilakis (2001),interference,#B50000,3 dB roll-off
4.064914914914915,-1.0523863335407273,Vass01,Vassilakis (2001),interference,#B50000,3 dB roll-off
4.065415415415416,-1.0525378821276288,Vass01,Vassilakis (2001),interference,#B50000,3 dB roll-off
4.065915915915916,-1.0526889337973955,Vass01,Vassilakis (2001),interference,#B50000,3 dB roll-off
4.066416416416416,-1.0528385468606978,Vass01,Vassilakis (2001),interference,#B50000,3 dB roll-off
4.0669169169169175,-1.0529876603822133,Vass01,Vassilakis (2001),interference,#B50000,3 dB roll-off
4.067417417417418,-1.0531353404409505,Vass01,Vassilakis (2001),interference,#B50000,3 dB roll-off
4.067917917917918,-1.0532825183249797,Vass01,Vassilakis (2001),interference,#B50000,3 dB roll-off
4.0684184184184184,-1.0534282678740166,Vass01,Vassilakis (2001),interference,#B50000,3 dB roll-off
4.06891891891892,-1.0535735126071353,Vass01,Vassilakis (2001),interference,#B50000,3 dB roll-off
4.06941941941942,-1.0537173341172243,Vass01,Vassilakis (2001),interference,#B50000,3 dB roll-off
4.06991991991992,-1.0538606481618364,Vass01,Vassilakis (2001),interference,#B50000,3 dB roll-off
4.070420420420421,-1.05400254407958,Vass01,Vassilakis (2001),interference,#B50000,3 dB roll-off
4.070920920920921,-1.054143929873927,Vass01,Vassilakis (2001),interference,#B50000,3 dB roll-off
4.071421421421421,-1.0542839026218378,Vass01,Vassilakis (2001),interference,#B50000,3 dB roll-off
4.0719219219219225,-1.054423362580013,Vass01,Vassilakis (2001),interference,#B50000,3 dB roll-off
4.072422422422423,-1.0545614145564988,Vass01,Vassilakis (2001),interference,#B50000,3 dB roll-off
4.072922922922923,-1.0546989510684754,Vass01,Vassilakis (2001),interference,#B50000,3 dB roll-off
4.0734234234234235,-1.0548350846478742,Vass01,Vassilakis (2001),interference,#B50000,3 dB roll-off
4.073923923923925,-1.0549707000795032,Vass01,Vassilakis (2001),interference,#B50000,3 dB roll-off
4.074424424424425,-1.0551049176120766,Vass01,Vassilakis (2001),interference,#B50000,3 dB roll-off
4.074924924924925,-1.0552386143051136,Vass01,Vassilakis (2001),interference,#B50000,3 dB roll-off
4.075425425425426,-1.0553709181171032,Vass01,Vassilakis (2001),interference,#B50000,3 dB roll-off
4.075925925925926,-1.0555026983892148,Vass01,Vassilakis (2001),interference,#B50000,3 dB roll-off
4.076426426426426,-1.0556330907828042,Vass01,Vassilakis (2001),interference,#B50000,3 dB roll-off
4.0769269269269275,-1.0557629569275888,Vass01,Vassilakis (2001),interference,#B50000,3 dB roll-off
4.077427427427428,-1.055891440180951,Vass01,Vassilakis (2001),interference,#B50000,3 dB roll-off
4.077927927927928,-1.0560193944679557,Vass01,Vassilakis (2001),interference,#B50000,3 dB roll-off
4.0784284284284285,-1.0561459708352543,Vass01,Vassilakis (2001),interference,#B50000,3 dB roll-off
4.07892892892893,-1.0562720155099765,Vass01,Vassilakis (2001),interference,#B50000,3 dB roll-off
4.07942942942943,-1.0563966872213888,Vass01,Vassilakis (2001),interference,#B50000,3 dB roll-off
4.07992992992993,-1.0565208245053002,Vass01,Vassilakis (2001),interference,#B50000,3 dB roll-off
4.080430430430431,-1.0566435937670262,Vass01,Vassilakis (2001),interference,#B50000,3 dB roll-off
4.080930930930931,-1.056765825857585,Vass01,Vassilakis (2001),interference,#B50000,3 dB roll-off
4.081431431431431,-1.0568866948518487,Vass01,Vassilakis (2001),interference,#B50000,3 dB roll-off
4.0819319319319325,-1.0570070239225087,Vass01,Vassilakis (2001),interference,#B50000,3 dB roll-off
4.082432432432433,-1.0571259948076113,Vass01,Vassilakis (2001),interference,#B50000,3 dB roll-off
4.082932932932933,-1.057244423007842,Vass01,Vassilakis (2001),interference,#B50000,3 dB roll-off
4.0834334334334335,-1.0573614979181207,Vass01,Vassilakis (2001),interference,#B50000,3 dB roll-off
4.083933933933935,-1.0574780273734208,Vass01,Vassilakis (2001),interference,#B50000,3 dB roll-off
4.084434434434435,-1.0575932084192978,Vass01,Vassilakis (2001),interference,#B50000,3 dB roll-off
4.084934934934935,-1.0577078412311962,Vass01,Vassilakis (2001),interference,#B50000,3 dB roll-off
4.085435435435436,-1.0578209439258361,Vass01,Vassilakis (2001),interference,#B50000,3 dB roll-off
4.085935935935936,-1.0579338687452655,Vass01,Vassilakis (2001),interference,#B50000,3 dB roll-off
4.086436436436436,-1.0580450805796566,Vass01,Vassilakis (2001),interference,#B50000,3 dB roll-off
4.0869369369369375,-1.0581561140318956,Vass01,Vassilakis (2001),interference,#B50000,3 dB roll-off
4.087437437437438,-1.058265437039975,Vass01,Vassilakis (2001),interference,#B50000,3 dB roll-off
4.087937937937938,-1.0583745811595258,Vass01,Vassilakis (2001),interference,#B50000,3 dB roll-off
4.0884384384384385,-1.058482017351363,Vass01,Vassilakis (2001),interference,#B50000,3 dB roll-off
4.08893893893894,-1.0585892741488354,Vass01,Vassilakis (2001),interference,#B50000,3 dB roll-off
4.08943943943944,-1.0586948255106052,Vass01,Vassilakis (2001),interference,#B50000,3 dB roll-off
4.08993993993994,-1.0588001969727272,Vass01,Vassilakis (2001),interference,#B50000,3 dB roll-off
4.090440440440441,-1.0589038654667493,Vass01,Vassilakis (2001),interference,#B50000,3 dB roll-off
4.090940940940941,-1.0590073535563742,Vass01,Vassilakis (2001),interference,#B50000,3 dB roll-off
4.091441441441441,-1.0591091411211078,Vass01,Vassilakis (2001),interference,#B50000,3 dB roll-off
4.0919419419419425,-1.0592107477772295,Vass01,Vassilakis (2001),interference,#B50000,3 dB roll-off
4.092442442442443,-1.0593106563272998,Vass01,Vassilakis (2001),interference,#B50000,3 dB roll-off
4.092942942942943,-1.0594103834650654,Vass01,Vassilakis (2001),interference,#B50000,3 dB roll-off
4.0934434434434435,-1.059508414891257,Vass01,Vassilakis (2001),interference,#B50000,3 dB roll-off
4.093943943943945,-1.0596062644019695,Vass01,Vassilakis (2001),interference,#B50000,3 dB roll-off
4.094444444444445,-1.0597024205712713,Vass01,Vassilakis (2001),interference,#B50000,3 dB roll-off
4.094944944944945,-1.0597983943224172,Vass01,Vassilakis (2001),interference,#B50000,3 dB roll-off
4.095445445445446,-1.0598926770779857,Vass01,Vassilakis (2001),interference,#B50000,3 dB roll-off
4.095945945945946,-1.059986776913233,Vass01,Vassilakis (2001),interference,#B50000,3 dB roll-off
4.096446446446446,-1.0600791880744416,Vass01,Vassilakis (2001),interference,#B50000,3 dB roll-off
4.0969469469469475,-1.0601714158136544,Vass01,Vassilakis (2001),interference,#B50000,3 dB roll-off
4.097447447447448,-1.0602619571760874,Vass01,Vassilakis (2001),interference,#B50000,3 dB roll-off
4.097947947947948,-1.0603523146153342,Vass01,Vassilakis (2001),interference,#B50000,3 dB roll-off
4.0984484484484485,-1.0604409879508008,Vass01,Vassilakis (2001),interference,#B50000,3 dB roll-off
4.09894894894895,-1.0605294768623696,Vass01,Vassilakis (2001),interference,#B50000,3 dB roll-off
4.09944944944945,-1.0606162839189173,Vass01,Vassilakis (2001),interference,#B50000,3 dB roll-off
4.09994994994995,-1.0607029060513251,Vass01,Vassilakis (2001),interference,#B50000,3 dB roll-off
4.100450450450451,-1.060787848553237,Vass01,Vassilakis (2001),interference,#B50000,3 dB roll-off
4.100950950950951,-1.0608726056312354,Vass01,Vassilakis (2001),interference,#B50000,3 dB roll-off
4.101451451451451,-1.0609556852790687,Vass01,Vassilakis (2001),interference,#B50000,3 dB roll-off
4.1019519519519525,-1.0610385790036605,Vass01,Vassilakis (2001),interference,#B50000,3 dB roll-off
4.102452452452453,-1.0611197974742166,Vass01,Vassilakis (2001),interference,#B50000,3 dB roll-off
4.102952952952953,-1.0612008295226663,Vass01,Vassilakis (2001),interference,#B50000,3 dB roll-off
4.1034534534534535,-1.0612801884690333,Vass01,Vassilakis (2001),interference,#B50000,3 dB roll-off
4.103953953953955,-1.0613593604948643,Vass01,Vassilakis (2001),interference,#B50000,3 dB roll-off
4.104454454454455,-1.0614368615464158,Vass01,Vassilakis (2001),interference,#B50000,3 dB roll-off
4.104954954954955,-1.0615141751794308,Vass01,Vassilakis (2001),interference,#B50000,3 dB roll-off
4.105455455455456,-1.061589819941828,Vass01,Vassilakis (2001),interference,#B50000,3 dB roll-off
4.105955955955956,-1.0616652767881223,Vass01,Vassilakis (2001),interference,#B50000,3 dB roll-off
4.106456456456456,-1.0617390668433269,Vass01,Vassilakis (2001),interference,#B50000,3 dB roll-off
4.1069569569569575,-1.061812668485282,Vass01,Vassilakis (2001),interference,#B50000,3 dB roll-off
4.107457457457458,-1.0618846053915856,Vass01,Vassilakis (2001),interference,#B50000,3 dB roll-off
4.107957957957958,-1.061956353387894,Vass01,Vassilakis (2001),interference,#B50000,3 dB roll-off
4.1084584584584585,-1.0620264386798872,Vass01,Vassilakis (2001),interference,#B50000,3 dB roll-off
4.10895895895896,-1.0620963345655572,Vass01,Vassilakis (2001),interference,#B50000,3 dB roll-off
4.10945945945946,-1.0621645697541697,Vass01,Vassilakis (2001),interference,#B50000,3 dB roll-off
4.10995995995996,-1.0622326150405232,Vass01,Vassilakis (2001),interference,#B50000,3 dB roll-off
4.110460460460461,-1.062299001613022,Vass01,Vassilakis (2001),interference,#B50000,3 dB roll-off
4.110960960960961,-1.0623651977877162,Vass01,Vassilakis (2001),interference,#B50000,3 dB roll-off
4.111461461461461,-1.0624297372077143,Vass01,Vassilakis (2001),interference,#B50000,3 dB roll-off
4.1119619619619625,-1.0624940857347485,Vass01,Vassilakis (2001),interference,#B50000,3 dB roll-off
4.112462462462463,-1.0625567794422035,Vass01,Vassilakis (2001),interference,#B50000,3 dB roll-off
4.112962962962963,-1.0626192817619153,Vass01,Vassilakis (2001),interference,#B50000,3 dB roll-off
4.1134634634634635,-1.0626801311731662,Vass01,Vassilakis (2001),interference,#B50000,3 dB roll-off
4.113963963963965,-1.062740788702253,Vass01,Vassilakis (2001),interference,#B50000,3 dB roll-off
4.114464464464465,-1.0627997952099912,Vass01,Vassilakis (2001),interference,#B50000,3 dB roll-off
4.114964964964965,-1.062858609341512,Vass01,Vassilakis (2001),interference,#B50000,3 dB roll-off
4.115465465465466,-1.0629157743148157,Vass01,Vassilakis (2001),interference,#B50000,3 dB roll-off
4.115965965965966,-1.0629727464182028,Vass01,Vassilakis (2001),interference,#B50000,3 dB roll-off
4.116466466466467,-1.063028071202526,Vass01,Vassilakis (2001),interference,#B50000,3 dB roll-off
4.1169669669669675,-1.0630832026235804,Vass01,Vassilakis (2001),interference,#B50000,3 dB roll-off
4.117467467467468,-1.0631366885407783,Vass01,Vassilakis (2001),interference,#B50000,3 dB roll-off
4.117967967967968,-1.0631899806016925,Vass01,Vassilakis (2001),interference,#B50000,3 dB roll-off
4.1184684684684685,-1.0632416289500053,Vass01,Vassilakis (2001),interference,#B50000,3 dB roll-off
4.11896896896897,-1.0632930829493707,Vass01,Vassilakis (2001),interference,#B50000,3 dB roll-off
4.11946946946947,-1.0633428950034605,Vass01,Vassilakis (2001),interference,#B50000,3 dB roll-off
4.11996996996997,-1.0633925122162426,Vass01,Vassilakis (2001),interference,#B50000,3 dB roll-off
4.120470470470471,-1.0634404892271778,Vass01,Vassilakis (2001),interference,#B50000,3 dB roll-off
4.120970970970971,-1.0634882709047697,Vass01,Vassilakis (2001),interference,#B50000,3 dB roll-off
4.121471471471472,-1.0635344141000334,Vass01,Vassilakis (2001),interference,#B50000,3 dB roll-off
4.1219719719719725,-1.0635803614702304,Vass01,Vassilakis (2001),interference,#B50000,3 dB roll-off
4.122472472472473,-1.0636246720537343,Vass01,Vassilakis (2001),interference,#B50000,3 dB roll-off
4.122972972972973,-1.0636687863207528,Vass01,Vassilakis (2001),interference,#B50000,3 dB roll-off
4.1234734734734735,-1.0637112654728353,Vass01,Vassilakis (2001),interference,#B50000,3 dB roll-off
4.123973973973975,-1.063753547817315,Vass01,Vassilakis (2001),interference,#B50000,3 dB roll-off
4.124474474474475,-1.063794196694756,Vass01,Vassilakis (2001),interference,#B50000,3 dB roll-off
4.124974974974975,-1.0638346482737682,Vass01,Vassilakis (2001),interference,#B50000,3 dB roll-off
4.125475475475476,-1.063873468009785,Vass01,Vassilakis (2001),interference,#B50000,3 dB roll-off
4.125975975975976,-1.0639120899568264,Vass01,Vassilakis (2001),interference,#B50000,3 dB roll-off
4.126476476476477,-1.0639490816610988,Vass01,Vassilakis (2001),interference,#B50000,3 dB roll-off
4.1269769769769775,-1.0639858750861206,Vass01,Vassilakis (2001),interference,#B50000,3 dB roll-off
4.127477477477478,-1.0640210398447638,Vass01,Vassilakis (2001),interference,#B50000,3 dB roll-off
4.127977977977978,-1.0640560058341617,Vass01,Vassilakis (2001),interference,#B50000,3 dB roll-off
4.1284784784784785,-1.0640893447097615,Vass01,Vassilakis (2001),interference,#B50000,3 dB roll-off
4.12897897897898,-1.064122484326375,Vass01,Vassilakis (2001),interference,#B50000,3 dB roll-off
4.12947947947948,-1.0641539983579775,Vass01,Vassilakis (2001),interference,#B50000,3 dB roll-off
4.12997997997998,-1.0641853126411136,Vass01,Vassilakis (2001),interference,#B50000,3 dB roll-off
4.130480480480481,-1.0642150028442319,Vass01,Vassilakis (2001),interference,#B50000,3 dB roll-off
4.130980980980981,-1.0642444928096557,Vass01,Vassilakis (2001),interference,#B50000,3 dB roll-off
4.131481481481482,-1.0642723601762796,Vass01,Vassilakis (2001),interference,#B50000,3 dB roll-off
4.1319819819819825,-1.064300026816215,Vass01,Vassilakis (2001),interference,#B50000,3 dB roll-off
4.132482482482483,-1.064326072314819,Vass01,Vassilakis (2001),interference,#B50000,3 dB roll-off
4.132982982982983,-1.0643519165979716,Vass01,Vassilakis (2001),interference,#B50000,3 dB roll-off
4.1334834834834835,-1.0643761311369495,Vass01,Vassilakis (2001),interference,#B50000,3 dB roll-off
4.133983983983985,-1.0644001640450491,Vass01,Vassilakis (2001),interference,#B50000,3 dB roll-off
4.134484484484485,-1.064422558615711,Vass01,Vassilakis (2001),interference,#B50000,3 dB roll-off
4.134984984984985,-1.0644447710005474,Vass01,Vassilakis (2001),interference,#B50000,3 dB roll-off
4.135485485485486,-1.0644653465007667,Vass01,Vassilakis (2001),interference,#B50000,3 dB roll-off
4.135985985985986,-1.0644857392605316,Vass01,Vassilakis (2001),interference,#B50000,3 dB roll-off
4.136486486486487,-1.0645044965646757,Vass01,Vassilakis (2001),interference,#B50000,3 dB roll-off
4.1369869869869875,-1.0645230705740554,Vass01,Vassilakis (2001),interference,#B50000,3 dB roll-off
4.137487487487488,-1.064540010532988,Vass01,Vassilakis (2001),interference,#B50000,3 dB roll-off
4.137987987987988,-1.0645567666431652,Vass01,Vassilakis (2001),interference,#B50000,3 dB roll-off
4.1384884884884885,-1.0645718900842622,Vass01,Vassilakis (2001),interference,#B50000,3 dB roll-off
4.13898898898899,-1.0645868291228888,Vass01,Vassilakis (2001),interference,#B50000,3 dB roll-off
4.13948948948949,-1.0646001368500286,Vass01,Vassilakis (2001),interference,#B50000,3 dB roll-off
4.13998998998999,-1.0646132596212803,Vass01,Vassilakis (2001),interference,#B50000,3 dB roll-off
4.140490490490491,-1.064624752414842,Vass01,Vassilakis (2001),interference,#B50000,3 dB roll-off
4.140990990990991,-1.0646360596993913,Vass01,Vassilakis (2001),interference,#B50000,3 dB roll-off
4.141491491491492,-1.064645808367034,Vass01,Vassilakis (2001),interference,#B50000,3 dB roll-off
4.1419919919919925,-1.0646552308712829,Vass01,Vassilakis (2001),interference,#B50000,3 dB roll-off
4.142492492492493,-1.0646631660003416,Vass01,Vassilakis (2001),interference,#B50000,3 dB roll-off
4.142992992992993,-1.0646707746040487,Vass01,Vassilakis (2001),interference,#B50000,3 dB roll-off
4.1434934934934935,-1.0646768969032163,Vass01,Vassilakis (2001),interference,#B50000,3 dB roll-off
4.143993993993995,-1.0646826923178083,Vass01,Vassilakis (2001),interference,#B50000,3 dB roll-off
4.144494494494495,-1.0646870024722892,Vass01,Vassilakis (2001),interference,#B50000,3 dB roll-off
4.144994994994995,-1.0646909853856936,Vass01,Vassilakis (2001),interference,#B50000,3 dB roll-off
4.145495495495496,-1.0646934840572237,Vass01,Vassilakis (2001),interference,#B50000,3 dB roll-off
4.145995995995996,-1.0646956551339015,Vass01,Vassilakis (2001),interference,#B50000,3 dB roll-off
4.146496496496497,-1.0646963429607235,Vass01,Vassilakis (2001),interference,#B50000,3 dB roll-off
4.1469969969969975,-1.0646967028416472,Vass01,Vassilakis (2001),interference,#B50000,3 dB roll-off
4.147497497497498,-1.0646955804385276,Vass01,Vassilakis (2001),interference,#B50000,3 dB roll-off
4.147997997997998,-1.0646941297411991,Vass01,Vassilakis (2001),interference,#B50000,3 dB roll-off
4.1484984984984985,-1.064691197699426,Vass01,Vassilakis (2001),interference,#B50000,3 dB roll-off
4.148998998999,-1.064687937017869,Vass01,Vassilakis (2001),interference,#B50000,3 dB roll-off
4.1494994994995,-1.064683195905256,Vass01,Vassilakis (2001),interference,#B50000,3 dB roll-off
4.15,-1.0646781258100246,Vass01,Vassilakis (2001),interference,#B50000,3 dB roll-off
