interval,output,model_id,model_label,model_theory,model_colour,timbre_label
0,1.784039783164293,Har18,Harrison & Pearce (2018),harmonicity,#11A3FF,Harmonic
0.015015015015015015,1.7719443384656581,Har18,Harrison & Pearce (2018),harmonicity,#11A3FF,Harmonic
0.03003003003003003,1.7526185182967877,Har18,Harrison & Pearce (2018),harmonicity,#11A3FF,Harmonic
0.04504504504504504,1.726947541389882,Har18,Harrison & Pearce (2018),harmonicity,#11A3FF,Harmonic
0.06006006006006006,1.6970699725025948,Har18,Harrison & Pearce (2018),harmonicity,#11A3FF,Harmonic
0.07507507507507508,1.6648182994222807,Har18,Harrison & Pearce (2018),harmonicity,#11A3FF,Harmonic
0.09009009009009009,1.6307459947072707,Har18,Harrison & Pearce (2018),harmonicity,#11A3FF,Harmonic
0.10510510510510511,1.594681538752244,Har18,Harrison & Pearce (2018),harmonicity,#11A3FF,Harmonic
0.12012012012012012,1.556656165917689,Har18,Harrison & Pearce (2018),harmonicity,#11A3FF,Harmonic
0.13513513513513514,1.5171713710631367,Har18,Harrison & Pearce (2018),harmonicity,#11A3FF,Harmonic
0.15015015015015015,1.4769763202107564,Har18,Harrison & Pearce (2018),harmonicity,#11A3FF,Harmonic
0.16516516516516516,1.4368077939587511,Har18,Harrison & Pearce (2018),harmonicity,#11A3FF,Harmonic
0.18018018018018017,1.397269243148628,Har18,Harrison & Pearce (2018),harmonicity,#11A3FF,Harmonic
0.19519519519519518,1.3588470893318034,Har18,Harrison & Pearce (2018),harmonicity,#11A3FF,Harmonic
0.21021021021021022,1.3219856782910095,Har18,Harrison & Pearce (2018),harmonicity,#11A3FF,Harmonic
0.22522522522522523,1.2871160841352811,Har18,Harrison & Pearce (2018),harmonicity,#11A3FF,Harmonic
0.24024024024024024,1.2546059069151627,Har18,Harrison & Pearce (2018),harmonicity,#11A3FF,Harmonic
0.2552552552552553,1.2246695817414692,Har18,Harrison & Pearce (2018),harmonicity,#11A3FF,Harmonic
0.2702702702702703,1.1972963556400862,Har18,Harrison & Pearce (2018),harmonicity,#11A3FF,Harmonic
0.2852852852852853,1.1723045809548167,Har18,Harrison & Pearce (2018),harmonicity,#11A3FF,Harmonic
0.3003003003003003,1.1495626046454517,Har18,Harrison & Pearce (2018),harmonicity,#11A3FF,Harmonic
0.3153153153153153,1.1291528063817633,Har18,Harrison & Pearce (2018),harmonicity,#11A3FF,Harmonic
0.3303303303303303,1.1112589664977708,Har18,Harrison & Pearce (2018),harmonicity,#11A3FF,Harmonic
0.34534534534534533,1.0959324351699964,Har18,Harrison & Pearce (2018),harmonicity,#11A3FF,Harmonic
0.36036036036036034,1.0830195671285205,Har18,Harrison & Pearce (2018),harmonicity,#11A3FF,Harmonic
0.37537537537537535,1.0722587997200403,Har18,Harrison & Pearce (2018),harmonicity,#11A3FF,Harmonic
0.39039039039039036,1.0633847617768657,Har18,Harrison & Pearce (2018),harmonicity,#11A3FF,Harmonic
0.40540540540540543,1.0561697411786872,Har18,Harrison & Pearce (2018),harmonicity,#11A3FF,Harmonic
0.42042042042042044,1.0504280259954553,Har18,Harrison & Pearce (2018),harmonicity,#11A3FF,Harmonic
0.43543543543543545,1.0460019049700129,Har18,Harrison & Pearce (2018),harmonicity,#11A3FF,Harmonic
0.45045045045045046,1.0427377580721582,Har18,Harrison & Pearce (2018),harmonicity,#11A3FF,Harmonic
0.46546546546546547,1.0404756503018577,Har18,Harrison & Pearce (2018),harmonicity,#11A3FF,Harmonic
0.4804804804804805,1.0390612935384191,Har18,Harrison & Pearce (2018),harmonicity,#11A3FF,Harmonic
0.4954954954954955,1.038358181785815,Har18,Harrison & Pearce (2018),harmonicity,#11A3FF,Harmonic
0.5105105105105106,1.038244714049361,Har18,Harrison & Pearce (2018),harmonicity,#11A3FF,Harmonic
0.5255255255255256,1.0386065356971523,Har18,Harrison & Pearce (2018),harmonicity,#11A3FF,Harmonic
0.5405405405405406,1.0393340729837013,Har18,Harrison & Pearce (2018),harmonicity,#11A3FF,Harmonic
0.5555555555555556,1.0403227381075697,Har18,Harrison & Pearce (2018),harmonicity,#11A3FF,Harmonic
0.5705705705705706,1.041473069824846,Har18,Harrison & Pearce (2018),harmonicity,#11A3FF,Harmonic
0.5855855855855856,1.0426916620033346,Har18,Harrison & Pearce (2018),harmonicity,#11A3FF,Harmonic
0.6006006006006006,1.0438922747040185,Har18,Harrison & Pearce (2018),harmonicity,#11A3FF,Harmonic
0.6156156156156156,1.0449983745437563,Har18,Harrison & Pearce (2018),harmonicity,#11A3FF,Harmonic
0.6306306306306306,1.0459518481284729,Har18,Harrison & Pearce (2018),harmonicity,#11A3FF,Harmonic
0.6456456456456456,1.0467226538813503,Har18,Harrison & Pearce (2018),harmonicity,#11A3FF,Harmonic
0.6606606606606606,1.047300664411365,Har18,Harrison & Pearce (2018),harmonicity,#11A3FF,Harmonic
0.6756756756756757,1.0476682561538786,Har18,Harrison & Pearce (2018),harmonicity,#11A3FF,Harmonic
0.6906906906906907,1.0477888900003518,Har18,Harrison & Pearce (2018),harmonicity,#11A3FF,Harmonic
0.7057057057057057,1.047638406579521,Har18,Harrison & Pearce (2018),harmonicity,#11A3FF,Harmonic
0.7207207207207207,1.047246812752555,Har18,Harrison & Pearce (2018),harmonicity,#11A3FF,Harmonic
0.7357357357357357,1.0466971263600313,Har18,Harrison & Pearce (2018),harmonicity,#11A3FF,Harmonic
0.7507507507507507,1.0460874422167696,Har18,Harrison & Pearce (2018),harmonicity,#11A3FF,Harmonic
0.7657657657657657,1.0455110671600745,Har18,Harrison & Pearce (2018),harmonicity,#11A3FF,Harmonic
0.7807807807807807,1.045063492641892,Har18,Harrison & Pearce (2018),harmonicity,#11A3FF,Harmonic
0.7957957957957957,1.0448344771408582,Har18,Harrison & Pearce (2018),harmonicity,#11A3FF,Harmonic
0.8108108108108109,1.0448884306664374,Har18,Harrison & Pearce (2018),harmonicity,#11A3FF,Harmonic
0.8258258258258259,1.045275367580831,Har18,Harrison & Pearce (2018),harmonicity,#11A3FF,Harmonic
0.8408408408408409,1.0460625303226907,Har18,Harrison & Pearce (2018),harmonicity,#11A3FF,Harmonic
0.8558558558558559,1.0473404405994058,Har18,Harrison & Pearce (2018),harmonicity,#11A3FF,Harmonic
0.8708708708708709,1.0491971753166043,Har18,Harrison & Pearce (2018),harmonicity,#11A3FF,Harmonic
0.8858858858858859,1.051690117068425,Har18,Harrison & Pearce (2018),harmonicity,#11A3FF,Harmonic
0.9009009009009009,1.054838126973914,Har18,Harrison & Pearce (2018),harmonicity,#11A3FF,Harmonic
0.9159159159159159,1.058638842494787,Har18,Harrison & Pearce (2018),harmonicity,#11A3FF,Harmonic
0.9309309309309309,1.063089202405566,Har18,Harrison & Pearce (2018),harmonicity,#11A3FF,Harmonic
0.9459459459459459,1.068171585875976,Har18,Harrison & Pearce (2018),harmonicity,#11A3FF,Harmonic
0.960960960960961,1.07381552798154,Har18,Harrison & Pearce (2018),harmonicity,#11A3FF,Harmonic
0.975975975975976,1.079901236025303,Har18,Harrison & Pearce (2018),harmonicity,#11A3FF,Harmonic
0.990990990990991,1.0863115351592738,Har18,Harrison & Pearce (2018),harmonicity,#11A3FF,Harmonic
1.006006006006006,1.092942027466189,Har18,Harrison & Pearce (2018),harmonicity,#11A3FF,Harmonic
1.021021021021021,1.0996347123738854,Har18,Harrison & Pearce (2018),harmonicity,#11A3FF,Harmonic
1.0360360360360361,1.1061288937052405,Har18,Harrison & Pearce (2018),harmonicity,#11A3FF,Harmonic
1.0510510510510511,1.1121072038626223,Har18,Harrison & Pearce (2018),harmonicity,#11A3FF,Harmonic
1.0660660660660661,1.117290440470169,Har18,Harrison & Pearce (2018),harmonicity,#11A3FF,Harmonic
1.0810810810810811,1.1214909413346992,Har18,Harrison & Pearce (2018),harmonicity,#11A3FF,Harmonic
1.0960960960960962,1.124599346337987,Har18,Harrison & Pearce (2018),harmonicity,#11A3FF,Harmonic
1.1111111111111112,1.126543872526716,Har18,Harrison & Pearce (2018),harmonicity,#11A3FF,Harmonic
1.1261261261261262,1.1272645895503997,Har18,Harrison & Pearce (2018),harmonicity,#11A3FF,Harmonic
1.1411411411411412,1.1267166156346968,Har18,Harrison & Pearce (2018),harmonicity,#11A3FF,Harmonic
1.1561561561561562,1.1248920395572073,Har18,Harrison & Pearce (2018),harmonicity,#11A3FF,Harmonic
1.1711711711711712,1.1218356970825607,Har18,Harrison & Pearce (2018),harmonicity,#11A3FF,Harmonic
1.1861861861861862,1.1176382505031237,Har18,Harrison & Pearce (2018),harmonicity,#11A3FF,Harmonic
1.2012012012012012,1.1124287655843637,Har18,Harrison & Pearce (2018),harmonicity,#11A3FF,Harmonic
1.2162162162162162,1.106389120757995,Har18,Harrison & Pearce (2018),harmonicity,#11A3FF,Harmonic
1.2312312312312312,1.0997499702521565,Har18,Harrison & Pearce (2018),harmonicity,#11A3FF,Harmonic
1.2462462462462462,1.0927356266562083,Har18,Harrison & Pearce (2018),harmonicity,#11A3FF,Harmonic
1.2612612612612613,1.08552480518768,Har18,Harrison & Pearce (2018),harmonicity,#11A3FF,Harmonic
1.2762762762762763,1.0782896874196677,Har18,Harrison & Pearce (2018),harmonicity,#11A3FF,Harmonic
1.2912912912912913,1.0712487819722571,Har18,Harrison & Pearce (2018),harmonicity,#11A3FF,Harmonic
1.3063063063063063,1.064644387857771,Har18,Harrison & Pearce (2018),harmonicity,#11A3FF,Harmonic
1.3213213213213213,1.0586683904740462,Har18,Harrison & Pearce (2018),harmonicity,#11A3FF,Harmonic
1.3363363363363363,1.0534218702968892,Har18,Harrison & Pearce (2018),harmonicity,#11A3FF,Harmonic
1.3513513513513513,1.0489445854696038,Har18,Harrison & Pearce (2018),harmonicity,#11A3FF,Harmonic
1.3663663663663663,1.0452782617141392,Har18,Harrison & Pearce (2018),harmonicity,#11A3FF,Harmonic
1.3813813813813813,1.042497027706192,Har18,Harrison & Pearce (2018),harmonicity,#11A3FF,Harmonic
1.3963963963963963,1.0406771459191877,Har18,Harrison & Pearce (2018),harmonicity,#11A3FF,Harmonic
1.4114114114114114,1.0398496548117073,Har18,Harrison & Pearce (2018),harmonicity,#11A3FF,Harmonic
1.4264264264264264,1.039989261986943,Har18,Harrison & Pearce (2018),harmonicity,#11A3FF,Harmonic
1.4414414414414414,1.0410368246604982,Har18,Harrison & Pearce (2018),harmonicity,#11A3FF,Harmonic
1.4564564564564564,1.042920681846977,Har18,Harrison & Pearce (2018),harmonicity,#11A3FF,Harmonic
1.4714714714714714,1.0455655442232377,Har18,Harrison & Pearce (2018),harmonicity,#11A3FF,Harmonic
1.4864864864864864,1.0489039462922465,Har18,Harrison & Pearce (2018),harmonicity,#11A3FF,Harmonic
1.5015015015015014,1.0528911218533208,Har18,Harrison & Pearce (2018),harmonicity,#11A3FF,Harmonic
1.5165165165165164,1.0574974103673516,Har18,Harrison & Pearce (2018),harmonicity,#11A3FF,Harmonic
1.5315315315315314,1.0626725380649786,Har18,Harrison & Pearce (2018),harmonicity,#11A3FF,Harmonic
1.5465465465465464,1.0683246904061734,Har18,Harrison & Pearce (2018),harmonicity,#11A3FF,Harmonic
1.5615615615615615,1.0743464816885642,Har18,Harrison & Pearce (2018),harmonicity,#11A3FF,Harmonic
1.5765765765765765,1.0806564212189984,Har18,Harrison & Pearce (2018),harmonicity,#11A3FF,Harmonic
1.5915915915915915,1.0872099135362632,Har18,Harrison & Pearce (2018),harmonicity,#11A3FF,Harmonic
1.6066066066066067,1.093979896612811,Har18,Harrison & Pearce (2018),harmonicity,#11A3FF,Harmonic
1.6216216216216217,1.1009367371527556,Har18,Harrison & Pearce (2018),harmonicity,#11A3FF,Harmonic
1.6366366366366367,1.1080498748638774,Har18,Harrison & Pearce (2018),harmonicity,#11A3FF,Harmonic
1.6516516516516517,1.115315531917027,Har18,Harrison & Pearce (2018),harmonicity,#11A3FF,Harmonic
1.6666666666666667,1.1227829052624556,Har18,Harrison & Pearce (2018),harmonicity,#11A3FF,Harmonic
1.6816816816816818,1.1305270453436456,Har18,Harrison & Pearce (2018),harmonicity,#11A3FF,Harmonic
1.6966966966966968,1.1385678948359153,Har18,Harrison & Pearce (2018),harmonicity,#11A3FF,Harmonic
1.7117117117117118,1.1468262609052728,Har18,Harrison & Pearce (2018),harmonicity,#11A3FF,Harmonic
1.7267267267267268,1.1551862272955264,Har18,Harrison & Pearce (2018),harmonicity,#11A3FF,Harmonic
1.7417417417417418,1.1635991003571897,Har18,Harrison & Pearce (2018),harmonicity,#11A3FF,Harmonic
1.7567567567567568,1.1721067165201613,Har18,Harrison & Pearce (2018),harmonicity,#11A3FF,Harmonic
1.7717717717717718,1.1807582819513225,Har18,Harrison & Pearce (2018),harmonicity,#11A3FF,Harmonic
1.7867867867867868,1.1895169108498092,Har18,Harrison & Pearce (2018),harmonicity,#11A3FF,Harmonic
1.8018018018018018,1.198255994202243,Har18,Harrison & Pearce (2018),harmonicity,#11A3FF,Harmonic
1.8168168168168168,1.2068332262233152,Har18,Harrison & Pearce (2018),harmonicity,#11A3FF,Harmonic
1.8318318318318318,1.2151504039356635,Har18,Harrison & Pearce (2018),harmonicity,#11A3FF,Harmonic
1.8468468468468469,1.223151774706371,Har18,Harrison & Pearce (2018),harmonicity,#11A3FF,Harmonic
1.8618618618618619,1.2307908277547839,Har18,Harrison & Pearce (2018),harmonicity,#11A3FF,Harmonic
1.8768768768768769,1.2380070122637956,Har18,Harrison & Pearce (2018),harmonicity,#11A3FF,Harmonic
1.8918918918918919,1.2447267517205343,Har18,Harrison & Pearce (2018),harmonicity,#11A3FF,Harmonic
1.906906906906907,1.2508826940180016,Har18,Harrison & Pearce (2018),harmonicity,#11A3FF,Harmonic
1.921921921921922,1.256432108467339,Har18,Harrison & Pearce (2018),harmonicity,#11A3FF,Harmonic
1.936936936936937,1.2613535266911529,Har18,Harrison & Pearce (2018),harmonicity,#11A3FF,Harmonic
1.951951951951952,1.2656187701232375,Har18,Harrison & Pearce (2018),harmonicity,#11A3FF,Harmonic
1.966966966966967,1.2691679954038049,Har18,Harrison & Pearce (2018),harmonicity,#11A3FF,Harmonic
1.981981981981982,1.271930112919526,Har18,Harrison & Pearce (2018),harmonicity,#11A3FF,Harmonic
1.996996996996997,1.2738882401105565,Har18,Harrison & Pearce (2018),harmonicity,#11A3FF,Harmonic
2.012012012012012,1.2751165850789092,Har18,Harrison & Pearce (2018),harmonicity,#11A3FF,Harmonic
2.027027027027027,1.2757250675848766,Har18,Harrison & Pearce (2018),harmonicity,#11A3FF,Harmonic
2.042042042042042,1.2757593101931397,Har18,Harrison & Pearce (2018),harmonicity,#11A3FF,Harmonic
2.057057057057057,1.2751675803975646,Har18,Harrison & Pearce (2018),harmonicity,#11A3FF,Harmonic
2.0720720720720722,1.273866915653415,Har18,Harrison & Pearce (2018),harmonicity,#11A3FF,Harmonic
2.0870870870870872,1.2718264261453014,Har18,Harrison & Pearce (2018),harmonicity,#11A3FF,Harmonic
2.1021021021021022,1.2690898901306389,Har18,Harrison & Pearce (2018),harmonicity,#11A3FF,Harmonic
2.1171171171171173,1.2657491300141237,Har18,Harrison & Pearce (2018),harmonicity,#11A3FF,Harmonic
2.1321321321321323,1.261909497852966,Har18,Harrison & Pearce (2018),harmonicity,#11A3FF,Harmonic
2.1471471471471473,1.2576584879568748,Har18,Harrison & Pearce (2018),harmonicity,#11A3FF,Harmonic
2.1621621621621623,1.2530458765427495,Har18,Harrison & Pearce (2018),harmonicity,#11A3FF,Harmonic
2.1771771771771773,1.248089827868362,Har18,Harrison & Pearce (2018),harmonicity,#11A3FF,Harmonic
2.1921921921921923,1.2428020653028613,Har18,Harrison & Pearce (2018),harmonicity,#11A3FF,Harmonic
2.2072072072072073,1.2372158019695698,Har18,Harrison & Pearce (2018),harmonicity,#11A3FF,Harmonic
2.2222222222222223,1.2314098277482848,Har18,Harrison & Pearce (2018),harmonicity,#11A3FF,Harmonic
2.2372372372372373,1.2255069966851297,Har18,Harrison & Pearce (2018),harmonicity,#11A3FF,Harmonic
2.2522522522522523,1.2196012944466985,Har18,Harrison & Pearce (2018),harmonicity,#11A3FF,Harmonic
2.2672672672672673,1.2136290794472724,Har18,Harrison & Pearce (2018),harmonicity,#11A3FF,Harmonic
2.2822822822822824,1.2073391763253645,Har18,Harrison & Pearce (2018),harmonicity,#11A3FF,Harmonic
2.2972972972972974,1.2004917081696627,Har18,Harrison & Pearce (2018),harmonicity,#11A3FF,Harmonic
2.3123123123123124,1.1931215255592318,Har18,Harrison & Pearce (2018),harmonicity,#11A3FF,Harmonic
2.3273273273273274,1.1855496771469674,Har18,Harrison & Pearce (2018),harmonicity,#11A3FF,Harmonic
2.3423423423423424,1.1781292585245737,Har18,Harrison & Pearce (2018),harmonicity,#11A3FF,Harmonic
2.3573573573573574,1.1710305607627058,Har18,Harrison & Pearce (2018),harmonicity,#11A3FF,Harmonic
2.3723723723723724,1.1642471220112698,Har18,Harrison & Pearce (2018),harmonicity,#11A3FF,Harmonic
2.3873873873873874,1.1577204127805418,Har18,Harrison & Pearce (2018),harmonicity,#11A3FF,Harmonic
2.4024024024024024,1.1514366923373125,Har18,Harrison & Pearce (2018),harmonicity,#11A3FF,Harmonic
2.4174174174174174,1.1454539809977844,Har18,Harrison & Pearce (2018),harmonicity,#11A3FF,Harmonic
2.4324324324324325,1.1398651240251614,Har18,Harrison & Pearce (2018),harmonicity,#11A3FF,Harmonic
2.4474474474474475,1.1347253477642065,Har18,Harrison & Pearce (2018),harmonicity,#11A3FF,Harmonic
2.4624624624624625,1.1300146461502156,Har18,Harrison & Pearce (2018),harmonicity,#11A3FF,Harmonic
2.4774774774774775,1.1256831014286,Har18,Harrison & Pearce (2018),harmonicity,#11A3FF,Harmonic
2.4924924924924925,1.1217343753729423,Har18,Harrison & Pearce (2018),harmonicity,#11A3FF,Harmonic
2.5075075075075075,1.118254243145918,Har18,Harrison & Pearce (2018),harmonicity,#11A3FF,Harmonic
2.5225225225225225,1.1153382808950234,Har18,Harrison & Pearce (2018),harmonicity,#11A3FF,Harmonic
2.5375375375375375,1.1129791292096822,Har18,Harrison & Pearce (2018),harmonicity,#11A3FF,Harmonic
2.5525525525525525,1.1110404816899626,Har18,Harrison & Pearce (2018),harmonicity,#11A3FF,Harmonic
2.5675675675675675,1.109354748640621,Har18,Harrison & Pearce (2018),harmonicity,#11A3FF,Harmonic
2.5825825825825826,1.1078264977076038,Har18,Harrison & Pearce (2018),harmonicity,#11A3FF,Harmonic
2.5975975975975976,1.106435285145763,Har18,Harrison & Pearce (2018),harmonicity,#11A3FF,Harmonic
2.6126126126126126,1.1051753108323896,Har18,Harrison & Pearce (2018),harmonicity,#11A3FF,Harmonic
2.6276276276276276,1.104018768027203,Har18,Harrison & Pearce (2018),harmonicity,#11A3FF,Harmonic
2.6426426426426426,1.1029210082210499,Har18,Harrison & Pearce (2018),harmonicity,#11A3FF,Harmonic
2.6576576576576576,1.1018366965561983,Har18,Harrison & Pearce (2018),harmonicity,#11A3FF,Harmonic
2.6726726726726726,1.100728956981698,Har18,Harrison & Pearce (2018),harmonicity,#11A3FF,Harmonic
2.6876876876876876,1.0995775652976125,Har18,Harrison & Pearce (2018),harmonicity,#11A3FF,Harmonic
2.7027027027027026,1.098394343635957,Har18,Harrison & Pearce (2018),harmonicity,#11A3FF,Harmonic
2.7177177177177176,1.0972335547930459,Har18,Harrison & Pearce (2018),harmonicity,#11A3FF,Harmonic
2.7327327327327327,1.0961706315145494,Har18,Harrison & Pearce (2018),harmonicity,#11A3FF,Harmonic
2.7477477477477477,1.0952564134359046,Har18,Harrison & Pearce (2018),harmonicity,#11A3FF,Harmonic
2.7627627627627627,1.0945068595802894,Har18,Harrison & Pearce (2018),harmonicity,#11A3FF,Harmonic
2.7777777777777777,1.093960099667212,Har18,Harrison & Pearce (2018),harmonicity,#11A3FF,Harmonic
2.7927927927927927,1.0937353068688633,Har18,Harrison & Pearce (2018),harmonicity,#11A3FF,Harmonic
2.8078078078078077,1.0940103236183907,Har18,Harrison & Pearce (2018),harmonicity,#11A3FF,Harmonic
2.8228228228228227,1.0949364720191015,Har18,Harrison & Pearce (2018),harmonicity,#11A3FF,Harmonic
2.8378378378378377,1.0965872687309728,Har18,Harrison & Pearce (2018),harmonicity,#11A3FF,Harmonic
2.8528528528528527,1.098991966191095,Har18,Harrison & Pearce (2018),harmonicity,#11A3FF,Harmonic
2.8678678678678677,1.1022020661687693,Har18,Harrison & Pearce (2018),harmonicity,#11A3FF,Harmonic
2.8828828828828827,1.106304576331248,Har18,Harrison & Pearce (2018),harmonicity,#11A3FF,Harmonic
2.8978978978978978,1.1113642470277372,Har18,Harrison & Pearce (2018),harmonicity,#11A3FF,Harmonic
2.9129129129129128,1.117363506550729,Har18,Harrison & Pearce (2018),harmonicity,#11A3FF,Harmonic
2.9279279279279278,1.1242101538989464,Har18,Harrison & Pearce (2018),harmonicity,#11A3FF,Harmonic
2.942942942942943,1.13179902892069,Har18,Harrison & Pearce (2018),harmonicity,#11A3FF,Harmonic
2.957957957957958,1.1400504898067867,Har18,Harrison & Pearce (2018),harmonicity,#11A3FF,Harmonic
2.972972972972973,1.1488827129157004,Har18,Harrison & Pearce (2018),harmonicity,#11A3FF,Harmonic
2.987987987987988,1.1581531564954726,Har18,Harrison & Pearce (2018),harmonicity,#11A3FF,Harmonic
3.003003003003003,1.1676316173654644,Har18,Harrison & Pearce (2018),harmonicity,#11A3FF,Harmonic
3.018018018018018,1.1770319133104667,Har18,Harrison & Pearce (2018),harmonicity,#11A3FF,Harmonic
3.033033033033033,1.1860714890492285,Har18,Harrison & Pearce (2018),harmonicity,#11A3FF,Harmonic
3.048048048048048,1.1945000910005035,Har18,Harrison & Pearce (2018),harmonicity,#11A3FF,Harmonic
3.063063063063063,1.2020862665199445,Har18,Harrison & Pearce (2018),harmonicity,#11A3FF,Harmonic
3.078078078078078,1.208608731379193,Har18,Harrison & Pearce (2018),harmonicity,#11A3FF,Harmonic
3.093093093093093,1.2138702762892095,Har18,Harrison & Pearce (2018),harmonicity,#11A3FF,Harmonic
3.108108108108108,1.2177029904083678,Har18,Harrison & Pearce (2018),harmonicity,#11A3FF,Harmonic
3.123123123123123,1.2199583043466398,Har18,Harrison & Pearce (2018),harmonicity,#11A3FF,Harmonic
3.138138138138138,1.2205074390820194,Har18,Harrison & Pearce (2018),harmonicity,#11A3FF,Harmonic
3.153153153153153,1.219257166022498,Har18,Harrison & Pearce (2018),harmonicity,#11A3FF,Harmonic
3.168168168168168,1.2161638577339002,Har18,Harrison & Pearce (2018),harmonicity,#11A3FF,Harmonic
3.183183183183183,1.2112379670026627,Har18,Harrison & Pearce (2018),harmonicity,#11A3FF,Harmonic
3.198198198198198,1.2045429043491505,Har18,Harrison & Pearce (2018),harmonicity,#11A3FF,Harmonic
3.2132132132132134,1.1961910820260264,Har18,Harrison & Pearce (2018),harmonicity,#11A3FF,Harmonic
3.2282282282282284,1.1863370427083482,Har18,Harrison & Pearce (2018),harmonicity,#11A3FF,Harmonic
3.2432432432432434,1.1751691220935234,Har18,Harrison & Pearce (2018),harmonicity,#11A3FF,Harmonic
3.2582582582582584,1.1629018395181245,Har18,Harrison & Pearce (2018),harmonicity,#11A3FF,Harmonic
3.2732732732732734,1.1497692552812215,Har18,Harrison & Pearce (2018),harmonicity,#11A3FF,Harmonic
3.2882882882882885,1.1360183374724422,Har18,Harrison & Pearce (2018),harmonicity,#11A3FF,Harmonic
3.3033033033033035,1.1219020525532042,Har18,Harrison & Pearce (2018),harmonicity,#11A3FF,Harmonic
3.3183183183183185,1.1076726461807984,Har18,Harrison & Pearce (2018),harmonicity,#11A3FF,Harmonic
3.3333333333333335,1.0935755459415792,Har18,Harrison & Pearce (2018),harmonicity,#11A3FF,Harmonic
3.3483483483483485,1.0798439151443968,Har18,Harrison & Pearce (2018),harmonicity,#11A3FF,Harmonic
3.3633633633633635,1.0666935553272903,Har18,Harrison & Pearce (2018),harmonicity,#11A3FF,Harmonic
3.3783783783783785,1.0543183563949317,Har18,Harrison & Pearce (2018),harmonicity,#11A3FF,Harmonic
3.3933933933933935,1.0428887867070509,Har18,Harrison & Pearce (2018),harmonicity,#11A3FF,Harmonic
3.4084084084084085,1.0325579625018129,Har18,Harrison & Pearce (2018),harmonicity,#11A3FF,Harmonic
3.4234234234234235,1.023474936809641,Har18,Harrison & Pearce (2018),harmonicity,#11A3FF,Harmonic
3.4384384384384385,1.0157925653885176,Har18,Harrison & Pearce (2018),harmonicity,#11A3FF,Harmonic
3.4534534534534536,1.0096549045022638,Har18,Harrison & Pearce (2018),harmonicity,#11A3FF,Harmonic
3.4684684684684686,1.0051700604992575,Har18,Harrison & Pearce (2018),harmonicity,#11A3FF,Harmonic
3.4834834834834836,1.0023961985720384,Har18,Harrison & Pearce (2018),harmonicity,#11A3FF,Harmonic
3.4984984984984986,1.0013572723513318,Har18,Harrison & Pearce (2018),harmonicity,#11A3FF,Harmonic
3.5135135135135136,1.0020717120565406,Har18,Harrison & Pearce (2018),harmonicity,#11A3FF,Harmonic
3.5285285285285286,1.0045658782395646,Har18,Harrison & Pearce (2018),harmonicity,#11A3FF,Harmonic
3.5435435435435436,1.0088658280004243,Har18,Harrison & Pearce (2018),harmonicity,#11A3FF,Harmonic
3.5585585585585586,1.0149821734621876,Har18,Harrison & Pearce (2018),harmonicity,#11A3FF,Harmonic
3.5735735735735736,1.0229006385275115,Har18,Harrison & Pearce (2018),harmonicity,#11A3FF,Harmonic
3.5885885885885886,1.0325787101011494,Har18,Harrison & Pearce (2018),harmonicity,#11A3FF,Harmonic
3.6036036036036037,1.0439439538363045,Har18,Harrison & Pearce (2018),harmonicity,#11A3FF,Harmonic
3.6186186186186187,1.0568917457206923,Har18,Harrison & Pearce (2018),harmonicity,#11A3FF,Harmonic
3.6336336336336337,1.0712826125945032,Har18,Harrison & Pearce (2018),harmonicity,#11A3FF,Harmonic
3.6486486486486487,1.0869400012251897,Har18,Harrison & Pearce (2018),harmonicity,#11A3FF,Harmonic
3.6636636636636637,1.1036491247450273,Har18,Harrison & Pearce (2018),harmonicity,#11A3FF,Harmonic
3.6786786786786787,1.1211573567959503,Har18,Harrison & Pearce (2018),harmonicity,#11A3FF,Harmonic
3.6936936936936937,1.1391765445921558,Har18,Harrison & Pearce (2018),harmonicity,#11A3FF,Harmonic
3.7087087087087087,1.1573875354795862,Har18,Harrison & Pearce (2018),harmonicity,#11A3FF,Harmonic
3.7237237237237237,1.1754470779506336,Har18,Harrison & Pearce (2018),harmonicity,#11A3FF,Harmonic
3.7387387387387387,1.1929970756525146,Har18,Harrison & Pearce (2018),harmonicity,#11A3FF,Harmonic
3.7537537537537538,1.2096758982411764,Har18,Harrison & Pearce (2018),harmonicity,#11A3FF,Harmonic
3.7687687687687688,1.225131151355374,Har18,Harrison & Pearce (2018),harmonicity,#11A3FF,Harmonic
3.7837837837837838,1.2390329912666442,Har18,Harrison & Pearce (2018),harmonicity,#11A3FF,Harmonic
3.798798798798799,1.2510868880901003,Har18,Harrison & Pearce (2018),harmonicity,#11A3FF,Harmonic
3.813813813813814,1.2610447385229144,Har18,Harrison & Pearce (2018),harmonicity,#11A3FF,Harmonic
3.828828828828829,1.268713510150029,Har18,Harrison & Pearce (2018),harmonicity,#11A3FF,Harmonic
3.843843843843844,1.2739610516457918,Har18,Harrison & Pearce (2018),harmonicity,#11A3FF,Harmonic
3.858858858858859,1.2767192112120787,Har18,Harrison & Pearce (2018),harmonicity,#11A3FF,Harmonic
3.873873873873874,1.276984740631598,Har18,Harrison & Pearce (2018),harmonicity,#11A3FF,Harmonic
3.888888888888889,1.274818535102738,Har18,Harrison & Pearce (2018),harmonicity,#11A3FF,Harmonic
3.903903903903904,1.2703437148708183,Har18,Harrison & Pearce (2018),harmonicity,#11A3FF,Harmonic
3.918918918918919,1.2637435094283542,Har18,Harrison & Pearce (2018),harmonicity,#11A3FF,Harmonic
3.933933933933934,1.2552615451394098,Har18,Harrison & Pearce (2018),harmonicity,#11A3FF,Harmonic
3.948948948948949,1.2452074287267882,Har18,Harrison & Pearce (2018),harmonicity,#11A3FF,Harmonic
3.963963963963964,1.2339590482102893,Har18,Harrison & Pearce (2018),harmonicity,#11A3FF,Harmonic
3.978978978978979,1.2219261495407865,Har18,Harrison & Pearce (2018),harmonicity,#11A3FF,Harmonic
3.993993993993994,1.2094451277803562,Har18,Harrison & Pearce (2018),harmonicity,#11A3FF,Harmonic
4.009009009009009,1.1966787299419788,Har18,Harrison & Pearce (2018),harmonicity,#11A3FF,Harmonic
4.024024024024024,1.1836887608447764,Har18,Harrison & Pearce (2018),harmonicity,#11A3FF,Harmonic
4.039039039039039,1.1706833055828902,Har18,Harrison & Pearce (2018),harmonicity,#11A3FF,Harmonic
4.054054054054054,1.1581362554367103,Har18,Harrison & Pearce (2018),harmonicity,#11A3FF,Harmonic
4.069069069069069,1.146561514197291,Har18,Harrison & Pearce (2018),harmonicity,#11A3FF,Harmonic
4.084084084084084,1.1361891390918868,Har18,Harrison & Pearce (2018),harmonicity,#11A3FF,Harmonic
4.099099099099099,1.1269344545451152,Har18,Harrison & Pearce (2018),harmonicity,#11A3FF,Harmonic
4.114114114114114,1.1186375406726035,Har18,Harrison & Pearce (2018),harmonicity,#11A3FF,Harmonic
4.129129129129129,1.111225671262165,Har18,Harrison & Pearce (2018),harmonicity,#11A3FF,Harmonic
4.1441441441441444,1.1046846454976755,Har18,Harrison & Pearce (2018),harmonicity,#11A3FF,Harmonic
4.1591591591591595,1.0990320117131784,Har18,Harrison & Pearce (2018),harmonicity,#11A3FF,Harmonic
4.1741741741741745,1.0943378947938214,Har18,Harrison & Pearce (2018),harmonicity,#11A3FF,Harmonic
4.1891891891891895,1.0906533176569897,Har18,Harrison & Pearce (2018),harmonicity,#11A3FF,Harmonic
4.2042042042042045,1.0878907678407232,Har18,Harrison & Pearce (2018),harmonicity,#11A3FF,Harmonic
4.2192192192192195,1.085828938552921,Har18,Harrison & Pearce (2018),harmonicity,#11A3FF,Harmonic
4.2342342342342345,1.0842262108078458,Har18,Harrison & Pearce (2018),harmonicity,#11A3FF,Harmonic
4.2492492492492495,1.0828998237590377,Har18,Harrison & Pearce (2018),harmonicity,#11A3FF,Harmonic
4.2642642642642645,1.081722352426955,Har18,Harrison & Pearce (2018),harmonicity,#11A3FF,Harmonic
4.2792792792792795,1.0805840837551677,Har18,Harrison & Pearce (2018),harmonicity,#11A3FF,Harmonic
4.2942942942942945,1.079372297015265,Har18,Harrison & Pearce (2018),harmonicity,#11A3FF,Harmonic
4.3093093093093096,1.0779877459299976,Har18,Harrison & Pearce (2018),harmonicity,#11A3FF,Harmonic
4.324324324324325,1.076376933898753,Har18,Harrison & Pearce (2018),harmonicity,#11A3FF,Harmonic
4.33933933933934,1.0745381484019325,Har18,Harrison & Pearce (2018),harmonicity,#11A3FF,Harmonic
4.354354354354355,1.0725030824801656,Har18,Harrison & Pearce (2018),harmonicity,#11A3FF,Harmonic
4.36936936936937,1.070328729877762,Har18,Harrison & Pearce (2018),harmonicity,#11A3FF,Harmonic
4.384384384384385,1.0680885072293616,Har18,Harrison & Pearce (2018),harmonicity,#11A3FF,Harmonic
4.3993993993994,1.0658349191504666,Har18,Harrison & Pearce (2018),harmonicity,#11A3FF,Harmonic
4.414414414414415,1.0635767570318029,Har18,Harrison & Pearce (2018),harmonicity,#11A3FF,Harmonic
4.42942942942943,1.0613287606657924,Har18,Harrison & Pearce (2018),harmonicity,#11A3FF,Harmonic
4.444444444444445,1.059187278006035,Har18,Harrison & Pearce (2018),harmonicity,#11A3FF,Harmonic
4.45945945945946,1.0573284067016615,Har18,Harrison & Pearce (2018),harmonicity,#11A3FF,Harmonic
4.474474474474475,1.0559246895518253,Har18,Harrison & Pearce (2018),harmonicity,#11A3FF,Harmonic
4.48948948948949,1.055085493015307,Har18,Harrison & Pearce (2018),harmonicity,#11A3FF,Harmonic
4.504504504504505,1.0548841412851582,Har18,Harrison & Pearce (2018),harmonicity,#11A3FF,Harmonic
4.51951951951952,1.055418105785183,Har18,Harrison & Pearce (2018),harmonicity,#11A3FF,Harmonic
4.534534534534535,1.0568279382929935,Har18,Harrison & Pearce (2018),harmonicity,#11A3FF,Harmonic
4.54954954954955,1.0592703445757354,Har18,Harrison & Pearce (2018),harmonicity,#11A3FF,Harmonic
4.564564564564565,1.0628637667869756,Har18,Harrison & Pearce (2018),harmonicity,#11A3FF,Harmonic
4.57957957957958,1.0676184977438357,Har18,Harrison & Pearce (2018),harmonicity,#11A3FF,Harmonic
4.594594594594595,1.0734261172458885,Har18,Harrison & Pearce (2018),harmonicity,#11A3FF,Harmonic
4.60960960960961,1.0801832177773856,Har18,Harrison & Pearce (2018),harmonicity,#11A3FF,Harmonic
4.624624624624625,1.0879488707306293,Har18,Harrison & Pearce (2018),harmonicity,#11A3FF,Harmonic
4.63963963963964,1.0969386539380077,Har18,Harrison & Pearce (2018),harmonicity,#11A3FF,Harmonic
4.654654654654655,1.1073480025990519,Har18,Harrison & Pearce (2018),harmonicity,#11A3FF,Harmonic
4.66966966966967,1.1192112846493576,Har18,Harrison & Pearce (2018),harmonicity,#11A3FF,Harmonic
4.684684684684685,1.1324270831513683,Har18,Harrison & Pearce (2018),harmonicity,#11A3FF,Harmonic
4.6996996996997,1.1468630519224603,Har18,Harrison & Pearce (2018),harmonicity,#11A3FF,Harmonic
4.714714714714715,1.1624148345948941,Har18,Harrison & Pearce (2018),harmonicity,#11A3FF,Harmonic
4.72972972972973,1.1790143006065328,Har18,Harrison & Pearce (2018),harmonicity,#11A3FF,Harmonic
4.744744744744745,1.196636225884031,Har18,Harrison & Pearce (2018),harmonicity,#11A3FF,Harmonic
4.75975975975976,1.2152885511929639,Har18,Harrison & Pearce (2018),harmonicity,#11A3FF,Harmonic
4.774774774774775,1.2349355958579538,Har18,Harrison & Pearce (2018),harmonicity,#11A3FF,Harmonic
4.78978978978979,1.2553940929330367,Har18,Harrison & Pearce (2018),harmonicity,#11A3FF,Harmonic
4.804804804804805,1.2763285022523911,Har18,Harrison & Pearce (2018),harmonicity,#11A3FF,Harmonic
4.81981981981982,1.297373213967914,Har18,Harrison & Pearce (2018),harmonicity,#11A3FF,Harmonic
4.834834834834835,1.318234497583435,Har18,Harrison & Pearce (2018),harmonicity,#11A3FF,Harmonic
4.84984984984985,1.3386481708884888,Har18,Harrison & Pearce (2018),harmonicity,#11A3FF,Harmonic
4.864864864864865,1.3582705046370578,Har18,Harrison & Pearce (2018),harmonicity,#11A3FF,Harmonic
4.87987987987988,1.3766599988186963,Har18,Harrison & Pearce (2018),harmonicity,#11A3FF,Harmonic
4.894894894894895,1.3933626665716699,Har18,Harrison & Pearce (2018),harmonicity,#11A3FF,Harmonic
4.90990990990991,1.4079822521710839,Har18,Harrison & Pearce (2018),harmonicity,#11A3FF,Harmonic
4.924924924924925,1.4201731174584735,Har18,Harrison & Pearce (2018),harmonicity,#11A3FF,Harmonic
4.93993993993994,1.4296062638317026,Har18,Harrison & Pearce (2018),harmonicity,#11A3FF,Harmonic
4.954954954954955,1.435970677200461,Har18,Harrison & Pearce (2018),harmonicity,#11A3FF,Harmonic
4.96996996996997,1.4390112191001396,Har18,Harrison & Pearce (2018),harmonicity,#11A3FF,Harmonic
4.984984984984985,1.4385658643121682,Har18,Harrison & Pearce (2018),harmonicity,#11A3FF,Harmonic
5,1.4345839170733703,Har18,Harrison & Pearce (2018),harmonicity,#11A3FF,Harmonic
5.015015015015015,1.4271343572035349,Har18,Harrison & Pearce (2018),harmonicity,#11A3FF,Harmonic
5.03003003003003,1.4163960835260854,Har18,Harrison & Pearce (2018),harmonicity,#11A3FF,Harmonic
5.045045045045045,1.4026145494658022,Har18,Harrison & Pearce (2018),harmonicity,#11A3FF,Harmonic
5.06006006006006,1.3860710562970522,Har18,Harrison & Pearce (2018),harmonicity,#11A3FF,Harmonic
5.075075075075075,1.3671214315140405,Har18,Harrison & Pearce (2018),harmonicity,#11A3FF,Harmonic
5.09009009009009,1.3462437448880051,Har18,Harrison & Pearce (2018),harmonicity,#11A3FF,Harmonic
5.105105105105105,1.3239959474972314,Har18,Harrison & Pearce (2018),harmonicity,#11A3FF,Harmonic
5.12012012012012,1.3009169688383682,Har18,Harrison & Pearce (2018),harmonicity,#11A3FF,Harmonic
5.135135135135135,1.2774725256557125,Har18,Harrison & Pearce (2018),harmonicity,#11A3FF,Harmonic
5.15015015015015,1.2540611081445274,Har18,Harrison & Pearce (2018),harmonicity,#11A3FF,Harmonic
5.165165165165165,1.2310366496732092,Har18,Harrison & Pearce (2018),harmonicity,#11A3FF,Harmonic
5.18018018018018,1.2087302077657598,Har18,Harrison & Pearce (2018),harmonicity,#11A3FF,Harmonic
5.195195195195195,1.1874676107677753,Har18,Harrison & Pearce (2018),harmonicity,#11A3FF,Harmonic
5.21021021021021,1.167564993564873,Har18,Harrison & Pearce (2018),harmonicity,#11A3FF,Harmonic
5.225225225225225,1.1492862767865548,Har18,Harrison & Pearce (2018),harmonicity,#11A3FF,Harmonic
5.24024024024024,1.1327739780098227,Har18,Harrison & Pearce (2018),harmonicity,#11A3FF,Harmonic
5.255255255255255,1.118008155342185,Har18,Harrison & Pearce (2018),harmonicity,#11A3FF,Harmonic
5.27027027027027,1.1048659038627477,Har18,Harrison & Pearce (2018),harmonicity,#11A3FF,Harmonic
5.285285285285285,1.0932618706192654,Har18,Harrison & Pearce (2018),harmonicity,#11A3FF,Harmonic
5.3003003003003,1.0832232143626472,Har18,Harrison & Pearce (2018),harmonicity,#11A3FF,Harmonic
5.315315315315315,1.074812682006651,Har18,Harrison & Pearce (2018),harmonicity,#11A3FF,Harmonic
5.33033033033033,1.0680080191152763,Har18,Harrison & Pearce (2018),harmonicity,#11A3FF,Harmonic
5.345345345345345,1.0626746450643545,Har18,Harrison & Pearce (2018),harmonicity,#11A3FF,Harmonic
5.36036036036036,1.0586218860963788,Har18,Harrison & Pearce (2018),harmonicity,#11A3FF,Harmonic
5.375375375375375,1.0556589672809211,Har18,Harrison & Pearce (2018),harmonicity,#11A3FF,Harmonic
5.39039039039039,1.0536176963874964,Har18,Harrison & Pearce (2018),harmonicity,#11A3FF,Harmonic
5.405405405405405,1.0523555757631071,Har18,Harrison & Pearce (2018),harmonicity,#11A3FF,Harmonic
5.42042042042042,1.0517500891772475,Har18,Harrison & Pearce (2018),harmonicity,#11A3FF,Harmonic
5.435435435435435,1.0516877755916152,Har18,Harrison & Pearce (2018),harmonicity,#11A3FF,Harmonic
5.45045045045045,1.0520586311648719,Har18,Harrison & Pearce (2018),harmonicity,#11A3FF,Harmonic
5.465465465465465,1.052764453944818,Har18,Harrison & Pearce (2018),harmonicity,#11A3FF,Harmonic
5.48048048048048,1.053734627483722,Har18,Harrison & Pearce (2018),harmonicity,#11A3FF,Harmonic
5.495495495495495,1.0549336099442137,Har18,Harrison & Pearce (2018),harmonicity,#11A3FF,Harmonic
5.51051051051051,1.0563486331891832,Har18,Harrison & Pearce (2018),harmonicity,#11A3FF,Harmonic
5.525525525525525,1.0579649234274218,Har18,Harrison & Pearce (2018),harmonicity,#11A3FF,Harmonic
5.54054054054054,1.0597569911377163,Har18,Harrison & Pearce (2018),harmonicity,#11A3FF,Harmonic
5.555555555555555,1.0617113031304448,Har18,Harrison & Pearce (2018),harmonicity,#11A3FF,Harmonic
5.57057057057057,1.063851036006672,Har18,Harrison & Pearce (2018),harmonicity,#11A3FF,Harmonic
5.585585585585585,1.0662214007800181,Har18,Harrison & Pearce (2018),harmonicity,#11A3FF,Harmonic
5.6006006006006,1.0688414800820165,Har18,Harrison & Pearce (2018),harmonicity,#11A3FF,Harmonic
5.615615615615615,1.0716761513660515,Har18,Harrison & Pearce (2018),harmonicity,#11A3FF,Harmonic
5.63063063063063,1.0746631836194802,Har18,Harrison & Pearce (2018),harmonicity,#11A3FF,Harmonic
5.645645645645645,1.0777693163223168,Har18,Harrison & Pearce (2018),harmonicity,#11A3FF,Harmonic
5.66066066066066,1.0810192067493145,Har18,Harrison & Pearce (2018),harmonicity,#11A3FF,Harmonic
5.675675675675675,1.0844642800359474,Har18,Harrison & Pearce (2018),harmonicity,#11A3FF,Harmonic
5.6906906906906904,1.0881149370465226,Har18,Harrison & Pearce (2018),harmonicity,#11A3FF,Harmonic
5.7057057057057055,1.0919057722551873,Har18,Harrison & Pearce (2018),harmonicity,#11A3FF,Harmonic
5.7207207207207205,1.0957308912093506,Har18,Harrison & Pearce (2018),harmonicity,#11A3FF,Harmonic
5.7357357357357355,1.0995039236518538,Har18,Harrison & Pearce (2018),harmonicity,#11A3FF,Harmonic
5.7507507507507505,1.103187377611447,Har18,Harrison & Pearce (2018),harmonicity,#11A3FF,Harmonic
5.7657657657657655,1.1067993419112843,Har18,Harrison & Pearce (2018),harmonicity,#11A3FF,Harmonic
5.7807807807807805,1.110418281985057,Har18,Harrison & Pearce (2018),harmonicity,#11A3FF,Harmonic
5.7957957957957955,1.1141364316819875,Har18,Harrison & Pearce (2018),harmonicity,#11A3FF,Harmonic
5.8108108108108105,1.1178977476429146,Har18,Harrison & Pearce (2018),harmonicity,#11A3FF,Harmonic
5.8258258258258255,1.1213392843020178,Har18,Harrison & Pearce (2018),harmonicity,#11A3FF,Harmonic
5.8408408408408405,1.1239304033832846,Har18,Harrison & Pearce (2018),harmonicity,#11A3FF,Harmonic
5.8558558558558556,1.1254227232169496,Har18,Harrison & Pearce (2018),harmonicity,#11A3FF,Harmonic
5.870870870870871,1.1261113652605763,Har18,Harrison & Pearce (2018),harmonicity,#11A3FF,Harmonic
5.885885885885886,1.126549861986952,Har18,Harrison & Pearce (2018),harmonicity,#11A3FF,Harmonic
5.900900900900901,1.1270716999188308,Har18,Harrison & Pearce (2018),harmonicity,#11A3FF,Harmonic
5.915915915915916,1.1276505219521893,Har18,Harrison & Pearce (2018),harmonicity,#11A3FF,Harmonic
5.930930930930931,1.1281145717234269,Har18,Harrison & Pearce (2018),harmonicity,#11A3FF,Harmonic
5.945945945945946,1.1283789914475564,Har18,Harrison & Pearce (2018),harmonicity,#11A3FF,Harmonic
5.960960960960961,1.1284948996303323,Har18,Harrison & Pearce (2018),harmonicity,#11A3FF,Harmonic
5.975975975975976,1.1285601005599915,Har18,Harrison & Pearce (2018),harmonicity,#11A3FF,Harmonic
5.990990990990991,1.12862050902471,Har18,Harrison & Pearce (2018),harmonicity,#11A3FF,Harmonic
6.006006006006006,1.128645170391067,Har18,Harrison & Pearce (2018),harmonicity,#11A3FF,Harmonic
6.021021021021021,1.128575077607409,Har18,Harrison & Pearce (2018),harmonicity,#11A3FF,Harmonic
6.036036036036036,1.1283792996290278,Har18,Harrison & Pearce (2018),harmonicity,#11A3FF,Harmonic
6.051051051051051,1.1280577959910782,Har18,Harrison & Pearce (2018),harmonicity,#11A3FF,Harmonic
6.066066066066066,1.1276064851637528,Har18,Harrison & Pearce (2018),harmonicity,#11A3FF,Harmonic
6.081081081081081,1.1270007610519688,Har18,Harrison & Pearce (2018),harmonicity,#11A3FF,Harmonic
6.096096096096096,1.1262136293971248,Har18,Harrison & Pearce (2018),harmonicity,#11A3FF,Harmonic
6.111111111111111,1.125237140300018,Har18,Harrison & Pearce (2018),harmonicity,#11A3FF,Harmonic
6.126126126126126,1.1240735406344484,Har18,Harrison & Pearce (2018),harmonicity,#11A3FF,Harmonic
6.141141141141141,1.12269952543501,Har18,Harrison & Pearce (2018),harmonicity,#11A3FF,Harmonic
6.156156156156156,1.121049138028895,Har18,Harrison & Pearce (2018),harmonicity,#11A3FF,Harmonic
6.171171171171171,1.119050077218229,Har18,Harrison & Pearce (2018),harmonicity,#11A3FF,Harmonic
6.186186186186186,1.1166806792769568,Har18,Harrison & Pearce (2018),harmonicity,#11A3FF,Harmonic
6.201201201201201,1.1139828104308636,Har18,Harrison & Pearce (2018),harmonicity,#11A3FF,Harmonic
6.216216216216216,1.111019402671359,Har18,Harrison & Pearce (2018),harmonicity,#11A3FF,Harmonic
6.231231231231231,1.1078291594607987,Har18,Harrison & Pearce (2018),harmonicity,#11A3FF,Harmonic
6.246246246246246,1.1044281656929082,Har18,Harrison & Pearce (2018),harmonicity,#11A3FF,Harmonic
6.261261261261261,1.1008525741548416,Har18,Harrison & Pearce (2018),harmonicity,#11A3FF,Harmonic
6.276276276276276,1.0971893790935503,Har18,Harrison & Pearce (2018),harmonicity,#11A3FF,Harmonic
6.291291291291291,1.0935520431605477,Har18,Harrison & Pearce (2018),harmonicity,#11A3FF,Harmonic
6.306306306306306,1.0900145579152294,Har18,Harrison & Pearce (2018),harmonicity,#11A3FF,Harmonic
6.321321321321321,1.0865668553845338,Har18,Harrison & Pearce (2018),harmonicity,#11A3FF,Harmonic
6.336336336336336,1.0831512921563495,Har18,Harrison & Pearce (2018),harmonicity,#11A3FF,Harmonic
6.351351351351351,1.0797605633660348,Har18,Harrison & Pearce (2018),harmonicity,#11A3FF,Harmonic
6.366366366366366,1.0764855195938756,Har18,Harrison & Pearce (2018),harmonicity,#11A3FF,Harmonic
6.381381381381381,1.0734435123955124,Har18,Harrison & Pearce (2018),harmonicity,#11A3FF,Harmonic
6.396396396396396,1.070672602605312,Har18,Harrison & Pearce (2018),harmonicity,#11A3FF,Harmonic
6.411411411411412,1.068119766180892,Har18,Harrison & Pearce (2018),harmonicity,#11A3FF,Harmonic
6.426426426426427,1.0657168742920227,Har18,Harrison & Pearce (2018),harmonicity,#11A3FF,Harmonic
6.441441441441442,1.0634344741376056,Har18,Harrison & Pearce (2018),harmonicity,#11A3FF,Harmonic
6.456456456456457,1.0612735012760337,Har18,Harrison & Pearce (2018),harmonicity,#11A3FF,Harmonic
6.471471471471472,1.0592537935178625,Har18,Harrison & Pearce (2018),harmonicity,#11A3FF,Harmonic
6.486486486486487,1.0574208700932703,Har18,Harrison & Pearce (2018),harmonicity,#11A3FF,Harmonic
6.501501501501502,1.0558286896197617,Har18,Harrison & Pearce (2018),harmonicity,#11A3FF,Harmonic
6.516516516516517,1.0545020649955685,Har18,Harrison & Pearce (2018),harmonicity,#11A3FF,Harmonic
6.531531531531532,1.053434101211138,Har18,Harrison & Pearce (2018),harmonicity,#11A3FF,Harmonic
6.546546546546547,1.0526293840260992,Har18,Harrison & Pearce (2018),harmonicity,#11A3FF,Harmonic
6.561561561561562,1.0521439870752747,Har18,Harrison & Pearce (2018),harmonicity,#11A3FF,Harmonic
6.576576576576577,1.052081831882654,Har18,Harrison & Pearce (2018),harmonicity,#11A3FF,Harmonic
6.591591591591592,1.052558862451472,Har18,Harrison & Pearce (2018),harmonicity,#11A3FF,Harmonic
6.606606606606607,1.0536793110897504,Har18,Harrison & Pearce (2018),harmonicity,#11A3FF,Harmonic
6.621621621621622,1.055546492564414,Har18,Harrison & Pearce (2018),harmonicity,#11A3FF,Harmonic
6.636636636636637,1.0582849473287492,Har18,Harrison & Pearce (2018),harmonicity,#11A3FF,Harmonic
6.651651651651652,1.0620438619715904,Har18,Harrison & Pearce (2018),harmonicity,#11A3FF,Harmonic
6.666666666666667,1.0669817551207748,Har18,Harrison & Pearce (2018),harmonicity,#11A3FF,Harmonic
6.681681681681682,1.0732497821515234,Har18,Harrison & Pearce (2018),harmonicity,#11A3FF,Harmonic
6.696696696696697,1.080984621034403,Har18,Harrison & Pearce (2018),harmonicity,#11A3FF,Harmonic
6.711711711711712,1.090310739520573,Har18,Harrison & Pearce (2018),harmonicity,#11A3FF,Harmonic
6.726726726726727,1.1013410209446313,Har18,Harrison & Pearce (2018),harmonicity,#11A3FF,Harmonic
6.741741741741742,1.1141607078963245,Har18,Harrison & Pearce (2018),harmonicity,#11A3FF,Harmonic
6.756756756756757,1.128797827592387,Har18,Harrison & Pearce (2018),harmonicity,#11A3FF,Harmonic
6.771771771771772,1.1452069144215178,Har18,Harrison & Pearce (2018),harmonicity,#11A3FF,Harmonic
6.786786786786787,1.1632820284688896,Har18,Harrison & Pearce (2018),harmonicity,#11A3FF,Harmonic
6.801801801801802,1.1828812075769517,Har18,Harrison & Pearce (2018),harmonicity,#11A3FF,Harmonic
6.816816816816817,1.2038361051177517,Har18,Harrison & Pearce (2018),harmonicity,#11A3FF,Harmonic
6.831831831831832,1.2259396207142956,Har18,Harrison & Pearce (2018),harmonicity,#11A3FF,Harmonic
6.846846846846847,1.24892132391347,Har18,Harrison & Pearce (2018),harmonicity,#11A3FF,Harmonic
6.861861861861862,1.2724276971475381,Har18,Harrison & Pearce (2018),harmonicity,#11A3FF,Harmonic
6.876876876876877,1.2960234793899876,Har18,Harrison & Pearce (2018),harmonicity,#11A3FF,Harmonic
6.891891891891892,1.3192198049767991,Har18,Harrison & Pearce (2018),harmonicity,#11A3FF,Harmonic
6.906906906906907,1.341518003811765,Har18,Harrison & Pearce (2018),harmonicity,#11A3FF,Harmonic
6.921921921921922,1.3624486533134625,Har18,Harrison & Pearce (2018),harmonicity,#11A3FF,Harmonic
6.936936936936937,1.3815942796612801,Har18,Harrison & Pearce (2018),harmonicity,#11A3FF,Harmonic
6.951951951951952,1.3985959051591834,Har18,Harrison & Pearce (2018),harmonicity,#11A3FF,Harmonic
6.966966966966967,1.4131460910454507,Har18,Harrison & Pearce (2018),harmonicity,#11A3FF,Harmonic
6.981981981981982,1.4249656454076574,Har18,Harrison & Pearce (2018),harmonicity,#11A3FF,Harmonic
6.996996996996997,1.433753087063317,Har18,Harrison & Pearce (2018),harmonicity,#11A3FF,Harmonic
7.012012012012012,1.4391412693049817,Har18,Harrison & Pearce (2018),harmonicity,#11A3FF,Harmonic
7.027027027027027,1.4407758917836633,Har18,Harrison & Pearce (2018),harmonicity,#11A3FF,Harmonic
7.042042042042042,1.4385329827817492,Har18,Harrison & Pearce (2018),harmonicity,#11A3FF,Harmonic
7.057057057057057,1.4326474653497956,Har18,Harrison & Pearce (2018),harmonicity,#11A3FF,Harmonic
7.072072072072072,1.4235743682851514,Har18,Harrison & Pearce (2018),harmonicity,#11A3FF,Harmonic
7.087087087087087,1.4117563451256967,Har18,Harrison & Pearce (2018),harmonicity,#11A3FF,Harmonic
7.102102102102102,1.397550270460126,Har18,Harrison & Pearce (2018),harmonicity,#11A3FF,Harmonic
7.117117117117117,1.381291541814128,Har18,Harrison & Pearce (2018),harmonicity,#11A3FF,Harmonic
7.132132132132132,1.363343419895945,Har18,Harrison & Pearce (2018),harmonicity,#11A3FF,Harmonic
7.147147147147147,1.3440973527945599,Har18,Harrison & Pearce (2018),harmonicity,#11A3FF,Harmonic
7.162162162162162,1.3239588749425966,Har18,Harrison & Pearce (2018),harmonicity,#11A3FF,Harmonic
7.177177177177177,1.303318741600654,Har18,Harrison & Pearce (2018),harmonicity,#11A3FF,Harmonic
7.192192192192192,1.2825176661021533,Har18,Harrison & Pearce (2018),harmonicity,#11A3FF,Harmonic
7.207207207207207,1.2618375711708592,Har18,Harrison & Pearce (2018),harmonicity,#11A3FF,Harmonic
7.222222222222222,1.2415208210209177,Har18,Harrison & Pearce (2018),harmonicity,#11A3FF,Harmonic
7.237237237237237,1.2217922762655713,Har18,Harrison & Pearce (2018),harmonicity,#11A3FF,Harmonic
7.252252252252252,1.2028607742992063,Har18,Harrison & Pearce (2018),harmonicity,#11A3FF,Harmonic
7.267267267267267,1.184885583609557,Har18,Harrison & Pearce (2018),harmonicity,#11A3FF,Harmonic
7.282282282282282,1.167943256609685,Har18,Harrison & Pearce (2018),harmonicity,#11A3FF,Harmonic
7.297297297297297,1.1520620030428212,Har18,Harrison & Pearce (2018),harmonicity,#11A3FF,Harmonic
7.312312312312312,1.1373024299051875,Har18,Harrison & Pearce (2018),harmonicity,#11A3FF,Harmonic
7.327327327327327,1.1237777862504148,Har18,Harrison & Pearce (2018),harmonicity,#11A3FF,Harmonic
7.342342342342342,1.1115846864786565,Har18,Harrison & Pearce (2018),harmonicity,#11A3FF,Harmonic
7.357357357357357,1.1007365404603642,Har18,Harrison & Pearce (2018),harmonicity,#11A3FF,Harmonic
7.372372372372372,1.0911759233248433,Har18,Harrison & Pearce (2018),harmonicity,#11A3FF,Harmonic
7.387387387387387,1.082838071232375,Har18,Harrison & Pearce (2018),harmonicity,#11A3FF,Harmonic
7.402402402402402,1.0756901603999387,Har18,Harrison & Pearce (2018),harmonicity,#11A3FF,Harmonic
7.4174174174174174,1.0697166676971517,Har18,Harrison & Pearce (2018),harmonicity,#11A3FF,Harmonic
7.4324324324324325,1.0648859763289014,Har18,Harrison & Pearce (2018),harmonicity,#11A3FF,Harmonic
7.4474474474474475,1.0611402409279396,Har18,Harrison & Pearce (2018),harmonicity,#11A3FF,Harmonic
7.4624624624624625,1.0584103936294398,Har18,Harrison & Pearce (2018),harmonicity,#11A3FF,Harmonic
7.4774774774774775,1.0566306892884516,Har18,Harrison & Pearce (2018),harmonicity,#11A3FF,Harmonic
7.4924924924924925,1.0557333692000417,Har18,Harrison & Pearce (2018),harmonicity,#11A3FF,Harmonic
7.5075075075075075,1.0556297073332404,Har18,Harrison & Pearce (2018),harmonicity,#11A3FF,Harmonic
7.5225225225225225,1.0562028840579945,Har18,Harrison & Pearce (2018),harmonicity,#11A3FF,Harmonic
7.5375375375375375,1.0573260801233795,Har18,Harrison & Pearce (2018),harmonicity,#11A3FF,Harmonic
7.5525525525525525,1.0588932215715536,Har18,Harrison & Pearce (2018),harmonicity,#11A3FF,Harmonic
7.5675675675675675,1.0608483119366146,Har18,Harrison & Pearce (2018),harmonicity,#11A3FF,Harmonic
7.5825825825825826,1.063213983405491,Har18,Harrison & Pearce (2018),harmonicity,#11A3FF,Harmonic
7.597597597597598,1.0661042497804456,Har18,Harrison & Pearce (2018),harmonicity,#11A3FF,Harmonic
7.612612612612613,1.0696385980053216,Har18,Harrison & Pearce (2018),harmonicity,#11A3FF,Harmonic
7.627627627627628,1.073674440137919,Har18,Harrison & Pearce (2018),harmonicity,#11A3FF,Harmonic
7.642642642642643,1.0775526710023238,Har18,Harrison & Pearce (2018),harmonicity,#11A3FF,Harmonic
7.657657657657658,1.0803336712120084,Har18,Harrison & Pearce (2018),harmonicity,#11A3FF,Harmonic
7.672672672672673,1.0815478260487428,Har18,Harrison & Pearce (2018),harmonicity,#11A3FF,Harmonic
7.687687687687688,1.081638154930792,Har18,Harrison & Pearce (2018),harmonicity,#11A3FF,Harmonic
7.702702702702703,1.0815104026363125,Har18,Harrison & Pearce (2018),harmonicity,#11A3FF,Harmonic
7.717717717717718,1.0817741852574918,Har18,Harrison & Pearce (2018),harmonicity,#11A3FF,Harmonic
7.732732732732733,1.08251322466386,Har18,Harrison & Pearce (2018),harmonicity,#11A3FF,Harmonic
7.747747747747748,1.0835709042736434,Har18,Harrison & Pearce (2018),harmonicity,#11A3FF,Harmonic
7.762762762762763,1.084848896953056,Har18,Harrison & Pearce (2018),harmonicity,#11A3FF,Harmonic
7.777777777777778,1.086387569820588,Har18,Harrison & Pearce (2018),harmonicity,#11A3FF,Harmonic
7.792792792792793,1.0883139544997242,Har18,Harrison & Pearce (2018),harmonicity,#11A3FF,Harmonic
7.807807807807808,1.0907796199894209,Har18,Harrison & Pearce (2018),harmonicity,#11A3FF,Harmonic
7.822822822822823,1.0939317132458197,Har18,Harrison & Pearce (2018),harmonicity,#11A3FF,Harmonic
7.837837837837838,1.0979071847960375,Har18,Harrison & Pearce (2018),harmonicity,#11A3FF,Harmonic
7.852852852852853,1.1028307668540906,Har18,Harrison & Pearce (2018),harmonicity,#11A3FF,Harmonic
7.867867867867868,1.1088070254823437,Har18,Harrison & Pearce (2018),harmonicity,#11A3FF,Harmonic
7.882882882882883,1.1159059334021595,Har18,Harrison & Pearce (2018),harmonicity,#11A3FF,Harmonic
7.897897897897898,1.124149399582089,Har18,Harrison & Pearce (2018),harmonicity,#11A3FF,Harmonic
7.912912912912913,1.1335111448432147,Har18,Harrison & Pearce (2018),harmonicity,#11A3FF,Harmonic
7.927927927927928,1.1439302203687585,Har18,Harrison & Pearce (2018),harmonicity,#11A3FF,Harmonic
7.942942942942943,1.1553171988176885,Har18,Harrison & Pearce (2018),harmonicity,#11A3FF,Harmonic
7.957957957957958,1.1675366271188525,Har18,Harrison & Pearce (2018),harmonicity,#11A3FF,Harmonic
7.972972972972973,1.1803817868279025,Har18,Harrison & Pearce (2018),harmonicity,#11A3FF,Harmonic
7.987987987987988,1.1935749514320857,Har18,Harrison & Pearce (2018),harmonicity,#11A3FF,Harmonic
8.003003003003004,1.2068035771035117,Har18,Harrison & Pearce (2018),harmonicity,#11A3FF,Harmonic
8.018018018018019,1.2197622775724284,Har18,Harrison & Pearce (2018),harmonicity,#11A3FF,Harmonic
8.033033033033034,1.2321586683285866,Har18,Harrison & Pearce (2018),harmonicity,#11A3FF,Harmonic
8.048048048048049,1.2436835194380573,Har18,Harrison & Pearce (2018),harmonicity,#11A3FF,Harmonic
8.063063063063064,1.2539939182734787,Har18,Harrison & Pearce (2018),harmonicity,#11A3FF,Harmonic
8.078078078078079,1.2627410851748548,Har18,Harrison & Pearce (2018),harmonicity,#11A3FF,Harmonic
8.093093093093094,1.2696162103842374,Har18,Harrison & Pearce (2018),harmonicity,#11A3FF,Harmonic
8.108108108108109,1.2743747750469487,Har18,Harrison & Pearce (2018),harmonicity,#11A3FF,Harmonic
8.123123123123124,1.2768393880750184,Har18,Harrison & Pearce (2018),harmonicity,#11A3FF,Harmonic
8.138138138138139,1.276901730428237,Har18,Harrison & Pearce (2018),harmonicity,#11A3FF,Harmonic
8.153153153153154,1.2745204700244066,Har18,Harrison & Pearce (2018),harmonicity,#11A3FF,Harmonic
8.168168168168169,1.2696980457312024,Har18,Harrison & Pearce (2018),harmonicity,#11A3FF,Harmonic
8.183183183183184,1.2624536960541752,Har18,Harrison & Pearce (2018),harmonicity,#11A3FF,Harmonic
8.198198198198199,1.2528420102069626,Har18,Harrison & Pearce (2018),harmonicity,#11A3FF,Harmonic
8.213213213213214,1.24102045075674,Har18,Harrison & Pearce (2018),harmonicity,#11A3FF,Harmonic
8.228228228228229,1.2272886048703049,Har18,Harrison & Pearce (2018),harmonicity,#11A3FF,Harmonic
8.243243243243244,1.2120344632916387,Har18,Harrison & Pearce (2018),harmonicity,#11A3FF,Harmonic
8.258258258258259,1.1956251032123226,Har18,Harrison & Pearce (2018),harmonicity,#11A3FF,Harmonic
8.273273273273274,1.1783396389553955,Har18,Harrison & Pearce (2018),harmonicity,#11A3FF,Harmonic
8.288288288288289,1.1604074884353435,Har18,Harrison & Pearce (2018),harmonicity,#11A3FF,Harmonic
8.303303303303304,1.1421146437284717,Har18,Harrison & Pearce (2018),harmonicity,#11A3FF,Harmonic
8.318318318318319,1.123855782615935,Har18,Harrison & Pearce (2018),harmonicity,#11A3FF,Harmonic
8.333333333333334,1.1060678312097076,Har18,Harrison & Pearce (2018),harmonicity,#11A3FF,Harmonic
8.348348348348349,1.0891304755687408,Har18,Harrison & Pearce (2018),harmonicity,#11A3FF,Harmonic
8.363363363363364,1.0733378516084453,Har18,Harrison & Pearce (2018),harmonicity,#11A3FF,Harmonic
8.378378378378379,1.058920473096984,Har18,Harrison & Pearce (2018),harmonicity,#11A3FF,Harmonic
8.393393393393394,1.046036646798478,Har18,Harrison & Pearce (2018),harmonicity,#11A3FF,Harmonic
8.408408408408409,1.034736091691396,Har18,Harrison & Pearce (2018),harmonicity,#11A3FF,Harmonic
8.423423423423424,1.024983829023383,Har18,Harrison & Pearce (2018),harmonicity,#11A3FF,Harmonic
8.438438438438439,1.016767552620564,Har18,Harrison & Pearce (2018),harmonicity,#11A3FF,Harmonic
8.453453453453454,1.0101738516275967,Har18,Harrison & Pearce (2018),harmonicity,#11A3FF,Harmonic
8.468468468468469,1.0053400359242903,Har18,Harrison & Pearce (2018),harmonicity,#11A3FF,Harmonic
8.483483483483484,1.00235308144667,Har18,Harrison & Pearce (2018),harmonicity,#11A3FF,Harmonic
8.498498498498499,1.0012184667615314,Har18,Harrison & Pearce (2018),harmonicity,#11A3FF,Harmonic
8.513513513513514,1.0019090492412395,Har18,Harrison & Pearce (2018),harmonicity,#11A3FF,Harmonic
8.528528528528529,1.0044083688758891,Har18,Harrison & Pearce (2018),harmonicity,#11A3FF,Harmonic
8.543543543543544,1.008686442065141,Har18,Harrison & Pearce (2018),harmonicity,#11A3FF,Harmonic
8.558558558558559,1.0146427658868054,Har18,Harrison & Pearce (2018),harmonicity,#11A3FF,Harmonic
8.573573573573574,1.0221041723288131,Har18,Harrison & Pearce (2018),harmonicity,#11A3FF,Harmonic
8.588588588588589,1.0309009040901276,Har18,Harrison & Pearce (2018),harmonicity,#11A3FF,Harmonic
8.603603603603604,1.0409384341757395,Har18,Harrison & Pearce (2018),harmonicity,#11A3FF,Harmonic
8.618618618618619,1.0521728439646718,Har18,Harrison & Pearce (2018),harmonicity,#11A3FF,Harmonic
8.633633633633634,1.0645079541357092,Har18,Harrison & Pearce (2018),harmonicity,#11A3FF,Harmonic
8.64864864864865,1.0777321125637067,Har18,Harrison & Pearce (2018),harmonicity,#11A3FF,Harmonic
8.663663663663664,1.0915616866084357,Har18,Harrison & Pearce (2018),harmonicity,#11A3FF,Harmonic
8.67867867867868,1.1057237919623137,Har18,Harrison & Pearce (2018),harmonicity,#11A3FF,Harmonic
8.693693693693694,1.1199851489755153,Har18,Harrison & Pearce (2018),harmonicity,#11A3FF,Harmonic
8.70870870870871,1.1341229956546126,Har18,Harrison & Pearce (2018),harmonicity,#11A3FF,Harmonic
8.723723723723724,1.147891304141881,Har18,Harrison & Pearce (2018),harmonicity,#11A3FF,Harmonic
8.73873873873874,1.1610215646303186,Har18,Harrison & Pearce (2018),harmonicity,#11A3FF,Harmonic
8.753753753753754,1.1732622352796875,Har18,Harrison & Pearce (2018),harmonicity,#11A3FF,Harmonic
8.76876876876877,1.184421426186845,Har18,Harrison & Pearce (2018),harmonicity,#11A3FF,Harmonic
8.783783783783784,1.1943583117116097,Har18,Harrison & Pearce (2018),harmonicity,#11A3FF,Harmonic
8.7987987987988,1.2029221118679483,Har18,Harrison & Pearce (2018),harmonicity,#11A3FF,Harmonic
8.813813813813814,1.2099171338982406,Har18,Harrison & Pearce (2018),harmonicity,#11A3FF,Harmonic
8.82882882882883,1.2151483637956866,Har18,Harrison & Pearce (2018),harmonicity,#11A3FF,Harmonic
8.843843843843844,1.2184962243823292,Har18,Harrison & Pearce (2018),harmonicity,#11A3FF,Harmonic
8.85885885885886,1.219944062342259,Har18,Harrison & Pearce (2018),harmonicity,#11A3FF,Harmonic
8.873873873873874,1.2195545858313643,Har18,Harrison & Pearce (2018),harmonicity,#11A3FF,Harmonic
8.88888888888889,1.217437298594947,Har18,Harrison & Pearce (2018),harmonicity,#11A3FF,Harmonic
8.903903903903904,1.2137290720284288,Har18,Harrison & Pearce (2018),harmonicity,#11A3FF,Harmonic
8.91891891891892,1.2085809996155052,Har18,Harrison & Pearce (2018),harmonicity,#11A3FF,Harmonic
8.933933933933934,1.202149057698848,Har18,Harrison & Pearce (2018),harmonicity,#11A3FF,Harmonic
8.94894894894895,1.1946089496024281,Har18,Harrison & Pearce (2018),harmonicity,#11A3FF,Harmonic
8.963963963963964,1.1862006586535074,Har18,Harrison & Pearce (2018),harmonicity,#11A3FF,Harmonic
8.97897897897898,1.177254053688549,Har18,Harrison & Pearce (2018),harmonicity,#11A3FF,Harmonic
8.993993993993994,1.1681361641496093,Har18,Harrison & Pearce (2018),harmonicity,#11A3FF,Harmonic
9.00900900900901,1.1591294323646482,Har18,Harrison & Pearce (2018),harmonicity,#11A3FF,Harmonic
9.024024024024024,1.1503421350505532,Har18,Harrison & Pearce (2018),harmonicity,#11A3FF,Harmonic
9.03903903903904,1.1417670105911015,Har18,Harrison & Pearce (2018),harmonicity,#11A3FF,Harmonic
9.054054054054054,1.1334511723947134,Har18,Harrison & Pearce (2018),harmonicity,#11A3FF,Harmonic
9.06906906906907,1.1255742034361331,Har18,Harrison & Pearce (2018),harmonicity,#11A3FF,Harmonic
9.084084084084084,1.118356686313545,Har18,Harrison & Pearce (2018),harmonicity,#11A3FF,Harmonic
9.0990990990991,1.1119651204040488,Har18,Harrison & Pearce (2018),harmonicity,#11A3FF,Harmonic
9.114114114114114,1.1065167795254198,Har18,Harrison & Pearce (2018),harmonicity,#11A3FF,Harmonic
9.12912912912913,1.1020938343477127,Har18,Harrison & Pearce (2018),harmonicity,#11A3FF,Harmonic
9.144144144144144,1.0987159370030803,Har18,Harrison & Pearce (2018),harmonicity,#11A3FF,Harmonic
9.15915915915916,1.096327773867428,Har18,Harrison & Pearce (2018),harmonicity,#11A3FF,Harmonic
9.174174174174174,1.0948181223969535,Har18,Harrison & Pearce (2018),harmonicity,#11A3FF,Harmonic
9.18918918918919,1.0940392901135727,Har18,Harrison & Pearce (2018),harmonicity,#11A3FF,Harmonic
9.204204204204204,1.093829813692691,Har18,Harrison & Pearce (2018),harmonicity,#11A3FF,Harmonic
9.21921921921922,1.0940505940041423,Har18,Harrison & Pearce (2018),harmonicity,#11A3FF,Harmonic
9.234234234234235,1.0946050559427065,Har18,Harrison & Pearce (2018),harmonicity,#11A3FF,Harmonic
9.24924924924925,1.0954233019926354,Har18,Harrison & Pearce (2018),harmonicity,#11A3FF,Harmonic
9.264264264264265,1.0964358622698354,Har18,Harrison & Pearce (2018),harmonicity,#11A3FF,Harmonic
9.27927927927928,1.097562358222891,Har18,Harrison & Pearce (2018),harmonicity,#11A3FF,Harmonic
9.294294294294295,1.0987194007697787,Har18,Harrison & Pearce (2018),harmonicity,#11A3FF,Harmonic
9.30930930930931,1.0998454588310453,Har18,Harrison & Pearce (2018),harmonicity,#11A3FF,Harmonic
9.324324324324325,1.1009218223103392,Har18,Harrison & Pearce (2018),harmonicity,#11A3FF,Harmonic
9.33933933933934,1.1019661726196432,Har18,Harrison & Pearce (2018),harmonicity,#11A3FF,Harmonic
9.354354354354355,1.1030105815572024,Har18,Harrison & Pearce (2018),harmonicity,#11A3FF,Harmonic
9.36936936936937,1.1040884270773792,Har18,Harrison & Pearce (2018),harmonicity,#11A3FF,Harmonic
9.384384384384385,1.1052317417866475,Har18,Harrison & Pearce (2018),harmonicity,#11A3FF,Harmonic
9.3993993993994,1.1064722917557168,Har18,Harrison & Pearce (2018),harmonicity,#11A3FF,Harmonic
9.414414414414415,1.1078460408002848,Har18,Harrison & Pearce (2018),harmonicity,#11A3FF,Harmonic
9.42942942942943,1.1093963846228203,Har18,Harrison & Pearce (2018),harmonicity,#11A3FF,Harmonic
9.444444444444445,1.1111693082960468,Har18,Harrison & Pearce (2018),harmonicity,#11A3FF,Harmonic
9.45945945945946,1.1132045699320572,Har18,Harrison & Pearce (2018),harmonicity,#11A3FF,Harmonic
9.474474474474475,1.1155349226532256,Har18,Harrison & Pearce (2018),harmonicity,#11A3FF,Harmonic
9.48948948948949,1.1181985077940846,Har18,Harrison & Pearce (2018),harmonicity,#11A3FF,Harmonic
9.504504504504505,1.121254215279801,Har18,Harrison & Pearce (2018),harmonicity,#11A3FF,Harmonic
9.51951951951952,1.1247783021057354,Har18,Harrison & Pearce (2018),harmonicity,#11A3FF,Harmonic
9.534534534534535,1.1288282790145607,Har18,Harrison & Pearce (2018),harmonicity,#11A3FF,Harmonic
9.54954954954955,1.1333971849590614,Har18,Harrison & Pearce (2018),harmonicity,#11A3FF,Harmonic
9.564564564564565,1.1384093459984075,Har18,Harrison & Pearce (2018),harmonicity,#11A3FF,Harmonic
9.57957957957958,1.1437695006278954,Har18,Harrison & Pearce (2018),harmonicity,#11A3FF,Harmonic
9.594594594594595,1.1494177109575214,Har18,Harrison & Pearce (2018),harmonicity,#11A3FF,Harmonic
9.60960960960961,1.1553401392689442,Har18,Harrison & Pearce (2018),harmonicity,#11A3FF,Harmonic
9.624624624624625,1.1615064296134834,Har18,Harrison & Pearce (2018),harmonicity,#11A3FF,Harmonic
9.63963963963964,1.1677617057043386,Har18,Harrison & Pearce (2018),harmonicity,#11A3FF,Harmonic
9.654654654654655,1.173834575631485,Har18,Harrison & Pearce (2018),harmonicity,#11A3FF,Harmonic
9.66966966966967,1.1796030767094696,Har18,Harrison & Pearce (2018),harmonicity,#11A3FF,Harmonic
9.684684684684685,1.1853963650499386,Har18,Harrison & Pearce (2018),harmonicity,#11A3FF,Harmonic
9.6996996996997,1.1918481130129082,Har18,Harrison & Pearce (2018),harmonicity,#11A3FF,Harmonic
9.714714714714715,1.1992827136010251,Har18,Harrison & Pearce (2018),harmonicity,#11A3FF,Harmonic
9.72972972972973,1.2073367286837893,Har18,Harrison & Pearce (2018),harmonicity,#11A3FF,Harmonic
9.744744744744745,1.2152929031095123,Har18,Harrison & Pearce (2018),harmonicity,#11A3FF,Harmonic
9.75975975975976,1.222660817488785,Har18,Harrison & Pearce (2018),harmonicity,#11A3FF,Harmonic
9.774774774774775,1.229350947125496,Har18,Harrison & Pearce (2018),harmonicity,#11A3FF,Harmonic
9.78978978978979,1.235470211352335,Har18,Harrison & Pearce (2018),harmonicity,#11A3FF,Harmonic
9.804804804804805,1.2411360472504913,Har18,Harrison & Pearce (2018),harmonicity,#11A3FF,Harmonic
9.81981981981982,1.2464487318751052,Har18,Harrison & Pearce (2018),harmonicity,#11A3FF,Harmonic
9.834834834834835,1.2514948136849946,Har18,Harrison & Pearce (2018),harmonicity,#11A3FF,Harmonic
9.84984984984985,1.2562990242632925,Har18,Harrison & Pearce (2018),harmonicity,#11A3FF,Harmonic
9.864864864864865,1.2607928448081667,Har18,Harrison & Pearce (2018),harmonicity,#11A3FF,Harmonic
9.87987987987988,1.2648660934390796,Har18,Harrison & Pearce (2018),harmonicity,#11A3FF,Harmonic
9.894894894894895,1.2684458729316068,Har18,Harrison & Pearce (2018),harmonicity,#11A3FF,Harmonic
9.90990990990991,1.2715121758069765,Har18,Harrison & Pearce (2018),harmonicity,#11A3FF,Harmonic
9.924924924924925,1.2740443054586479,Har18,Harrison & Pearce (2018),harmonicity,#11A3FF,Harmonic
9.93993993993994,1.275967611139645,Har18,Harrison & Pearce (2018),harmonicity,#11A3FF,Harmonic
9.954954954954955,1.277167501196271,Har18,Harrison & Pearce (2018),harmonicity,#11A3FF,Harmonic
9.96996996996997,1.2775633703348381,Har18,Harrison & Pearce (2018),harmonicity,#11A3FF,Harmonic
9.984984984984985,1.2771585506919403,Har18,Harrison & Pearce (2018),harmonicity,#11A3FF,Harmonic
10,1.276009545122818,Har18,Harrison & Pearce (2018),harmonicity,#11A3FF,Harmonic
10.015015015015015,1.2741534809933115,Har18,Harrison & Pearce (2018),harmonicity,#11A3FF,Harmonic
10.03003003003003,1.2715679478055901,Har18,Harrison & Pearce (2018),harmonicity,#11A3FF,Harmonic
10.045045045045045,1.26820043907366,Har18,Harrison & Pearce (2018),harmonicity,#11A3FF,Harmonic
10.06006006006006,1.2640381406287302,Har18,Harrison & Pearce (2018),harmonicity,#11A3FF,Harmonic
10.075075075075075,1.2591363419531316,Har18,Harrison & Pearce (2018),harmonicity,#11A3FF,Harmonic
10.09009009009009,1.2535693712282217,Har18,Harrison & Pearce (2018),harmonicity,#11A3FF,Harmonic
10.105105105105105,1.247374412799525,Har18,Harrison & Pearce (2018),harmonicity,#11A3FF,Harmonic
10.12012012012012,1.240568973126963,Har18,Harrison & Pearce (2018),harmonicity,#11A3FF,Harmonic
10.135135135135135,1.2332202505735539,Har18,Harrison & Pearce (2018),harmonicity,#11A3FF,Harmonic
10.15015015015015,1.2254685767422133,Har18,Harrison & Pearce (2018),harmonicity,#11A3FF,Harmonic
10.165165165165165,1.2174576028840756,Har18,Harrison & Pearce (2018),harmonicity,#11A3FF,Harmonic
10.18018018018018,1.2092484054490242,Har18,Harrison & Pearce (2018),harmonicity,#11A3FF,Harmonic
10.195195195195195,1.200827832272971,Har18,Harrison & Pearce (2018),harmonicity,#11A3FF,Harmonic
10.21021021021021,1.1921985930958754,Har18,Harrison & Pearce (2018),harmonicity,#11A3FF,Harmonic
10.225225225225225,1.1834279824075011,Har18,Harrison & Pearce (2018),harmonicity,#11A3FF,Harmonic
10.24024024024024,1.1746017876614818,Har18,Harrison & Pearce (2018),harmonicity,#11A3FF,Harmonic
10.255255255255255,1.1657711493908776,Har18,Harrison & Pearce (2018),harmonicity,#11A3FF,Harmonic
10.27027027027027,1.1569706630157486,Har18,Harrison & Pearce (2018),harmonicity,#11A3FF,Harmonic
10.285285285285285,1.1482591401426618,Har18,Harrison & Pearce (2018),harmonicity,#11A3FF,Harmonic
10.3003003003003,1.13971141799498,Har18,Harrison & Pearce (2018),harmonicity,#11A3FF,Harmonic
10.315315315315315,1.1313854055762034,Har18,Harrison & Pearce (2018),harmonicity,#11A3FF,Harmonic
10.33033033033033,1.1233186952496148,Har18,Harrison & Pearce (2018),harmonicity,#11A3FF,Harmonic
10.345345345345345,1.1155445028050441,Har18,Harrison & Pearce (2018),harmonicity,#11A3FF,Harmonic
10.36036036036036,1.1080924887535732,Har18,Harrison & Pearce (2018),harmonicity,#11A3FF,Harmonic
10.375375375375375,1.1009771769175103,Har18,Harrison & Pearce (2018),harmonicity,#11A3FF,Harmonic
10.39039039039039,1.094184844630919,Har18,Harrison & Pearce (2018),harmonicity,#11A3FF,Harmonic
10.405405405405405,1.0876575007127682,Har18,Harrison & Pearce (2018),harmonicity,#11A3FF,Harmonic
10.42042042042042,1.0813027931976846,Har18,Harrison & Pearce (2018),harmonicity,#11A3FF,Harmonic
10.435435435435435,1.0750635686226524,Har18,Harrison & Pearce (2018),harmonicity,#11A3FF,Harmonic
10.45045045045045,1.068993909277337,Har18,Harrison & Pearce (2018),harmonicity,#11A3FF,Harmonic
10.465465465465465,1.063245117617853,Har18,Harrison & Pearce (2018),harmonicity,#11A3FF,Harmonic
10.48048048048048,1.0579702008333882,Har18,Harrison & Pearce (2018),harmonicity,#11A3FF,Harmonic
10.495495495495495,1.0532551480201067,Har18,Harrison & Pearce (2018),harmonicity,#11A3FF,Harmonic
10.51051051051051,1.0491366220363023,Har18,Harrison & Pearce (2018),harmonicity,#11A3FF,Harmonic
10.525525525525525,1.0456610229756673,Har18,Harrison & Pearce (2018),harmonicity,#11A3FF,Harmonic
10.54054054054054,1.0429123395697428,Har18,Harrison & Pearce (2018),harmonicity,#11A3FF,Harmonic
10.555555555555555,1.0409875095569106,Har18,Harrison & Pearce (2018),harmonicity,#11A3FF,Harmonic
10.57057057057057,1.0399540730032832,Har18,Harrison & Pearce (2018),harmonicity,#11A3FF,Harmonic
10.585585585585585,1.039832599804629,Har18,Harrison & Pearce (2018),harmonicity,#11A3FF,Harmonic
10.6006006006006,1.0406157490600767,Har18,Harrison & Pearce (2018),harmonicity,#11A3FF,Harmonic
10.615615615615615,1.042301891824099,Har18,Harrison & Pearce (2018),harmonicity,#11A3FF,Harmonic
10.63063063063063,1.044906460054097,Har18,Harrison & Pearce (2018),harmonicity,#11A3FF,Harmonic
10.645645645645645,1.0484378986819023,Har18,Harrison & Pearce (2018),harmonicity,#11A3FF,Harmonic
10.66066066066066,1.052866880661471,Har18,Harrison & Pearce (2018),harmonicity,#11A3FF,Harmonic
10.675675675675675,1.0581188364430787,Har18,Harrison & Pearce (2018),harmonicity,#11A3FF,Harmonic
10.69069069069069,1.0640838963569383,Har18,Harrison & Pearce (2018),harmonicity,#11A3FF,Harmonic
10.705705705705705,1.07062431556271,Har18,Harrison & Pearce (2018),harmonicity,#11A3FF,Harmonic
10.72072072072072,1.0775766479702953,Har18,Harrison & Pearce (2018),harmonicity,#11A3FF,Harmonic
10.735735735735735,1.084756087867418,Har18,Harrison & Pearce (2018),harmonicity,#11A3FF,Harmonic
10.75075075075075,1.0919632826069423,Har18,Harrison & Pearce (2018),harmonicity,#11A3FF,Harmonic
10.765765765765765,1.0989893896364125,Har18,Harrison & Pearce (2018),harmonicity,#11A3FF,Harmonic
10.78078078078078,1.1056195554939623,Har18,Harrison & Pearce (2018),harmonicity,#11A3FF,Harmonic
10.795795795795796,1.111639681538021,Har18,Harrison & Pearce (2018),harmonicity,#11A3FF,Harmonic
10.81081081081081,1.1168516681122274,Har18,Harrison & Pearce (2018),harmonicity,#11A3FF,Harmonic
10.825825825825826,1.1210943944538032,Har18,Harrison & Pearce (2018),harmonicity,#11A3FF,Harmonic
10.84084084084084,1.1242533679705746,Har18,Harrison & Pearce (2018),harmonicity,#11A3FF,Harmonic
10.855855855855856,1.1262450519618812,Har18,Harrison & Pearce (2018),harmonicity,#11A3FF,Harmonic
10.87087087087087,1.1269940322535485,Har18,Harrison & Pearce (2018),harmonicity,#11A3FF,Harmonic
10.885885885885886,1.1264402046120336,Har18,Harrison & Pearce (2018),harmonicity,#11A3FF,Harmonic
10.9009009009009,1.124580570951121,Har18,Harrison & Pearce (2018),harmonicity,#11A3FF,Harmonic
10.915915915915916,1.1215035178934671,Har18,Harrison & Pearce (2018),harmonicity,#11A3FF,Harmonic
10.93093093093093,1.1173744424807803,Har18,Harrison & Pearce (2018),harmonicity,#11A3FF,Harmonic
10.945945945945946,1.1123832289154336,Har18,Harrison & Pearce (2018),harmonicity,#11A3FF,Harmonic
10.96096096096096,1.106706793173348,Har18,Harrison & Pearce (2018),harmonicity,#11A3FF,Harmonic
10.975975975975976,1.1005164316329072,Har18,Harrison & Pearce (2018),harmonicity,#11A3FF,Harmonic
10.99099099099099,1.0940009896485563,Har18,Harrison & Pearce (2018),harmonicity,#11A3FF,Harmonic
11.006006006006006,1.0873665849136365,Har18,Harrison & Pearce (2018),harmonicity,#11A3FF,Harmonic
11.02102102102102,1.080813217030324,Har18,Harrison & Pearce (2018),harmonicity,#11A3FF,Harmonic
11.036036036036036,1.0745122593782601,Har18,Harrison & Pearce (2018),harmonicity,#11A3FF,Harmonic
11.05105105105105,1.0686013346583227,Har18,Harrison & Pearce (2018),harmonicity,#11A3FF,Harmonic
11.066066066066066,1.06319942940109,Har18,Harrison & Pearce (2018),harmonicity,#11A3FF,Harmonic
11.08108108108108,1.058426296452333,Har18,Harrison & Pearce (2018),harmonicity,#11A3FF,Harmonic
11.096096096096096,1.0543932936222316,Har18,Harrison & Pearce (2018),harmonicity,#11A3FF,Harmonic
11.11111111111111,1.0511581206504015,Har18,Harrison & Pearce (2018),harmonicity,#11A3FF,Harmonic
11.126126126126126,1.0486915097965743,Har18,Harrison & Pearce (2018),harmonicity,#11A3FF,Harmonic
11.14114114114114,1.04690149471026,Har18,Harrison & Pearce (2018),harmonicity,#11A3FF,Harmonic
11.156156156156156,1.0456902660991783,Har18,Harrison & Pearce (2018),harmonicity,#11A3FF,Harmonic
11.17117117117117,1.0449851607319107,Har18,Harrison & Pearce (2018),harmonicity,#11A3FF,Harmonic
11.186186186186186,1.0447271301149765,Har18,Harrison & Pearce (2018),harmonicity,#11A3FF,Harmonic
11.2012012012012,1.0448448600657907,Har18,Harrison & Pearce (2018),harmonicity,#11A3FF,Harmonic
11.216216216216216,1.0452439134401181,Har18,Harrison & Pearce (2018),harmonicity,#11A3FF,Harmonic
11.23123123123123,1.045815367907666,Har18,Harrison & Pearce (2018),harmonicity,#11A3FF,Harmonic
11.246246246246246,1.046450396176898,Har18,Harrison & Pearce (2018),harmonicity,#11A3FF,Harmonic
11.26126126126126,1.047051952745643,Har18,Harrison & Pearce (2018),harmonicity,#11A3FF,Harmonic
11.276276276276276,1.047544572180194,Har18,Harrison & Pearce (2018),harmonicity,#11A3FF,Harmonic
11.29129129129129,1.0478791898617383,Har18,Harrison & Pearce (2018),harmonicity,#11A3FF,Harmonic
11.306306306306306,1.0480264008157625,Har18,Harrison & Pearce (2018),harmonicity,#11A3FF,Harmonic
11.32132132132132,1.0479617768491303,Har18,Harrison & Pearce (2018),harmonicity,#11A3FF,Harmonic
11.336336336336336,1.0476573450154825,Har18,Harrison & Pearce (2018),harmonicity,#11A3FF,Harmonic
11.35135135135135,1.047090880463875,Har18,Harrison & Pearce (2018),harmonicity,#11A3FF,Harmonic
11.366366366366366,1.0462675127843344,Har18,Harrison & Pearce (2018),harmonicity,#11A3FF,Harmonic
11.381381381381381,1.0452307366503972,Har18,Harrison & Pearce (2018),harmonicity,#11A3FF,Harmonic
11.396396396396396,1.0440497910637498,Har18,Harrison & Pearce (2018),harmonicity,#11A3FF,Harmonic
11.411411411411411,1.0427992438590057,Har18,Harrison & Pearce (2018),harmonicity,#11A3FF,Harmonic
11.426426426426426,1.0415516758904826,Har18,Harrison & Pearce (2018),harmonicity,#11A3FF,Harmonic
11.441441441441441,1.0403829728145986,Har18,Harrison & Pearce (2018),harmonicity,#11A3FF,Harmonic
11.456456456456456,1.0393779891927954,Har18,Harrison & Pearce (2018),harmonicity,#11A3FF,Harmonic
11.471471471471471,1.0386312887768592,Har18,Harrison & Pearce (2018),harmonicity,#11A3FF,Harmonic
11.486486486486486,1.0382452404185043,Har18,Harrison & Pearce (2018),harmonicity,#11A3FF,Harmonic
11.501501501501501,1.0383283857181385,Har18,Harrison & Pearce (2018),harmonicity,#11A3FF,Harmonic
11.516516516516516,1.0389952389409933,Har18,Harrison & Pearce (2018),harmonicity,#11A3FF,Harmonic
11.531531531531531,1.0403673214500413,Har18,Harrison & Pearce (2018),harmonicity,#11A3FF,Harmonic
11.546546546546546,1.0425747994399923,Har18,Harrison & Pearce (2018),harmonicity,#11A3FF,Harmonic
11.561561561561561,1.045758940103243,Har18,Harrison & Pearce (2018),harmonicity,#11A3FF,Harmonic
11.576576576576576,1.0500749978781792,Har18,Harrison & Pearce (2018),harmonicity,#11A3FF,Harmonic
11.591591591591591,1.0556916283437636,Har18,Harrison & Pearce (2018),harmonicity,#11A3FF,Harmonic
11.606606606606606,1.062783434767823,Har18,Harrison & Pearce (2018),harmonicity,#11A3FF,Harmonic
11.621621621621621,1.071521741541828,Har18,Harrison & Pearce (2018),harmonicity,#11A3FF,Harmonic
11.636636636636636,1.0820731186078425,Har18,Harrison & Pearce (2018),harmonicity,#11A3FF,Harmonic
11.651651651651651,1.0946058532622582,Har18,Harrison & Pearce (2018),harmonicity,#11A3FF,Harmonic
11.666666666666666,1.109293166127705,Har18,Harrison & Pearce (2018),harmonicity,#11A3FF,Harmonic
11.681681681681681,1.1263038475320868,Har18,Harrison & Pearce (2018),harmonicity,#11A3FF,Harmonic
11.696696696696696,1.1457841137423062,Har18,Harrison & Pearce (2018),harmonicity,#11A3FF,Harmonic
11.711711711711711,1.1678436622646249,Har18,Harrison & Pearce (2018),harmonicity,#11A3FF,Harmonic
11.726726726726726,1.1925518897100693,Har18,Harrison & Pearce (2018),harmonicity,#11A3FF,Harmonic
11.741741741741741,1.2199346295094093,Har18,Harrison & Pearce (2018),harmonicity,#11A3FF,Harmonic
11.756756756756756,1.249959041331087,Har18,Harrison & Pearce (2018),harmonicity,#11A3FF,Harmonic
11.771771771771771,1.282509790466464,Har18,Harrison & Pearce (2018),harmonicity,#11A3FF,Harmonic
11.786786786786786,1.3173744139825303,Har18,Harrison & Pearce (2018),harmonicity,#11A3FF,Harmonic
11.801801801801801,1.35425146235456,Har18,Harrison & Pearce (2018),harmonicity,#11A3FF,Harmonic
11.816816816816816,1.392776006300193,Har18,Harrison & Pearce (2018),harmonicity,#11A3FF,Harmonic
11.831831831831831,1.432537957130467,Har18,Harrison & Pearce (2018),harmonicity,#11A3FF,Harmonic
11.846846846846846,1.4730598457137545,Har18,Harrison & Pearce (2018),harmonicity,#11A3FF,Harmonic
11.861861861861861,1.5137272135153028,Har18,Harrison & Pearce (2018),harmonicity,#11A3FF,Harmonic
11.876876876876876,1.5537318086869514,Har18,Harrison & Pearce (2018),harmonicity,#11A3FF,Harmonic
11.891891891891891,1.5921136922305756,Har18,Harrison & Pearce (2018),harmonicity,#11A3FF,Harmonic
11.906906906906906,1.6279101801297227,Har18,Harrison & Pearce (2018),harmonicity,#11A3FF,Harmonic
11.921921921921921,1.6603500512316502,Har18,Harrison & Pearce (2018),harmonicity,#11A3FF,Harmonic
11.936936936936936,1.6890748529996615,Har18,Harrison & Pearce (2018),harmonicity,#11A3FF,Harmonic
11.951951951951951,1.7143038394479402,Har18,Harrison & Pearce (2018),harmonicity,#11A3FF,Harmonic
11.966966966966966,1.7364804671517398,Har18,Harrison & Pearce (2018),harmonicity,#11A3FF,Harmonic
11.981981981981981,1.7549511341525608,Har18,Harrison & Pearce (2018),harmonicity,#11A3FF,Harmonic
11.996996996996996,1.7666766748349012,Har18,Harrison & Pearce (2018),harmonicity,#11A3FF,Harmonic
12.012012012012011,1.7673365999480606,Har18,Harrison & Pearce (2018),harmonicity,#11A3FF,Harmonic
12.027027027027026,1.7549178856671372,Har18,Harrison & Pearce (2018),harmonicity,#11A3FF,Harmonic
12.042042042042041,1.7318259346471117,Har18,Harrison & Pearce (2018),harmonicity,#11A3FF,Harmonic
12.057057057057056,1.7027391389310569,Har18,Harrison & Pearce (2018),harmonicity,#11A3FF,Harmonic
12.072072072072071,1.670994425791694,Har18,Harrison & Pearce (2018),harmonicity,#11A3FF,Harmonic
12.087087087087086,1.637477733514308,Har18,Harrison & Pearce (2018),harmonicity,#11A3FF,Harmonic
12.102102102102101,1.6019338957319882,Har18,Harrison & Pearce (2018),harmonicity,#11A3FF,Harmonic
12.117117117117116,1.5643105702984386,Har18,Harrison & Pearce (2018),harmonicity,#11A3FF,Harmonic
12.132132132132131,1.5250829373356531,Har18,Harrison & Pearce (2018),harmonicity,#11A3FF,Harmonic
12.147147147147146,1.4850018197048533,Har18,Harrison & Pearce (2018),harmonicity,#11A3FF,Harmonic
12.162162162162161,1.4448144068610163,Har18,Harrison & Pearce (2018),harmonicity,#11A3FF,Harmonic
12.177177177177176,1.4051351505866052,Har18,Harrison & Pearce (2018),harmonicity,#11A3FF,Harmonic
12.192192192192191,1.366454528797143,Har18,Harrison & Pearce (2018),harmonicity,#11A3FF,Harmonic
12.207207207207206,1.3292005365839006,Har18,Harrison & Pearce (2018),harmonicity,#11A3FF,Harmonic
12.222222222222221,1.29375438226022,Har18,Harrison & Pearce (2018),harmonicity,#11A3FF,Harmonic
12.237237237237236,1.2604240533296251,Har18,Harrison & Pearce (2018),harmonicity,#11A3FF,Harmonic
12.252252252252251,1.2294505845451427,Har18,Harrison & Pearce (2018),harmonicity,#11A3FF,Harmonic
12.267267267267266,1.2010325280917578,Har18,Harrison & Pearce (2018),harmonicity,#11A3FF,Harmonic
12.282282282282281,1.175303869963832,Har18,Harrison & Pearce (2018),harmonicity,#11A3FF,Harmonic
12.297297297297296,1.1522961034593788,Har18,Harrison & Pearce (2018),harmonicity,#11A3FF,Harmonic
12.312312312312311,1.1319484221456955,Har18,Harrison & Pearce (2018),harmonicity,#11A3FF,Harmonic
12.327327327327327,1.1141490242173544,Har18,Harrison & Pearce (2018),harmonicity,#11A3FF,Harmonic
12.342342342342342,1.0987605670945981,Har18,Harrison & Pearce (2018),harmonicity,#11A3FF,Harmonic
12.357357357357357,1.0856240640453623,Har18,Harrison & Pearce (2018),harmonicity,#11A3FF,Harmonic
12.372372372372372,1.074557554997924,Har18,Harrison & Pearce (2018),harmonicity,#11A3FF,Harmonic
12.387387387387387,1.0653604995566843,Har18,Harrison & Pearce (2018),harmonicity,#11A3FF,Harmonic
12.402402402402402,1.057829324424137,Har18,Harrison & Pearce (2018),harmonicity,#11A3FF,Harmonic
12.417417417417417,1.0517778939852225,Har18,Harrison & Pearce (2018),harmonicity,#11A3FF,Harmonic
12.432432432432432,1.0470443595125376,Har18,Harrison & Pearce (2018),harmonicity,#11A3FF,Harmonic
12.447447447447447,1.0434801526692827,Har18,Harrison & Pearce (2018),harmonicity,#11A3FF,Harmonic
12.462462462462462,1.0409406357709106,Har18,Harrison & Pearce (2018),harmonicity,#11A3FF,Harmonic
12.477477477477477,1.039287528062489,Har18,Harrison & Pearce (2018),harmonicity,#11A3FF,Harmonic
12.492492492492492,1.038391119423535,Har18,Harrison & Pearce (2018),harmonicity,#11A3FF,Harmonic
12.507507507507507,1.0381265363753163,Har18,Harrison & Pearce (2018),harmonicity,#11A3FF,Harmonic
12.522522522522522,1.0383725717713468,Har18,Harrison & Pearce (2018),harmonicity,#11A3FF,Harmonic
12.537537537537537,1.0390153455701114,Har18,Harrison & Pearce (2018),harmonicity,#11A3FF,Harmonic
12.552552552552552,1.0399498682340818,Har18,Harrison & Pearce (2018),harmonicity,#11A3FF,Harmonic
12.567567567567567,1.0410776659896541,Har18,Harrison & Pearce (2018),harmonicity,#11A3FF,Harmonic
12.582582582582582,1.0423048949497207,Har18,Harrison & Pearce (2018),harmonicity,#11A3FF,Harmonic
12.597597597597597,1.0435427956954473,Har18,Harrison & Pearce (2018),harmonicity,#11A3FF,Harmonic
12.612612612612612,1.0447111722975633,Har18,Harrison & Pearce (2018),harmonicity,#11A3FF,Harmonic
12.627627627627627,1.0457479632469466,Har18,Harrison & Pearce (2018),harmonicity,#11A3FF,Harmonic
12.642642642642642,1.0466191355829486,Har18,Harrison & Pearce (2018),harmonicity,#11A3FF,Harmonic
12.657657657657657,1.0473105898011343,Har18,Harrison & Pearce (2018),harmonicity,#11A3FF,Harmonic
12.672672672672672,1.0478008742501965,Har18,Harrison & Pearce (2018),harmonicity,#11A3FF,Harmonic
12.687687687687687,1.0480495849703744,Har18,Harrison & Pearce (2018),harmonicity,#11A3FF,Harmonic
12.702702702702702,1.0480277598633965,Har18,Harrison & Pearce (2018),harmonicity,#11A3FF,Harmonic
12.717717717717717,1.0477587839569444,Har18,Harrison & Pearce (2018),harmonicity,#11A3FF,Harmonic
12.732732732732732,1.047318176373775,Har18,Harrison & Pearce (2018),harmonicity,#11A3FF,Harmonic
12.747747747747747,1.046798506380972,Har18,Harrison & Pearce (2018),harmonicity,#11A3FF,Harmonic
12.762762762762762,1.0462912783871479,Har18,Harrison & Pearce (2018),harmonicity,#11A3FF,Harmonic
12.777777777777777,1.04589242953124,Har18,Harrison & Pearce (2018),harmonicity,#11A3FF,Harmonic
12.792792792792792,1.0456918072704349,Har18,Harrison & Pearce (2018),harmonicity,#11A3FF,Harmonic
12.807807807807807,1.0457527694829154,Har18,Harrison & Pearce (2018),harmonicity,#11A3FF,Harmonic
12.822822822822824,1.0461239595091616,Har18,Harrison & Pearce (2018),harmonicity,#11A3FF,Harmonic
12.837837837837839,1.0468713673071297,Har18,Harrison & Pearce (2018),harmonicity,#11A3FF,Harmonic
12.852852852852854,1.0480838323956858,Har18,Harrison & Pearce (2018),harmonicity,#11A3FF,Harmonic
12.867867867867869,1.0498472891991852,Har18,Harrison & Pearce (2018),harmonicity,#11A3FF,Harmonic
12.882882882882884,1.052218859139091,Har18,Harrison & Pearce (2018),harmonicity,#11A3FF,Harmonic
12.897897897897899,1.055222776460035,Har18,Harrison & Pearce (2018),harmonicity,#11A3FF,Harmonic
12.912912912912914,1.058868958983079,Har18,Harrison & Pearce (2018),harmonicity,#11A3FF,Harmonic
12.927927927927929,1.0631713811638355,Har18,Harrison & Pearce (2018),harmonicity,#11A3FF,Harmonic
12.942942942942944,1.0681322722827664,Har18,Harrison & Pearce (2018),harmonicity,#11A3FF,Harmonic
12.957957957957959,1.0737002680142977,Har18,Harrison & Pearce (2018),harmonicity,#11A3FF,Harmonic
12.972972972972974,1.0797603622732748,Har18,Harrison & Pearce (2018),harmonicity,#11A3FF,Harmonic
12.987987987987989,1.0861699924605552,Har18,Harrison & Pearce (2018),harmonicity,#11A3FF,Harmonic
13.003003003003004,1.092780377146125,Har18,Harrison & Pearce (2018),harmonicity,#11A3FF,Harmonic
13.018018018018019,1.0994128147940363,Har18,Harrison & Pearce (2018),harmonicity,#11A3FF,Harmonic
13.033033033033034,1.1058361566800232,Har18,Harrison & Pearce (2018),harmonicity,#11A3FF,Harmonic
13.048048048048049,1.111786572680854,Har18,Harrison & Pearce (2018),harmonicity,#11A3FF,Harmonic
13.063063063063064,1.1170146288778169,Har18,Harrison & Pearce (2018),harmonicity,#11A3FF,Harmonic
13.078078078078079,1.121321248637353,Har18,Harrison & Pearce (2018),harmonicity,#11A3FF,Harmonic
13.093093093093094,1.124565319838928,Har18,Harrison & Pearce (2018),harmonicity,#11A3FF,Harmonic
13.108108108108109,1.1266539690312212,Har18,Harrison & Pearce (2018),harmonicity,#11A3FF,Harmonic
13.123123123123124,1.1275299479375351,Har18,Harrison & Pearce (2018),harmonicity,#11A3FF,Harmonic
13.138138138138139,1.1271612892783662,Har18,Harrison & Pearce (2018),harmonicity,#11A3FF,Harmonic
13.153153153153154,1.1255366374894946,Har18,Harrison & Pearce (2018),harmonicity,#11A3FF,Harmonic
13.168168168168169,1.1226670050227714,Har18,Harrison & Pearce (2018),harmonicity,#11A3FF,Harmonic
13.183183183183184,1.1185968328078573,Har18,Harrison & Pearce (2018),harmonicity,#11A3FF,Harmonic
13.198198198198199,1.1134372446035596,Har18,Harrison & Pearce (2018),harmonicity,#11A3FF,Harmonic
13.213213213213214,1.1074023388056493,Har18,Harrison & Pearce (2018),harmonicity,#11A3FF,Harmonic
13.228228228228229,1.100777656779811,Har18,Harrison & Pearce (2018),harmonicity,#11A3FF,Harmonic
13.243243243243244,1.0938089034800178,Har18,Harrison & Pearce (2018),harmonicity,#11A3FF,Harmonic
13.258258258258259,1.0866311184280049,Har18,Harrison & Pearce (2018),harmonicity,#11A3FF,Harmonic
13.273273273273274,1.0793382405195326,Har18,Harrison & Pearce (2018),harmonicity,#11A3FF,Harmonic
13.288288288288289,1.0721078394347037,Har18,Harrison & Pearce (2018),harmonicity,#11A3FF,Harmonic
13.303303303303304,1.0652167737570415,Har18,Harrison & Pearce (2018),harmonicity,#11A3FF,Harmonic
13.318318318318319,1.0589297707529968,Har18,Harrison & Pearce (2018),harmonicity,#11A3FF,Harmonic
13.333333333333334,1.0533975071965505,Har18,Harrison & Pearce (2018),harmonicity,#11A3FF,Harmonic
13.348348348348349,1.0486670405389773,Har18,Harrison & Pearce (2018),harmonicity,#11A3FF,Harmonic
13.363363363363364,1.0447664656941416,Har18,Harrison & Pearce (2018),harmonicity,#11A3FF,Harmonic
13.378378378378379,1.041758080321015,Har18,Harrison & Pearce (2018),harmonicity,#11A3FF,Harmonic
13.393393393393394,1.0397159403166514,Har18,Harrison & Pearce (2018),harmonicity,#11A3FF,Harmonic
13.408408408408409,1.0386774604321392,Har18,Harrison & Pearce (2018),harmonicity,#11A3FF,Harmonic
13.423423423423424,1.0386273762508689,Har18,Harrison & Pearce (2018),harmonicity,#11A3FF,Harmonic
13.438438438438439,1.03951336458921,Har18,Harrison & Pearce (2018),harmonicity,#11A3FF,Harmonic
13.453453453453454,1.041263865389823,Har18,Harrison & Pearce (2018),harmonicity,#11A3FF,Harmonic
13.468468468468469,1.0437997022600591,Har18,Harrison & Pearce (2018),harmonicity,#11A3FF,Harmonic
13.483483483483484,1.0470490947385165,Har18,Harrison & Pearce (2018),harmonicity,#11A3FF,Harmonic
13.498498498498499,1.050961824388575,Har18,Harrison & Pearce (2018),harmonicity,#11A3FF,Harmonic
13.513513513513514,1.0554995162003373,Har18,Harrison & Pearce (2018),harmonicity,#11A3FF,Harmonic
13.528528528528529,1.0605993787576544,Har18,Harrison & Pearce (2018),harmonicity,#11A3FF,Harmonic
13.543543543543544,1.0661524614907083,Har18,Harrison & Pearce (2018),harmonicity,#11A3FF,Harmonic
13.558558558558559,1.0720338811000008,Har18,Harrison & Pearce (2018),harmonicity,#11A3FF,Harmonic
13.573573573573574,1.0781659275419044,Har18,Harrison & Pearce (2018),harmonicity,#11A3FF,Harmonic
13.588588588588589,1.0845539044994486,Har18,Harrison & Pearce (2018),harmonicity,#11A3FF,Harmonic
13.603603603603604,1.0912482018766871,Har18,Harrison & Pearce (2018),harmonicity,#11A3FF,Harmonic
13.618618618618619,1.098256617991414,Har18,Harrison & Pearce (2018),harmonicity,#11A3FF,Harmonic
13.633633633633634,1.105505355177365,Har18,Harrison & Pearce (2018),harmonicity,#11A3FF,Harmonic
13.64864864864865,1.1129082677461555,Har18,Harrison & Pearce (2018),harmonicity,#11A3FF,Harmonic
13.663663663663664,1.1204635582034022,Har18,Harrison & Pearce (2018),harmonicity,#11A3FF,Harmonic
13.67867867867868,1.128249362036083,Har18,Harrison & Pearce (2018),harmonicity,#11A3FF,Harmonic
13.693693693693694,1.1363182762938973,Har18,Harrison & Pearce (2018),harmonicity,#11A3FF,Harmonic
13.70870870870871,1.1446222012782126,Har18,Harrison & Pearce (2018),harmonicity,#11A3FF,Harmonic
13.723723723723724,1.1530520423318849,Har18,Harrison & Pearce (2018),harmonicity,#11A3FF,Harmonic
13.73873873873874,1.161530664722641,Har18,Harrison & Pearce (2018),harmonicity,#11A3FF,Harmonic
13.753753753753754,1.170054105915104,Har18,Harrison & Pearce (2018),harmonicity,#11A3FF,Harmonic
13.76876876876877,1.1786526009909566,Har18,Harrison & Pearce (2018),harmonicity,#11A3FF,Harmonic
13.783783783783784,1.1873206538284098,Har18,Harrison & Pearce (2018),harmonicity,#11A3FF,Harmonic
13.7987987987988,1.1959851289388044,Har18,Harrison & Pearce (2018),harmonicity,#11A3FF,Harmonic
13.813813813813814,1.2045351284307606,Har18,Harrison & Pearce (2018),harmonicity,#11A3FF,Harmonic
13.82882882882883,1.2128700578541556,Har18,Harrison & Pearce (2018),harmonicity,#11A3FF,Harmonic
13.843843843843844,1.2209168768815946,Har18,Harrison & Pearce (2018),harmonicity,#11A3FF,Harmonic
13.85885885885886,1.2286192894802037,Har18,Harrison & Pearce (2018),harmonicity,#11A3FF,Harmonic
13.873873873873874,1.2359266840797938,Har18,Harrison & Pearce (2018),harmonicity,#11A3FF,Harmonic
13.88888888888889,1.2427900233264995,Har18,Harrison & Pearce (2018),harmonicity,#11A3FF,Harmonic
13.903903903903904,1.249154859769814,Har18,Harrison & Pearce (2018),harmonicity,#11A3FF,Harmonic
13.91891891891892,1.254954208224025,Har18,Harrison & Pearce (2018),harmonicity,#11A3FF,Harmonic
13.933933933933934,1.260117754477086,Har18,Harrison & Pearce (2018),harmonicity,#11A3FF,Harmonic
13.94894894894895,1.2645914762259673,Har18,Harrison & Pearce (2018),harmonicity,#11A3FF,Harmonic
13.963963963963964,1.2683316371886988,Har18,Harrison & Pearce (2018),harmonicity,#11A3FF,Harmonic
13.97897897897898,1.2712580221527598,Har18,Harrison & Pearce (2018),harmonicity,#11A3FF,Harmonic
13.993993993993994,1.2732064051821488,Har18,Harrison & Pearce (2018),harmonicity,#11A3FF,Harmonic
14.00900900900901,1.2739752048673056,Har18,Harrison & Pearce (2018),harmonicity,#11A3FF,Harmonic
14.024024024024024,1.2735558136516538,Har18,Harrison & Pearce (2018),harmonicity,#11A3FF,Harmonic
14.03903903903904,1.272391193525025,Har18,Harrison & Pearce (2018),harmonicity,#11A3FF,Harmonic
14.054054054054054,1.2712227497973168,Har18,Harrison & Pearce (2018),harmonicity,#11A3FF,Harmonic
14.06906906906907,1.270460710526791,Har18,Harrison & Pearce (2018),harmonicity,#11A3FF,Harmonic
14.084084084084084,1.2697850298913325,Har18,Harrison & Pearce (2018),harmonicity,#11A3FF,Harmonic
14.0990990990991,1.2685088668104612,Har18,Harrison & Pearce (2018),harmonicity,#11A3FF,Harmonic
14.114114114114114,1.2662199779782757,Har18,Harrison & Pearce (2018),harmonicity,#11A3FF,Harmonic
14.12912912912913,1.2629726894468278,Har18,Harrison & Pearce (2018),harmonicity,#11A3FF,Harmonic
14.144144144144144,1.259031612982065,Har18,Harrison & Pearce (2018),harmonicity,#11A3FF,Harmonic
14.15915915915916,1.2546093640772695,Har18,Harrison & Pearce (2018),harmonicity,#11A3FF,Harmonic
14.174174174174174,1.2498095147960886,Har18,Harrison & Pearce (2018),harmonicity,#11A3FF,Harmonic
14.18918918918919,1.2446912968304753,Har18,Harrison & Pearce (2018),harmonicity,#11A3FF,Harmonic
14.204204204204204,1.239335596091608,Har18,Harrison & Pearce (2018),harmonicity,#11A3FF,Harmonic
14.21921921921922,1.2338551675150988,Har18,Harrison & Pearce (2018),harmonicity,#11A3FF,Harmonic
14.234234234234235,1.2283249638121794,Har18,Harrison & Pearce (2018),harmonicity,#11A3FF,Harmonic
14.24924924924925,1.222671639626062,Har18,Harrison & Pearce (2018),harmonicity,#11A3FF,Harmonic
14.264264264264265,1.2166668277077877,Har18,Harrison & Pearce (2018),harmonicity,#11A3FF,Harmonic
14.27927927927928,1.210114047508341,Har18,Harrison & Pearce (2018),harmonicity,#11A3FF,Harmonic
14.294294294294295,1.203046244194755,Har18,Harrison & Pearce (2018),harmonicity,#11A3FF,Harmonic
14.30930930930931,1.1956784112202645,Har18,Harrison & Pearce (2018),harmonicity,#11A3FF,Harmonic
14.324324324324325,1.1882083867751545,Har18,Harrison & Pearce (2018),harmonicity,#11A3FF,Harmonic
14.33933933933934,1.1807603612094173,Har18,Harrison & Pearce (2018),harmonicity,#11A3FF,Harmonic
14.354354354354355,1.1734644255374864,Har18,Harrison & Pearce (2018),harmonicity,#11A3FF,Harmonic
14.36936936936937,1.166451284910997,Har18,Harrison & Pearce (2018),harmonicity,#11A3FF,Harmonic
14.384384384384385,1.1597703308820493,Har18,Harrison & Pearce (2018),harmonicity,#11A3FF,Harmonic
14.3993993993994,1.1534012394623994,Har18,Harrison & Pearce (2018),harmonicity,#11A3FF,Harmonic
14.414414414414415,1.1473511861233656,Har18,Harrison & Pearce (2018),harmonicity,#11A3FF,Harmonic
14.42942942942943,1.141688101230914,Har18,Harrison & Pearce (2018),harmonicity,#11A3FF,Harmonic
14.444444444444445,1.1364717876278616,Har18,Harrison & Pearce (2018),harmonicity,#11A3FF,Harmonic
14.45945945945946,1.131691652229868,Har18,Harrison & Pearce (2018),harmonicity,#11A3FF,Harmonic
14.474474474474475,1.127296873385662,Har18,Harrison & Pearce (2018),harmonicity,#11A3FF,Harmonic
14.48948948948949,1.1232782702252797,Har18,Harrison & Pearce (2018),harmonicity,#11A3FF,Harmonic
14.504504504504505,1.1197003468070028,Har18,Harrison & Pearce (2018),harmonicity,#11A3FF,Harmonic
14.51951951951952,1.1166361660953013,Har18,Harrison & Pearce (2018),harmonicity,#11A3FF,Harmonic
14.534534534534535,1.1140707394973264,Har18,Harrison & Pearce (2018),harmonicity,#11A3FF,Harmonic
14.54954954954955,1.11189311699663,Har18,Harrison & Pearce (2018),harmonicity,#11A3FF,Harmonic
14.564564564564565,1.109988802501621,Har18,Harrison & Pearce (2018),harmonicity,#11A3FF,Harmonic
14.57957957957958,1.108306548123621,Har18,Harrison & Pearce (2018),harmonicity,#11A3FF,Harmonic
14.594594594594595,1.1068277208678428,Har18,Harrison & Pearce (2018),harmonicity,#11A3FF,Harmonic
14.60960960960961,1.105507638452702,Har18,Harrison & Pearce (2018),harmonicity,#11A3FF,Harmonic
14.624624624624625,1.1042627134974392,Har18,Harrison & Pearce (2018),harmonicity,#11A3FF,Harmonic
14.63963963963964,1.1030023152908206,Har18,Harrison & Pearce (2018),harmonicity,#11A3FF,Harmonic
14.654654654654655,1.1016826367300325,Har18,Harrison & Pearce (2018),harmonicity,#11A3FF,Harmonic
14.66966966966967,1.1003485347352484,Har18,Harrison & Pearce (2018),harmonicity,#11A3FF,Harmonic
14.684684684684685,1.0991053226866243,Har18,Harrison & Pearce (2018),harmonicity,#11A3FF,Harmonic
14.6996996996997,1.0980243870974982,Har18,Harrison & Pearce (2018),harmonicity,#11A3FF,Harmonic
14.714714714714715,1.0970899461073527,Har18,Harrison & Pearce (2018),harmonicity,#11A3FF,Harmonic
14.72972972972973,1.096245819827496,Har18,Harrison & Pearce (2018),harmonicity,#11A3FF,Harmonic
14.744744744744745,1.0954630627715596,Har18,Harrison & Pearce (2018),harmonicity,#11A3FF,Harmonic
14.75975975975976,1.094761024414164,Har18,Harrison & Pearce (2018),harmonicity,#11A3FF,Harmonic
14.774774774774775,1.09421014214988,Har18,Harrison & Pearce (2018),harmonicity,#11A3FF,Harmonic
14.78978978978979,1.093932960831235,Har18,Harrison & Pearce (2018),harmonicity,#11A3FF,Harmonic
14.804804804804805,1.0940779452611569,Har18,Harrison & Pearce (2018),harmonicity,#11A3FF,Harmonic
14.81981981981982,1.0947746913308758,Har18,Harrison & Pearce (2018),harmonicity,#11A3FF,Harmonic
14.834834834834835,1.0961112710940524,Har18,Harrison & Pearce (2018),harmonicity,#11A3FF,Harmonic
14.84984984984985,1.0981513959988765,Har18,Harrison & Pearce (2018),harmonicity,#11A3FF,Harmonic
14.864864864864865,1.1009699128706798,Har18,Harrison & Pearce (2018),harmonicity,#11A3FF,Harmonic
14.87987987987988,1.1046630253266132,Har18,Harrison & Pearce (2018),harmonicity,#11A3FF,Harmonic
14.894894894894895,1.1093103897736523,Har18,Harrison & Pearce (2018),harmonicity,#11A3FF,Harmonic
14.90990990990991,1.1149167044452715,Har18,Harrison & Pearce (2018),harmonicity,#11A3FF,Harmonic
14.924924924924925,1.1213645029206567,Har18,Harrison & Pearce (2018),harmonicity,#11A3FF,Harmonic
14.93993993993994,1.1283650773063112,Har18,Harrison & Pearce (2018),harmonicity,#11A3FF,Harmonic
14.954954954954955,1.1354240350206468,Har18,Harrison & Pearce (2018),harmonicity,#11A3FF,Harmonic
14.96996996996997,1.1419331983197702,Har18,Harrison & Pearce (2018),harmonicity,#11A3FF,Harmonic
14.984984984984985,1.1474089529847808,Har18,Harrison & Pearce (2018),harmonicity,#11A3FF,Harmonic
15,1.1516705696213996,Har18,Harrison & Pearce (2018),harmonicity,#11A3FF,Harmonic
