interval,rating,rating_boot_mean,rating_boot_se
0,-0.1948381224835241,-0.18696174117352063,0.09445618263661544
0.015015015015015015,-0.1961826659430885,-0.18849892411460573,0.0929110189790608
0.03003003003003003,-0.19815389576914672,-0.19066000075523243,0.0913821442670512
0.04504504504504504,-0.20079903459151022,-0.19349130826744998,0.08987561166512169
0.06006006006006006,-0.20416532520227978,-0.19703916868479174,0.08839794320315832
0.07507507507507508,-0.20829938480239896,-0.20134925497131376,0.08695606583214482
0.09009009009009009,-0.21324645974270492,-0.20646586050967763,0.08555721767360207
0.10510510510510511,-0.21904958214544945,-0.21243107350699292,0.08420882117653804
0.12012012012012012,-0.22574863389715366,-0.21928386179135687,0.08291832129722312
0.13513513513513514,-0.2333793283884604,-0.22705907818939344,0.08169298891755464
0.15015015015015015,-0.24197212595522227,-0.23578640205292106,0.0805396925280588
0.16516516516516516,-0.2515511050815516,-0.24548923838308886,0.07946464461819598
0.18018018018018017,-0.2621328178033578,-0.2561836021398989,0.07847313298792463
0.19519519519519518,-0.2737251640482607,-0.2678770213909864,0.07756925090883757
0.21021021021021022,-0.2863263254230068,-0.28056749852781904,0.0767556431750425
0.22522522522522523,-0.2999238036976338,-0.2942425733716244,0.07603328698787541
0.24024024024024024,-0.314493612379473,-0.3088785350745907,0.07540132676833292
0.2552552552552553,-0.32999967076497205,-0.32443983076207883,0.07485698004136776
0.2702702702702703,-0.34639344820795803,-0.34087871737780584,0.07439552746549091
0.2852852852852853,-0.36361390167823854,-0.358135198816717,0.07401039425095297
0.3003003003003003,-0.38158774182178795,-0.3761372829636041,0.07369332332518957
0.3153153153153153,-0.40023005173581805,-0.3948015827322035,0.07343463357513075
0.3303303303303303,-0.41944526888349215,-0.4140342719202097,0.07322355023536188
0.34534534534534533,-0.4391285246303133,-0.43373239124400914,0.07304858971351495
0.36036036036036034,-0.459167318690139,-0.45378548314158895,0.07289797822917495
0.37537537537537535,-0.4794434884310491,-0.47407751689510796,0.07276008260245838
0.39039039039039036,-0.4998354167290968,-0.4944890495157053,0.07262383207993657
0.40540540540540543,-0.5202204080851377,-0.5148995538593145,0.0724791117878641
0.42042042042042044,-0.5404771521206115,-0.5351898347047548,0.07231711080765557
0.43543543543543545,-0.5604881871820014,-0.555244446899953,0.07213061063406595
0.45045045045045046,-0.5801422751153957,-0.5749540277217136,0.07191420271403522
0.46546546546546547,-0.5993366014416511,-0.5942174584669151,0.07166442682104235
0.4804804804804805,-0.6179787228977877,-0.612943777765646,0.07137982521739952
0.4954954954954955,-0.6359881959888374,-0.631053780579876,0.0710609109175152
0.5105105105105106,-0.6532978349204415,-0.6484812514323592,0.07071005185796776
0.5255255255255256,-0.6698545639888508,-0.6651737970219939,0.0703312763036329
0.5405405405405406,-0.6856198470652728,-0.6810932608786344,0.06993000821972965
0.5555555555555556,-0.7005696941459377,-0.696215719994658,0.06951274445284598
0.5705705705705706,-0.7146942611027969,-0.7105310794868998,0.06908668825345182
0.5855855855855856,-0.727997073013494,-0.7240422955411673,0.06865935584850778
0.6006006006006006,-0.7404939132511761,-0.7367642686601343,0.06823817438062635
0.6156156156156156,-0.7522114295859217,-0.7487224582982175,0.06783009051404902
0.6306306306306306,-0.7631855148124308,-0.7599512762585844,0.06744120927042073
0.6456456456456456,-0.7734595229741711,-0.7704923198524171,0.06707648204162196
0.6606606606606606,-0.7830823833358843,-0.7803925070042748,0.06673946103623712
0.6756756756756757,-0.792106673184735,-0.7897021745295121,0.06643213447982317
0.6906906906906907,-0.8005867076791344,-0.798473198042473,0.06615485265356684
0.7057057057057057,-0.8085767006820407,-0.8067571877113517,0.06590634946863451
0.7207207207207207,-0.8161290451587085,-0.8146038086695649,0.0656838581206617
0.7357357357357357,-0.8232927555892093,-0.8220592686037462,0.06548331304208384
0.7507507507507507,-0.830112108192716,-0.8291650081058847,0.0652996245633246
0.7657657657657657,-0.8366255077746356,-0.8359566220052435,0.06512700805977244
0.7807807807807807,-0.8428646028288012,-0.8424630322556109,0.06495934637188319
0.7957957957957957,-0.8488536632524766,-0.8487059251917312,0.06479056314217253
0.8108108108108109,-0.8546092277312055,-0.8546994582152242,0.06461498532955864
0.8258258258258259,-0.8601400205824956,-0.8604502333482064,0.06442767522041598
0.8408408408408409,-0.8654471306759893,-0.8659575277248976,0.06422471530746675
0.8558558558558559,-0.8705244380584982,-0.8712137641078908,0.06400343298559126
0.8708708708708709,-0.8753592672213556,-0.8762051980554105,0.06376255572761663
0.8858858858858859,-0.879933239707721,-0.8809127925779299,0.0635022909955109
0.9009009009009009,-0.8842232931558034,-0.8853132461626452,0.06322432849943395
0.9159159159159159,-0.8882028291201518,-0.8893801360663657,0.06293176554358815
0.9309309309309309,-0.8918429483260641,-0.8930851359255845,0.06262895916780002
0.9459459459459459,-0.8951137295940186,-0.8963992651266603,0.062321311692740675
0.960960960960961,-0.8979855076878995,-0.8992941271044119,0.062014999149455234
0.975975975975976,-0.900430105896207,-0.901743094830362,0.06171665488806172
0.990990990990991,-0.9024219812770652,-0.9037224041942082,0.061433023291915245
1.006006006006006,-0.9039392441236719,-0.9052121196934847,0.06117060076533292
1.021021021021021,-0.9049645181902636,-0.9061969416893805,0.06093528275663686
1.0360360360360361,-0.9054856143358037,-0.9066668302715966,0.060732036261184064
1.0510510510510511,-0.9054959972145046,-0.9066174272751296,0.06056461680970547
1.0660660660660661,-0.904995032160389,-0.9060502649587877,0.06043534727637846
1.0810810810810811,-0.9039880071680517,-0.9049727570402368,0.06034497296596797
1.0960960960960962,-0.9024859325791125,-0.9033979749514819,0.06029260353093454
1.1111111111111112,-0.9005051285045177,-0.9013442191287839,0.06027574761723675
1.1261261261261262,-0.898066616962239,-0.8988344017160442,0.06029044109752536
1.1411411411411412,-0.8951953420571327,-0.8958952631106993,0.060331464678750966
1.1561561561561562,-0.8919192471851073,-0.892556450216161,0.06039264186304681
1.1711711711711712,-0.8882682431380516,-0.8888494889974768,0.06046720389127008
1.1861861861861862,-0.8842731050460287,-0.884806687876993,0.06054820449622845
1.2012012012012012,-0.8799643392168558,-0.8804600115427678,0.06062896404452222
1.2162162162162162,-0.8753710629760988,-0.8758399667301329,0.06070351992694758
1.2312312312312312,-0.8705199413788416,-0.8709745422980534,0.060767057869196096
1.2462462462462462,-0.8654342239330279,-0.8658882452546417,0.06081629726289703
1.2612612612612613,-0.860132922014015,-0.8606012720922628,0.06084980287646064
1.2762762762762763,-0.8546301632773498,-0.855128850713281,0.06086819576300402
1.2912912912912913,-0.8489347530082229,-0.8494807822926838,0.06087423835229851
1.3063063063063063,-0.8430499640519683,-0.8436612046955203,0.06087277320278177
1.3213213213213213,-0.8369735670161996,-0.8376685897779995,0.06087050228660529
1.3363363363363363,-0.8306981012984938,-0.8314959764705584,0.06087560436589524
1.3513513513513513,-0.8242113758438713,-0.8251314305631753,0.06089720190786296
1.3663663663663663,-0.8174971771837375,-0.8185587113157711,0.06094470525319944
1.3813813813813813,-0.8105361521149844,-0.8117581151876044,0.06102707862685425
1.3963963963963963,-0.8033068241568017,-0.8047074588779534,0.06115208737438338
1.4114114114114114,-0.7957866973266257,-0.7973831581266331,0.06132559529414641
1.4264264264264264,-0.7879533982124369,-0.7897613557560411,0.06155098212131784
1.4414414414414414,-0.7797858078892891,-0.781819052395429,0.06182874233792538
1.4564564564564564,-0.7712651387279945,-0.7735351960742431,0.062156307856519266
1.4714714714714714,-0.7623759170894181,-0.7648916920018441,0.06252811145843992
1.4864864864864864,-0.7531068406075058,-0.7558743007603504,0.06293587971852665
1.5015015015015014,-0.7434514874522354,-0.7464734011042079,0.06336911868682307
1.5165165165165164,-0.733408863846127,-0.7366846018430946,0.0638157371359465
1.5315315315315314,-0.7229837844924367,-0.7265091952118072,0.06426274306858017
1.5465465465465464,-0.7121870879243897,-0.7159544511672425,0.06469694945862489
1.5615615615615615,-0.70103569475945815,-0.7050337578417596,0.06510563304912617
1.5765765765765765,-0.689552521290495,-0.6937666177551656,0.06547710264940065
1.5915915915915915,-0.6777662637863388,-0.6821785123450809,0.06580114790684674
1.6066066066066067,-0.6657110704544607,-0.670300649051946,0.06606935370993394
1.6216216216216217,-0.6534261184628483,-0.6581696058108124,0.06627527779475259
1.6366366366366367,-0.6409551129821331,-0.6458268876145221,0.06641449916228666
1.6516516516516517,-0.62834572413854,-0.6333184090744611,0.06648455251660725
1.6666666666666667,-0.6156489762739584,-0.6206939158320096,0.06648476934722872
1.6816816816816818,-0.6029186021554647,-0.6080063564294829,0.0664160498109494
1.6966966966966968,-0.5902103728806006,-0.5953112149421325,0.06628059145686042
1.7117117117117118,-0.577581412270146,-0.5826658133643824,0.06608160119692401
1.7267267267267268,-0.5650895025946412,-0.5701285914682692,0.06582301576351164
1.7417417417417418,-0.5527923866133451,-0.5577583706361446,0.06550925318440122
1.7567567567567568,-0.5407470692028691,-0.5456136070533517,0.06514501355696975
1.7717717717717718,-0.5290091204311778,-0.5337516386961649,0.06473514174664265
1.7867867867867868,-0.5176319809311091,-0.5222279298649316,0.0642845578669321
1.8018018018018018,-0.5066662699990111,-0.5110953167164264,0.0637982539930207
1.8168168168168168,-0.4961590971349337,-0.5004032574761661,0.06328134813600918
1.8318318318318318,-0.4861533788604418,-0.4901970918758184,0.06273917975885848
1.8468468468468469,-0.47668716464180505,-0.48051731592875907,0.06217742574491247
1.8618618618618619,-0.467792978557824,-0.4713988804136877,0.06160221235277522
1.8768768768768769,-0.45949718681550394,-0.46287052426289915,0.061020197780767595
1.8918918918918919,-0.45181940504481793,-0.454954157212485,0.06043860180612974
1.906906906906907,-0.4447719630974739,-0.44766430922042255,0.05986516362525002
1.921921921921922,-0.4383594483575093,-0.44100766686405674,0.05930801631779984
1.936936936936937,-0.4325783508372545,-0.43498271872097,0.05877547581581725
1.951951951951952,-0.4274168341093333,-0.4295795321679404,0.058275753071645196
1.966966966966967,-0.4228546550443303,-0.424779682743101,0.05781660912584524
1.981981981981982,-0.4188632521832124,-0.4205563540024661,0.057404982510401305
1.996996996996997,-0.4154060173863906,-0.41687462066498854,0.05704662526815388
2.012012012012012,-0.4124387584175674,-0.4136919210104136,0.05674578635313495
2.027027027027027,-0.4099103518145869,-0.41095871642211573,0.05650497834922337
2.042042042042042,-0.4077635764236106,-0.40861932727993555,0.056324855245499204
2.057057057057057,-0.40593610908081507,-0.4066129258354815,0.056204216456071605
2.0720720720720722,-0.40436165587737344,-0.40487465898341396,0.05614013736646355
2.0870870870870872,-0.40297118590724396,-0.4033368676285535,0.056128211974296134
2.1021021021021022,-0.4016942298655441,-0.4019303651205189,0.05616288113708266
2.1171171171171173,-0.40046020359666507,-0.4005857352371121,0.056237812322035625
2.1321321321321323,-0.3991997166911417,-0.3992346104490077,0.05634629428244144
2.1471471471471473,-0.3978458282678292,-0.39781089346499243,0.0564816123762273
2.1621621621621623,-0.3963352157385318,-0.3962518889334828,0.05663737609366091
2.1771771771771773,-0.3946092271127536,-0.3944993171509428,0.05680777820240474
2.1921921921921923,-0.39261479271296457,-0.39250018716539103,0.05698777324605543
2.2072072072072073,-0.39030517754627814,-0.39020751228120615,0.05717317081298738
2.2222222222222223,-0.38764056064984986,-0.38758085630162126,0.05736064538594628
2.2372372372372373,-0.38458843229399287,-0.3845867036711615,0.05754766951470895
2.2522522522522523,-0.38112380396889795,-0.3811986509488727,0.05773238069034592
2.2672672672672673,-0.3772292297445561,-0.37739742085001793,0.057913394986121323
2.2822822822822824,-0.37289464115256327,-0.3731707036466245,0.05808958263847161
2.2972972972972974,-0.36811700153139604,-0.3685128342807562,0.058259822545569884
2.3123123123123124,-0.362899790128849,-0.3634243173761614,0.05842275425466332
2.3273273273273274,-0.35725233139503937,-0.3579112166155224,0.05857654727111629
2.3423423423423424,-0.3511889908771103,-0.3519844297248514,0.0587187081288817
2.3573573573573574,-0.3447282657524964,-0.34565887543142826,0.058845945154391135
2.3723723723723724,-0.3378918048499618,-0.3389526238879838,0.05895410874909273
2.3873873873873874,-0.3307033992892303,-0.3318860066423144,0.05903822094321534
2.4024024024024024,-0.32318798971689705,-0.3244807455981762,0.05909260183046525
2.4174174174174174,-0.31537073856210635,-0.31675914183498916,0.05911109254701686
2.4324324324324325,-0.30727621491575907,-0.3087433639829484,0.05908736538069133
2.4474474474474475,-0.29892773497019753,-0.3004548716498646,0.059015302402987344
2.4624624624624625,-0.2903468923019115,-0.29191400205959506,0.058889415909021206
2.4774774774774775,-0.281553300037413,-0.28313973788875835,0.05870527809644511
2.4924924924924925,-0.2725645520597376,-0.27414966199662244,0.05845992471905735
2.5075075075075075,-0.26339639428842565,-0.2649600914052971,0.05815219837382779
2.5225225225225225,-0.25406308135883193,-0.2555863697973196,0.05778300154547763
2.5375375375375375,-0.24457788040868478,-0.24604328628805672,0.057355436949714865
2.5525525525525525,-0.23495367357771202,-0.23634557947742818,0.05687482210213402
2.5675675675675675,-0.22520360521008254,-0.22650848063829257,0.056348575212365457
2.5825825825825826,-0.2153417190079804,-0.21654824876669637,0.055785979295458456
2.5975975975975976,-0.20538353430638057,-0.20648265303479005,0.055197839843011944
2.6126126126126126,-0.1953465184936857,-0.19633136444887087,0.054596057875187586
2.6276276276276276,-0.18525042329670277,-0.18611622739105227,0.05399314444479732
2.6426426426426426,-0.17511746491340546,-0.1758613921931717,0.053401704759176674
2.6576576576576576,-0.1649723405553146,-0.16559330089508176,0.05283392031768818
2.6726726726726726,-0.15484208575449146,-0.15534052890484165,0.05230105620495861
2.6876876876876876,-0.14475578695418329,-0.14513349461659283,0.05181301825560054
2.7027027027027026,-0.13474417188932564,-0.13500405659796355,0.0513779814128968
2.7177177177177176,-0.12483910581378792,-0.12498502342179998,0.05100210631499352
2.7327327327327327,-0.1150730247344473,-0.11510960449982036,0.05068935598320544
2.7477477477477477,-0.10547833764644919,-0.10541083147384422,0.050441418555697795
2.7627627627627627,-0.09608682863523564,-0.09592097906168875,0.05025773558234902
2.7777777777777777,-0.08692908699423799,-0.08667101205015254,0.050135628965403314
2.7927927927927927,-0.0780339896003071,-0.07769008172573637,0.05007051384278992
2.8078078078078077,-0.06942825507758978,-0.06900509078734168,0.05005618022376357
2.8228228228228227,-0.06113608411586822,-0.06064034102526741,0.050085123493678406
2.8378378378378377,-0.05317889499561475,-0.05261727307161415,0.0501489032046125
2.8528528528528527,-0.045575158162208126,-0.04495430257831636,0.05023851072180868
2.8678678678678677,-0.03834032878849786,-0.03766675246384558,0.05034472888104701
2.8828828828828827,-0.03148687182518354,-0.03076687654795771,0.050458470248388856
2.8978978978978978,-0.025024370179848956,-0.024263966087068982,0.05057108426155787
2.9129129129129128,-0.018959703473311114,-0.01816452752045005,0.050674626967501066
2.9279279279279278,-0.013297282355549049,-0.012472517203322422,0.0507620899105286
2.942942942942943,-0.008039321661116776,-0.007189617080783678,0.05082758680457496
2.957957957957958,-0.0031861347655607057,-0.0023155341730267836,0.05086649793404516
2.972972972972973,0.0012635686280416223,0.0021516935914490175,0.0508755728821662
2.987987987987988,0.005312398407419362,0.006215402248058704,0.05085299237101536
3.003003003003003,0.008964029445751236,0.009880033299827945,0.05079838993525966
3.018018018018018,0.01222299021992686,0.013150905984030703,0.050712834063221704
3.033033033033033,0.015094505811261743,0.01603404204956224,0.05059877151558267
3.048048048048048,0.017584403419921717,0.018536051927794558,0.05045993291306163
3.063063063063063,0.01969908520832972,0.020664087969141216,0.050301202441301464
3.078078078078078,0.021445569852765033,0.02242586702011042,0.050128454650262215
3.093093093093093,0.022831600800521313,0.023829761202566458,0.049948362748542814
3.108108108108108,0.02386581606833187,0.024884952498990552,0.049768184366339126
3.123123123123123,0.024557971619100963,0.025601643799690568,0.04959553229016795
3.138138138138138,0.024919208024870576,0.025991316554707967,0.04943813893505413
3.153153153153153,0.024962348325828564,0.026067023177265645,0.049303624090055204
3.168168168168168,0.02470221374144602,0.025843700901598335,0.04919927555378366
3.183183183183183,0.02415594314954477,0.02533849289305529,0.04913185153430156
3.198198198198198,0.02334330195701222,0.02457106198961098,0.049107412086946356
3.2132132132132134,0.02228696605721848,0.023563882441746033,0.04913118449481342
3.2282282282282284,0.021012766916731308,0.022342495322547357,0.049207464587187354
3.2432432432432434,0.019549884384760904,0.020935713820103827,0.04933955289007815
3.2582582582582584,0.017930974527903844,0.01937576534162638,0.04952972163457002
3.2732732732732734,0.016192220651510544,0.017698358229565073,0.04977920644093026
3.2882882882882885,0.014373296706942805,0.015942661930161642,0.05008821529736777
3.3033033033033035,0.012517233563926743,0.01415119071730871,0.05045594745517681
3.3183183183183185,0.01067018023403009,0.012369582640172013,0.050880616059019446
3.3333333333333335,0.008881054155998934,0.010646267325604716,0.05135947050885065
3.3483483483483485,0.007201077174707749,0.009032018713909799,0.05188881732767329
3.3633633633633635,0.005683196909766213,0.00757939180087703,0.05246404121045416
3.3783783783783785,0.004381396816348933,0.006342046017209327,0.053079630470126205
3.3933933933933935,0.003349902328662913,0.005373961955776955,0.053729212870027736
3.4084084084084085,0.002642294919846366,0.00472856264698855,0.05440560857410231
3.4234234234234235,0.0023105505230435527,0.004457755304238963,0.05510090656841462
3.4384384384384385,0.002404023297672486,0.004610914176752296,0.055806569496841985
3.4534534534534536,0.002968399920029024,0.005233829575498695,0.056513569640356996
3.4684684684684686,0.004044653145784609,0.006367651979350915,0.05721255607400622
3.4834834834834836,0.005668026066351262,0.008047863091154695,0.05789405020911413
3.4984984984984986,0.007867080033857199,0.010303307539588311,0.058548664294131005
3.5135135135135136,0.01066283949238805,0.01315531941348551,0.05916733526020007
3.5285285285285286,0.014068065830573937,0.01661697684667081,0.05974156471853532
3.5435435435435436,0.018086689844250766,0.020692515402751563,0.06026365501158902
3.5585585585585586,0.022713428523659294,0.025376927083275703,0.06072693097159759
3.5735735735735736,0.02793360677784793,0.030655766517148582,0.06112593737339045
3.5885885885885886,0.03372319855110761,0.03650517946509994,0.0614566028802417
3.6036036036036037,0.04004909478108197,0.04289216142022516,0.06171636246949965
3.6186186186186187,0.04686959802992759,0.0497750460707217,0.06190423180908964
3.6336336336336337,0.05413513564106412,0.057104215008034524,0.06202082879212675
3.6486486486486487,0.061789175202825314,0.06482301162920925,0.0620683394156656
3.6636636636636637,0.06976931822179666,0.0728688340323558,0.06205042742609497
3.6786786786786787,0.07800854052710432,0.08117437419119482,0.06197208966592876
3.6936936936936937,0.08643654136669195,0.08966896418128789,0.06183946183787444
3.7087087087087087,0.09498115775704762,0.09827998507715324,0.061659582389447354
3.7237237237237237,0.1035697967514026,0.10693429068506168,0.06144012526801866
3.7387387387387387,0.11213083622248173,0.11555959681279583,0.06118911515089846
3.7537537537537538,0.1205949447923847,0.12408578752052571,0.060914641060524875
3.7687687687687688,0.12889627388181257,0.1324460928562376,0.06062458559299665
3.7837837837837838,0.13697347957727043,0.1405780979356701,0.060326386861605394
3.798798798798799,0.1447705390681834,0.14842455071722746,0.06002684830643521
3.813813813813814,0.15223733556375482,0.15593394513735429,0.0597320075673093
3.828828828828829,0.1593299964719553,0.16306086696626196,0.05944706979852295
3.843843843843844,0.16601098166524572,0.16976610126056924,0.05917640364915242
3.858858858858859,0.17224893119856935,0.17601651199315094,0.05892359055368504
3.873873873873874,0.17801829413262382,0.1817847156592494,0.05869151115560475
3.888888888888889,0.18329877137224437,0.18704858072826797,0.058482447866078514
3.903903903903904,0.188074614915137,0.19179059312364508,0.05829818078951427
3.918918918918919,0.1923338329774791,0.1959971339573797,0.05814005612921234
3.933933933933934,0.19606735463024147,0.1996577191450474,0.05800901169567034
3.948948948948949,0.19926820854950175,0.20276425106948065,0.0579055525671726
3.963963963963964,0.20193076818438768,0.20531033011749714,0.05782967997851949
3.978978978978979,0.2040501102376223,0.20729066884262043,0.05778078642161948
3.993993993993994,0.2056215252154889,0.20870064404553323,0.057757537925824436
4.009009009009009,0.20664020850546688,0.2095360127070892,0.057757769012876804
4.024024024024024,0.2071011486925849,0.2097928070702293,0.057778415965334014
4.039039039039039,0.20699921742562907,0.20946741293460855,0.057815509717412936
4.054054054054054,0.206329452906199,0.20855682410892376,0.05786424166309962
4.069069069069069,0.20508751776462542,0.2070590556340836,0.05791910548072327
4.084084084084084,0.20327030236727442,0.20497368943371772,0.05797410756376174
4.099099099099099,0.20087663697623426,0.20230251892905465,0.058023029625910404
4.114114114114114,0.19790807097588478,0.19905025418037836,0.058059720861691436
4.129129129129129,0.19436967471726577,0.19522524642812106,0.05807839434942
4.1441441441441444,0.19027081934860807,0.19084019048145368,0.058073903113442266
4.1591591591591595,0.18562589207651375,0.18591276507522805,0.058041974768635346
4.1741741741741745,0.18045490829294011,0.18046617480786517,0.057979388972889165
4.1891891891891895,0.1747839874896759,0.17452956222752036,0.05788408797122962
4.2042042042042045,0.16864566641917564,0.16813826466037812,0.057755216441505525
4.2192192192192195,0.16207903012012298,0.1613338970841255,0.05759309204218127
4.2342342342342345,0.15512964883074104,0.15416424938749224,0.05739911223230331
4.2492492492492495,0.14784931615826669,0.14668299342604202,0.05717560607529009
4.2642642642642645,0.1402955909358743,0.1389492021566705,0.056925642034076795
4.2792792792792795,0.13253115183182282,0.1310266896479997,0.056652804474587995
4.2942942942942945,0.12462297989365341,0.12298318681690647,0.056360952942832714
4.3093093093093096,0.11664138976542851,0.11488937326624811,0.056053979370962063
4.324324324324325,0.10865893527260063,0.1068177905418851,0.05573557913023443
4.33933933933934,0.10074921937926883,0.09884166642483329,0.05540905204502578
4.354354354354355,0.09298564210580443,0.09103368343375325,0.05507714875944552
4.36936936936937,0.08544012272826457,0.08346472740182015,0.05474197584311122
4.384384384384385,0.0781818342997726,0.07620265364036907,0.054404969484554824
4.3993993993994,0.07127598904597303,0.06931110861675878,0.05406694252607014
4.414414414414415,0.06478271229768119,0.06284844406645557,0.05372820321507397
4.42942942942943,0.05875604017404994,0.05686675787936964,0.05338873695267428
4.444444444444445,0.05324307213261677,0.051411091875926726,0.05304843530078437
4.45945945945946,0.04828330378389146,0.04651881076121993,0.05270735044909183
4.474474474474475,0.04390815819290444,0.04221917929754422,0.05236594907178921
4.48948948948949,0.040140725575459384,0.0385331463974409,0.05202533766516066
4.504504504504505,0.036995712302487306,0.035473335879473336,0.05168743242490638
4.51951951951952,0.0344795910218851,0.03304423461992295,0.05135505056979032
4.534534534534535,0.03259093512146055,0.031242560399630432,0.05103190653013404
4.54954954954955,0.03132091330805033,0.03005778449645303,0.050722505122618645
4.564564564564565,0.030653914306193148,0.029472778537321293,0.050431934025467424
4.57957957957958,0.030568267981473052,0.029464551681626826,0.050165568639746
4.594594594594595,0.031037027776003076,0.03000504305160524,0.04992871267307944
4.60960960960961,0.03202878020279704,0.031061935436745677,0.0497262062735105
4.624624624624625,0.033508450073328325,0.03259945945516168,0.049562039017336836
4.63963963963964,0.03543807474654189,0.03457916216021955,0.04943900644829947
4.654654654654655,0.03777752648406802,0.0369606200198446,0.04935844556755674
4.66966966966967,0.040485168411084946,0.03970208269467287,0.04932007678782045
4.684684684684685,0.04351843605300931,0.04276104053033117,0.04932196833219708
4.6996996996997,0.046834342439630694,0.04609471464991068,0.049360625561784256
4.714714714714715,0.05038990993288744,0.04966047357890693,0.049431194346016234
4.72972972972973,0.05414253595662331,0.05341618417768015,0.04952775635942343
4.744744744744745,0.058050302530538875,0.05732050715256728,0.04964368656657776
4.75975975975976,0.062072240903626986,0.06133314855179124,0.04977203977955375
4.774774774774775,0.06616856271916598,0.06541507852387404,0.04990593381832996
4.78978978978979,0.07030086818292777,0.06952872740979811,0.050038900608695557
4.804804804804805,0.07443233986793017,0.07363816720258745,0.05016518234296261
4.81981981981982,0.07852792832855086,0.07770928382083783,0.050279956462191217
4.834834834834835,0.08255453288481282,0.08170994279779914,0.050379479811395254
4.84984984984985,0.08648117804156942,0.08561014816536723,0.05046114834529014
4.864864864864865,0.09027918327590195,0.08938219176410549,0.05052347402922066
4.87987987987988,0.09392232157706527,0.09300078814442884,0.05056598512813183
4.894894894894895,0.09738696033338093,0.09644318879543737,0.050589060047039024
4.90990990990991,0.1006521770573801,0.09968926874243762,0.050593708398084504
4.924924924924925,0.10369984209814784,0.10272157862675074,0.05058131602827577
4.93993993993994,0.10651466092550638,0.10552535619739603,0.05055337320174847
4.954954954954955,0.10908416974636007,0.10808849262564015,0.050511206705992455
4.96996996996997,0.11139868003971902,0.11040145107723157,0.05045573698681386
4.984984984984985,0.11345116994065281,0.11245713738678512,0.05038728018924933
5,0.11523712309874988,0.11425072529643014,0.05030541201850794
5.015015015015015,0.1167543184970647,0.11577944136052797,0.050208905707610295
5.03003003003003,0.11800257754950046,0.11704231709804787,0.050095750441210354
5.045045045045045,0.11898347741005622,0.11803991812695254,0.04996324994128105
5.06006006006006,0.11970004165513219,0.11877406169689084,0.04980819431702459
5.075075075075075,0.1201564211943772,0.11924753513323602,0.04962709246340895
5.09009009009009,0.12035757931208096,0.11946382813584568,0.049416447857538875
5.105105105105105,0.12030899506080368,0.11942689159353276,0.04917305789768872
5.12012012012012,0.12001639877950873,0.11914093456952411,0.04889431602130857
5.135135135135135,0.1194855522854154,0.1186102694092409,0.048578496543795764
5.15015015015015,0.11872208432530677,0.11783921258089805,0.04822500413587979
5.165165165165165,0.11773138923958011,0.11683204597950278,0.047834572703052865
5.18018018018018,0.11651859360026107,0.11559304014029487,0.04740940177957691
5.195195195195195,0.11508859197927533,0.11412653728792041,0.046953222132861704
5.21021021021021,0.11344614916651444,0.11243708859234483,0.046471285941857204
5.225225225225225,0.11159606229860297,0.1105296366323061,0.04597028062273978
5.24024024024024,0.10954337270776247,0.10840973110928052,0.045458169149940504
5.255255255255255,0.10729361409042577,0.10608376352438575,0.044943963591420215
5.27027027027027,0.10485308105001244,0.10355920500830094,0.044437442516511376
5.285285285285285,0.10222910037926362,0.10084483090624576,0.043948826794577456
5.3003003003003,0.09943028675636227,0.09795091612093491,0.04348843177148733
5.315315315315315,0.09646676491107434,0.0948893865809768,0.04306631640852526
5.33033033033033,0.0933503417712762,0.09167391442696687,0.04269195110114327
5.345345345345345,0.09009461454618749,0.08831994742313104,0.04237392498052903
5.36036036036036,0.08671500398717558,0.08484466649433871,0.0421197101528858
5.375375375375375,0.08322870597775944,0.08126686892275005,0.04193549455871956
5.39039039039039,0.07965455889062449,0.07760677838800167,0.041826087482130146
5.405405405405405,0.07601282854529506,0.07388578650090452,0.04179489329107397
5.42042042042042,0.0723249168484261,0.07012613360711555,0.041843941186649386
5.435435435435435,0.06861300407131868,0.06635053931669038,0.04197395305346215
5.45045045045045,0.06489963803131057,0.06258179538579386,0.042184429046358655
5.465465465465465,0.061207286061114516,0.05884233521240922,0.04247373176736982
5.48048048048048,0.05755786749011437,0.0551537953061951,0.042839154439622384
5.495495495495495,0.05397228538735074,0.051536584661397315,0.04327696534503314
5.51051051051051,0.05046997652786413,0.04800947800804405,0.04378242852212418
5.525525525525525,0.047068497969922206,0.044589248440684334,0.044349807823039364
5.54054054054054,0.04378316731657748,0.04129035391808669,0.04497236667247588
5.555555555555555,0.040626771739488234,0.03812469058068025,0.045642378503957644
5.57057057057057,0.037609358234641906,0.03510142373974804,0.04635116267771783
5.585585585585585,0.03473811443855659,0.03222690476499984,0.047089158023444
5.6006006006006,0.03201734575503787,0.029504678975402862,0.04784604167620755
5.615615615615615,0.029448550642109543,0.026935586100673158,0.04861089543510141
5.63063063063063,0.02703059182589512,0.0245179510504099,0.04937241631588799
5.645645645645645,0.024759957107620335,0.0222478587713089,0.05011916299612267
5.66066066066066,0.022631099498021494,0.020119503094538627,0.05083982595875081
5.675675675675675,0.02063684285017641,0.018125595903916207,0.0515235066033961
5.6906906906906904,0.018768836167594193,0.01625781992567788,0.05215998950167904
5.7057057057057055,0.017018037523709922,0.0145073061711903,0.052739992275811505
5.7207207207207205,0.01537520719230012,0.012865115735037978,0.05325537914247713
5.7357357357357355,0.013831389255653246,0.01132270538343757,0.05369932679689844
5.7507507507507505,0.012378361664895064,0.009872357207745737,0.05406643478832656
5.7657657657657655,0.011009036440197512,0.008507554527386054,0.05435277659824603
5.7807807807807805,0.00971779431267776,0.007223289085026606,0.05455589198262833
5.7957957957957955,0.008500741456673974,0.0060162881895968814,0.05467472545393568
5.8108108108108105,0.007355879824354247,0.0048851545786080764,0.05470951971108542
5.8258258258258255,0.006283186728546223,0.0038304161062966404,0.05466167603258137
5.8408408408408405,0.005284603471021933,0.002854486628626819,0.05453359582219734
5.8558558558558556,0.004363936742885153,0.001961543381616822,0.05432851840605089
5.870870870870871,0.003526680024632885,0.0011573295122563549,0.054050369705117146
5.885885885885886,0.0027797651264533842,4.488930607832926e-4,0.05370363456657904
5.900900900900901,0.002131256230624364,-1.5572447846391098e-4,0.0532932624936466
5.915915915915916,0.0015900002820796132,-6.478358861764299e-4,0.052824612556903724
5.930930930930931,0.0011652483301830931,-0.001018477870853047,0.05230343877970085
5.945945945945946,8.662625118873056e-4,-0.001258788703536582,0.05173591267909014
5.960960960960961,7.019228776776623e-4,-0.0013603808300706895,0.051128675303370064
5.975975975975976,6.803473144128566e-4,-0.0013156967421892678,0.05048890735958765
5.990990990990991,8.085365408660616e-4,-0.0011183378613203526,0.04982440309816805
6.006006006006006,0.0010920546674197448,-7.633577062595613e-4,0.04914363165741675
6.021021021021021,0.0015347542326766103,-2.475120681960431e-4,0.04845576865203859
6.036036036036036,0.0021385530470828893,4.3053976560794306e-4,0.047770680996739076
6.051051051051051,0.002903268650925487,0.0012700875423759877,0.04709884941726889
6.066066066066066,0.003826514767052749,0.002268280126573877,0.046451216027299874
6.081081081081081,0.004903662806282943,0.0034200960368426635,0.04583894901494851
6.096096096096096,0.00612787025202419,0.004718376490405604,0.04527312313529854
6.111111111111111,0.007490176580052182,0.0061539221380065,0.04476432338962737
6.126126126126126,0.00897966622114524,0.007715653717084933,0.044322189594209804
6.141141141141141,0.010583696909528859,0.009390835762963247,0.04395493045092333
6.156156156156156,0.01228819054771104,0.011165361273944418,0.04366884545217739
6.171171171171171,0.014077982441311688,0.013024093831346405,0.04346789920332204
6.186186186186186,0.015937223417442456,0.014951262163108036,0.0433533933159496
6.201201201201201,0.017849827958759844,0.01693090056792353,0.04332377458571489
6.216216216216216,0.019799960102875564,0.01894732706172549,0.04337460499894951
6.231231231231231,0.02177254752832935,0.020985649653682235,0.043498701350558416
6.246246246246246,0.02375381303676569,0.02303228988617271,0.043686433418361356
6.261261261261261,0.025731811609526114,0.025075511751295507,0.04392615354341971
6.276276276276276,0.0276969604209698,0.027105943373239277,0.044204720012214045
6.291291291291291,0.029642548671208555,0.029117078442962515,0.04450807299971734
6.306306306306306,0.03156521387893246,0.031105744303216828,0.04482182436878938
6.321321321321321,0.033465371350970344,0.03307252377737407,0.04513182941074652
6.336336336336336,0.035347583900232654,0.03502211826622342,0.04542471728166138
6.351351351351351,0.03722085948444772,0.03696364024606299,0.0456883653388207
6.366366366366366,0.03909886524433322,0.03891082403534523,0.04591230939284588
6.381381381381381,0.04100004739288582,0.04088214451649705,0.046088086401944055
6.396396396396396,0.04294764751888678,0.04290083438875917,0.04620950829949791
6.411411411411412,0.04496960710635698,0.04499479150115915,0.04627286581266001
6.426426426426427,0.047098353448140985,0.04719636891751364,0.046277059842305325
6.441441441441442,0.049370461679292446,0.04954204167097298,0.046223655848277076
6.456456456456457,0.051826189427434374,0.05207194576684033,0.04611685435174881
6.471471471471472,0.05450888263878833,0.05482928698921015,0.0459633687844721
6.486486486486487,0.057464253559131644,0.05785961955111733,0.04577220118776905
6.501501501501502,0.060739534688492566,0.06120999766657058,0.0455543074592026
6.516516516516517,0.06438251582427346,0.06492800674265262,0.04532214774557677
6.531531531531532,0.06844047506117194,0.06906068506322698,0.045089124842606576
6.546546546546547,0.07295901878190206,0.07365335147156517,0.044868924341598886
6.561561561561562,0.07798085014808219,0.07874835949870561,0.044674784252883064
6.576576576576577,0.08354449022308338,0.08438380340411827,0.04451873730658811
6.591591591591592,0.08968298040571292,0.09059220641658679,0.04441088321085777
6.606606606606607,0.09642259905068878,0.09739922576859526,0.04435875706637204
6.621621621621622,0.10378162868596334,0.10482241257236422,0.04436686017812855
6.636636636636637,0.111769212777539,0.11287006686421178,0.04443640838318832
6.651651651651652,0.12038434221802904,0.1215402289563748,0.044565331122147216
6.666666666666667,0.12961501134373837,0.13081984735480387,0.04474852533282309
6.681681681681682,0.13943758110651702,0.1406841607867227,0.04497833764432728
6.696696696696697,0.1498163829328917,0.15109632729639777,0.04524522255943451
6.711711711711712,0.1607035908129545,0.1620073269908814,0.04553850801124802
6.726726726726727,0.1720393814360033,0.17335615704852264,0.045847194678077456
6.741741741741742,0.18375239303402138,0.18507032835549408,0.046160720632241754
6.756756756756757,0.19576048344420832,0.1970666630243852,0.04646963523474766
6.771771771771772,0.2079717772974872,0.20925238156709924,0.04676614202853329
6.786786786786787,0.2202859817818396,0.22152645818242278,0.04704448659975337
6.801801801801802,0.23259594072751427,0.23378121302647273,0.047301179896349015
6.816816816816817,0.2447893883791139,0.2459041019791183,0.047535059321776735
6.831831831831832,0.25675085762149663,0.2577796577436324,0.0477471988691453
6.846846846846847,0.26836369293346074,0.2692915314495008,0.04794068589721533
6.861861861861862,0.2795121161059276,0.28032458145709915,0.048120286333156216
6.876876876876877,0.2900832927508609,0.2907669558182926,0.048292022606824844
6.891891891891892,0.29996934964704,0.3005121167037081,0.0484626899308334
6.906906906906907,0.30906929668552346,0.30946075880140334,0.04863933703304943
6.921921921921922,0.3172908121653987,0.3175225788527211,0.04882873743393128
6.936936936936937,0.3245518559839506,0.32461785968494344,0.04903687702775255
6.951951951951952,0.33078208141468207,0.3306788388761806,0.04926848309066563
6.966966966966967,0.33592402228438406,0.33565083912480437,0.049526618719135274
6.981981981981982,0.3399340381595292,0.3394931441419951,0.04981236475344855
6.996996996996997,0.3427830054669836,0.3421796101877086,0.05012460805604607
7.012012012012012,0.3444567472628012,0.3436990090854035,0.05045995028646359
7.027027027027027,0.34495619869647354,0.34405510364777003,0.0508127449998751
7.042042042042042,0.3442973092493985,0.3432664609881464,0.05117526331226153
7.057057057057057,0.34251068675297436,0.34136601331135624,0.051537980186821805
7.072072072072072,0.33964099220984867,0.3384003796353796,0.051889965484833184
7.087087087087087,0.3357460987022942,0.3344289656447896,0.052219357188083244
7.102102102102102,0.3308960322416388,0.32952286262410835,0.05251388935751791
7.117117117117117,0.3251717172489285,0.32376357019144536,0.05276144485275994
7.132132132132132,0.31866355429605664,0.3172415712799786,0.052950602665725106
7.147147147147147,0.3114698625020048,0.3100547913262213,0.053071151693960865
7.162162162162162,0.3036952232084007,0.3023069766631947,0.053114546479516515
7.177177177177177,0.2954487648467095,0.29410602937296443,0.05307428536524537
7.192192192192192,0.2868424308594608,0.2855623370059246,0.05294619716635959
7.207207207207207,0.2779892728200813,0.2767871353449807,0.052728628356962626
7.222222222222222,0.26900180929748263,0.26789094059335306,0.052422528522846776
7.237237237237237,0.25999048747662495,0.2589820839378508,0.052031437080645
7.252252252252252,0.25106227919559243,0.2501653764810969,0.05156137870278946
7.267267267267267,0.2423194361879159,0.24154092629649915,0.051020678255405565
7.282282282282282,0.23385842137009594,0.23320312222301048,0.05041970814720088
7.297297297297297,0.22576902453863457,0.22523979146167847,0.04977058168272052
7.312312312312312,0.2181336624386085,0.21773153058514802,0.04908680532272776
7.327327327327327,0.21102685542714508,0.2107512027353906,0.04838290086432265
7.342342342342342,0.20451486640323746,0.2043635880116654,0.04767400586704081
7.357357357357357,0.1986554827201449,0.19862516968410346,0.04697545780199708
7.372372372372372,0.1934979187021197,0.19358403612223687,0.04630236521359065
7.387387387387387,0.1890828152568826,0.18927987727602988,0.04566916855683836
7.402402402402402,0.18544231385162005,0.18574405512726258,0.045089195074425104
7.4174174174174174,0.1826001845990386,0.18299972955879645,0.04457421645466983
7.4324324324324325,0.18057199205345295,0.18106202428887092,0.044134024699253815
7.4474474474474475,0.179365287123977,0.17993822153766129,0.04377604936278746
7.4624624624624625,0.17897981879137467,0.17962797854229923,0.043505046018343124
7.4774774774774775,0.1794077645602733,0.18012356350748554,0.043322888989890604
7.4924924924924925,0.1806339832925008,0.18141011267441012,0.04322849899955373
7.5075075075075075,0.1826362977978486,0.18346591354681413,0.04321792755830785
7.5225225225225225,0.1853858169328548,0.18626272162168314,0.04328460558976223
7.5375375375375375,0.18884730771508312,0.1897661190034818,0.043419746469177366
7.5525525525525525,0.19297962698011067,0.19393592290523634,0.043612876808850655
7.5675675675675675,0.19773621943330716,0.19872665024571046,0.043852455116145966
7.5825825825825826,0.20306568479341164,0.20408804145966292,0.044126530904192135
7.597597597597598,0.20891241147045853,0.20996564250322747,0.044423395393454274
7.612612612612613,0.21521726838752853,0.21630143923963932,0.04473217871192335
7.627627627627628,0.22191834075947436,0.22303453341233123,0.04504335586128607
7.642642642642643,0.2289516905287194,0.23010184479058346,0.04534913297077294
7.657657657657658,0.23625211833346077,0.23743882034643515,0.045643695189041336
7.672672672672673,0.24375390183591064,0.24498012896727783,0.045923307186808454
7.687687687687688,0.25139148527788324,0.252660319579951,0.04618626635451594
7.702702702702703,0.25910009734822587,0.2604144218393842,0.04643271736474752
7.717717717717718,0.2668162786996751,0.2681784716974,0.04666434488447024
7.732732732732733,0.27447830638807874,0.27588994899269165,0.046883968804790045
7.747747747747748,0.2820265096069528,0.2834881202944028,0.04709507309684778
7.762762762762763,0.2894034787408987,0.2909142870683526,0.0473013047070709
7.777777777777778,0.29655417732668454,0.2981119462364196,0.04750598196312004
7.792792792792793,0.30342597340261246,0.3050268767931939,0.04771165193238486
7.807807807807808,0.3099686124580978,0.3116071718223527,0.0479197324533492
7.822822822822823,0.31613415841108294,0.31780323961742585,0.04813026705425816
7.837837837837838,0.32187693152491925,0.32356780038224264,0.04834181028152515
7.852852852852853,0.3271534728377877,0.3288559060143074,0.04855144836047363
7.867867867867868,0.3319225635241562,0.33362500971531966,0.048754947332476935
7.882882882882883,0.3361453247126466,0.3378351096631636,0.048947009647352185
7.897897897897898,0.33978541875968093,0.3414489868096021,0.04912161207601328
7.912912912912913,0.3428093669557033,0.34443255116288274,0.04927239352721651
7.927927927927928,0.34518699127189606,0.3467553038285225,0.04939306092994563
7.942942942942943,0.34689197922434845,0.3483909138053168,0.0494777841604266
7.957957957957958,0.3479025614848936,0.34931789931742485,0.04952155603237992
7.972972972972973,0.3482022818446008,0.3495203936477749,0.04952049949759724
7.987987987987988,0.34778082900856333,0.34898896548705605,0.04947211040561354
8.003003003003004,0.34663489009036025,0.34772145433464924,0.04937542968901908
8.018018018018019,0.34476897734983175,0.3457237732376125,0.049231143224901616
8.033033033033034,0.342196173554734,0.3430106249987586,0.04904161071169486
8.048048048048049,0.33893873825235216,0.3396060748343926,0.048810826768937325
8.063063063063064,0.33502851803275846,0.33554392315644993,0.0485443183633372
8.078078078078079,0.3305071091464749,0.33086782732251213,0.048248982951429244
8.093093093093094,0.3254257308284734,0.32563113110955844,0.04793287183195824
8.108108108108109,0.3198447821086332,0.31989637510146407,0.04760492355313646
8.123123123123124,0.3138330729298962,0.3137344793452059,0.047274653202572056
8.138138138138139,0.307466740687801,0.30722361017353145,0.04695180528090959
8.153153153153154,0.300827884066337,0.30044776420409114,0.04664598068661379
8.168168168168169,0.29400296527804665,0.2934951221484432,0.04636625191653069
8.183183183183184,0.28708104757391906,0.2864562411660998,0.04612078441310137
8.198198198198199,0.2801519455537154,0.2794221653706815,0.04591648529282734
8.213213213213214,0.27330437033250127,0.27248253861591737,0.04575870254892599
8.228228228228229,0.26662414967768006,0.2657238014965369,0.045650997368013646
8.243243243243244,0.26019259525199673,0.25922754603516546,0.04559500888502079
8.258258258258259,0.2540850761767662,0.2530690879474472,0.04559042451408481
8.273273273273274,0.24836984183994507,0.24731629935219138,0.04563506057176969
8.288288288288289,0.24310711901870266,0.24202872623192026,0.04572504844116603
8.303303303303304,0.23834849074307146,0.23725699672430997,0.04585511247450409
8.318318318318319,0.23413654842578088,0.2330425100318778,0.04601891856040434
8.333333333333334,0.23050479575404886,0.22941738253089994,0.046209467713504176
8.348348348348349,0.2274777733425205,0.22640461818594348,0.04641950748053137
8.363363363363364,0.22507136737977892,0.2240184647829521,0.046641935094757385
8.378378378378379,0.2232932632632645,0.22226491551590766,0.046870169423621405
8.393393393393394,0.22214350601240176,0.2211423165352732,0.047098472949406237
8.408408408408409,0.22161513239801706,0.22064204445478774,0.0473222094820318
8.423423423423424,0.221694844471839,0.22074922272375241,0.04753802744791983
8.438438438438439,0.2223636997775838,0.2214434514463766,0.047743962162979534
8.453453453453454,0.22359779930244805,0.22269953100610598,0.04793945351898378
8.468468468468469,0.2253689596251996,0.2244881652011036,0.0481252782699951
8.483483483483484,0.22764536030888188,0.22677663413348637,0.048303399020367926
8.498498498498499,0.2303921610896179,0.22952943058154207,0.04847673552781935
8.513513513513514,0.23357208568876148,0.23270885592129603,0.048648868359667814
8.528528528528529,0.23714597012514932,0.23627557287783277,0.04882369032020004
8.543543543543544,0.2410732733619052,0.24018911261720782,0.04900502704488598
8.558558558558559,0.24531254724308119,0.24440833317316538,0.04919625391697283
8.573573573573574,0.24982186131266462,0.2488918252528024,0.04939994079397801
8.588588588588589,0.2545591766797411,0.2535982604452523,0.04961755755509944
8.603603603603604,0.2594826620350284,0.2584866761447606,0.04984927100938076
8.618618618618619,0.2645509446329831,0.2635166914418828,0.05009385666487333
8.633633633633634,0.26972328983138194,0.2686486491044549,0.05034873761272714
8.64864864864865,0.2749597047795202,0.27384368071306436,0.050610148703628025
8.663663663663664,0.2802209650397598,0.2790636950314447,0.05087340944141709
8.67867867867868,0.2854685671043912,0.28427129361606734,0.05113327602274606
8.693693693693694,0.2906646145628158,0.28942962219114304,0.051384333831049164
8.70870870870871,0.2957716506147237,0.29450217102123616,0.05162138777409771
8.723723723723724,0.3007524542150105,0.29945254194562565,0.051839809453234145
8.73873873873874,0.30556982092184254,0.30424420345983205,0.052035806650599856
8.753753753753754,0.31018635214988616,0.30884025788314706,0.05220659075124456
8.76876876876877,0.31456427779257967,0.31320324599652155,0.05235042992565291
8.783783783783784,0.31866533699774635,0.31729501446221503,0.05246658865586189
8.7987987987988,0.3224507403056981,0.32107666985119176,0.05255516618545319
8.813813813813814,0.32588123351264225,0.32450864029727394,0.05261685669030249
8.82882882882883,0.32891727966410056,0.3275508618062372,0.052652661656180266
8.843843843843844,0.33151937067007087,0.3301631012224116,0.052663589590036905
8.85885885885886,0.33364847430089256,0.33230542193409357,0.052650379458029355
8.873873873873874,0.33526661588245354,0.33393879170779917,0.05261328201332818
8.88888888888889,0.3363375869719616,0.3350258247075954,0.052551927576399954
8.903903903903904,0.3368277658024552,0.33553164193861806,0.05246530028066608
8.91891891891892,0.33670702654913354,0.3354248262818661,0.05235182802547396
8.933933933933934,0.33594970681403363,0.3346784402923671,0.05220958537203864
8.94894894894895,0.33453559559650997,0.33327106747250945,0.05203659450614618
8.963963963963964,0.3324508979887557,0.3311878313890141,0.051831198298906624
8.97897897897898,0.32968912857177235,0.32842134245180327,0.05159247040630885
8.993993993993994,0.32625188367398145,0.3249725201219739,0.051320621017144005
9.00900900900901,0.322149443905107,0.32085123940688515,0.051017353810095915
9.024024024024024,0.3174011631191828,0.3160767551981592,0.05068613025587947
9.03903903903904,0.31203560832307253,0.31067786648633205,0.050332301832793004
9.054054054054054,0.30609042677764314,0.3046927945292917,0.04996307917990307
9.06906906906907,0.2996119309625312,0.29816876400865894,0.04958731974531851
9.084084084084084,0.29265440812058924,0.2911612930040053,0.04921513187924824
9.0990990990991,0.2852791773932364,0.28373321484025954,0.04885731281402865
9.114114114114114,0.27755343259206006,0.2759534709336227,0.0485246589632234
9.12912912912913,0.2695489209726841,0.2678957271198614,0.04822720682086119
9.144144144144144,0.26134051679343273,0.259636875286674,0.047973477903015635
9.15915915915916,0.2530047521946298,0.25125548657727115,0.047769807813244115
9.174174174174174,0.24461836679967114,0.24283028167456241,0.04761983462433482
9.18918918918919,0.23625693174461707,0.23443867800017507,0.04752420447117605
9.204204204204204,0.2279935944017638,0.22615546389173252,0.0474805246847266
9.21921921921922,0.21989797803555736,0.21805163717373235,0.04748356202282831
9.234234234234235,0.21203525734743914,0.2101934314369917,0.047525652240972174
9.24924924924925,0.20446541765001164,0.20264153922007103,0.047597263620506
9.264264264264265,0.19724269341153566,0.19545052840279897,0.047687645004028494
9.27927927927928,0.19041517200265143,0.18866843743843315,0.04778548897723085
9.294294294294295,0.18402454120049944,0.18233652716557644,0.04787955077096992
9.30930930930931,0.17810595457184158,0.17648916208652188,0.04795917928252073
9.324324324324325,0.17268798718861902,0.17115379208745377,0.0480147342112796
9.33933933933934,0.16779265492763992,0.16635100627660773,0.04803787947311155
9.354354354354355,0.16343547342926407,0.16209463344243574,0.04802175597119348
9.36936936936937,0.15962553712674585,0.15839186802756494,0.04796104590503311
9.384384384384385,0.15636560408845152,0.15524340591658486,0.047851946417178444
9.3993993993994,0.15365217825379726,0.15264358023427577,0.04769207325975696
9.414414414414415,0.15147558656377372,0.15058049330760154,0.0474803161280091
9.42942942942943,0.14982005413037736,0.1490361466045816,0.04721666702193719
9.444444444444445,0.14866378566438412,0.147986575548583,0.04690204188752627
9.45945945945946,0.14797906565317281,0.14740200040406115,0.04653811404865005
9.474474474474475,0.1477323930599847,0.14724700777201574,0.04612717558591187
9.48948948948949,0.1478846684476482,0.14748077948303906,0.045672039768470785
9.504504504504505,0.1483914522843603,0.14805738671307203,0.04517599380176519
9.51951951951952,0.1492033126631413,0.1489261668654887,0.0446428064698512
9.534534534534535,0.15026627868763304,0.150032199074037,0.044076789771777564
9.54954954954955,0.1515224123163233,0.1513168910274449,0.043482907537853534
9.564564564564565,0.15291050654921715,0.15271868519559895,0.042866917541452616
9.57957957957958,0.1543669116043435,0.15417388652956465,0.04223552718341492
9.594594594594595,0.15582648339223978,0.15561760650646225,0.041596536919447744
9.60960960960961,0.15722364050343982,0.15698481032501946,0.0409589408607043
9.624624624624625,0.15849350755320257,0.1582114456053391,0.04033295121846716
9.63963963963964,0.159573114669562,0.15923562272106487,0.03972991352769561
9.654654654654655,0.16040261583501683,0.1599988096084658,0.03916208413119409
9.66966966966967,0.16092648339074409,0.16044699830692694,0.03864225154876176
9.684684684684685,0.16109463292365483,0.16053179729142403,0.03818320002569193
9.6996996996997,0.16086343248014853,0.1602114034133754,0.037797036558521444
9.714714714714715,0.16019655286464807,0.15945141028164644,0.03749442980917813
9.72972972972973,0.15906562168030422,0.1582254161828677,0.037283835683637745
9.744744744744745,0.1574506524353344,0.15651540380203377,0.037170802865299425
9.75975975975976,0.15534023085402626,0.15431187537086632,0.037157454818030976
9.774774774774775,0.15273145264056417,0.15161373949306453,0.037242228085642634
9.78978978978979,0.14962961935016508,0.1484279586788533,0.037419911279118014
9.804804804804805,0.14604771071069492,0.14476897847049913,0.0376819827380836
9.81981981981982,0.14200566179987553,0.14065796899890093,0.038017199450479044
9.834834834834835,0.1375294812213962,0.13612191717727146,0.03841235687585343
9.84984984984985,0.1326502514228756,0.13119261213549538,0.03885312539022511
9.864864864864865,0.1274030544529394,0.1259055678952119,0.039324874044519516
9.87987987987988,0.12182586594454306,0.12029892595582861,0.03981341084940429
9.894894894894895,0.11595845734879319,0.11441237691328057,0.04030559342998792
9.90990990990991,0.10984134198881206,0.10828613510943688,0.040789788077989324
9.924924924924925,0.10351479497822666,0.10195999428926984,0.041256174866621566
9.93993993993994,0.09701797105318155,0.09547248595182592,0.041696910064052364
9.954954954954955,0.0903881384125328,0.08886015603067954,0.04210616491489749
9.96996996996997,0.08366004113101654,0.08215697008903954,0.042480063214907916
9.984984984984985,0.07686539783988024,0.07539385256146587,0.04281654045079471
10,0.07003254024982672,0.06859836176631245,0.043115145885980796
10.015015015015015,0.06318619168910063,0.061794499376233984,0.04337680676543876
10.03003003003003,0.056347383018787556,0.05500265060799649,0.04360357136279616
10.045045045045045,0.04953350088519079,0.048239649370064926,0.04379834519767962
10.06006006006006,0.042758461073873,0.041518960770894474,0.043964632517472554
10.075075075075075,0.036032997556938375,0.034850971551884255,0.04410629306015924
10.09009009009009,0.029365055536933794,0.02824337702949678,0.044227322139588465
10.105105105105105,0.022760274320859784,0.02170165094825236,0.0443316601636383
10.12012012012012,0.01622254322528521,0.015229582283366619,0.044423035776665884
10.135135135135135,0.00975461102747303,0.008829860599519948,0.044504844914973835
10.15015015015015,0.003358726929617734,0.002504689259947549,0.0445800662182242
10.165165165165165,-0.002962711150793317,-0.003743596165005523,0.04465121151487382
10.18018018018018,-0.009206526622974293,-0.00991192824367055,0.044720308567096904
10.195195195195195,-0.015368178761296864,-0.01599595113347757,0.04478891198433855
10.21021021021021,-0.02144124720960602,-0.021989530763359084,0.044858137244012754
10.225225225225225,-0.0274170098817085,-0.0278843534095997,0.044928712128536503
10.24024024024024,-0.033284134284398054,-0.03366963111261519,0.04500103962775255
10.255255255255255,-0.03902849764183649,-0.03933192804682413,0.04507526648956824
10.27027027027027,-0.044633145570448576,-0.0448551167526141,0.04515135214804423
10.285285285285285,-0.05007839282045908,-0.05022046742366338,0.04522913371639821
10.3003003003003,-0.0553420632174591,-0.05540686762998408,0.04530838406116205
10.315315315315315,-0.06039985987773529,-0.060391164370362425,0.045388861570680616
10.33033033033033,-0.06522585146583783,-0.06514861556440485,0.045470351923050066
10.345345345345345,-0.06979305604646259,-0.0696534342972594,0.045552703710572406
10.36036036036036,-0.0740741011518215,-0.07387940647546064,0.04563586092382807
10.375375375375375,-0.07804193707916333,-0.07780056105601264,0.04571989578895529
10.39039039039039,-0.08167058003611559,-0.08139187155567053,0.04580504510732879
10.405405405405405,-0.08493586232226875,-0.08462996791032723,0.04589175200621305
10.42042042042042,-0.08781616795002913,-0.08749383864785404,0.0459807129588265
10.435435435435435,-0.09029313361581567,-0.08996550445924728,0.0460729273133535
10.45045045045045,-0.09235229641584121,-0.09203064533631332,0.04616974375852776
10.465465465465465,-0.09398367092583595,-0.09367916430500124,0.04627289561851876
10.48048048048048,-0.09518223912421439,-0.09490567135357321,0.046384515119573526
10.495495495495495,-0.09594833717647608,-0.09570987150043858,0.0465071162822289
10.51051051051051,-0.09628792351044807,-0.09609684126764072,0.04664353723629132
10.525525525525525,-0.09621271322416314,-0.09607717843459913,0.04679683571404564
10.54054054054054,-0.09574016509468403,-0.09566701122353673,0.04697013616764491
10.555555555555555,-0.09489330973262051,-0.09488785540164017,0.04716643297214988
10.57057057057057,-0.0937004111301855,-0.0937663114978235,0.04738836077009608
10.585585585585585,-0.09219445921159937,-0.09233359960310476,0.04763794916175739
10.6006006006006,-0.09041249802066523,-0.09062493602097065,0.04791638349760784
10.615615615615615,-0.08839480259939994,-0.08867876406982189,0.04822379545015391
10.63063063063063,-0.08618392685705617,-0.08653586006251543,0.04855910568427352
10.645645645645645,-0.08382365397507532,-0.0842383441225168,0.04891993627474795
10.66066066066066,-0.08135788914570616,-0.08182863312807032,0.04930260319966004
10.675675675675675,-0.0788295406723866,-0.07934837877753097,0.04970219051537579
10.69069069069069,-0.0762794387684427,-0.07683743674344828,0.05011269923043777
10.705705705705705,-0.0737453411613813,-0.07433291260044064,0.05052725688873365
10.72072072072072,-0.0712610706301196,-0.0718683265107214,0.0509383694602729
10.735735735735735,-0.06885582211598147,-0.06947293178004323,0.05133819570727292
10.75075075075075,-0.06655366673147654,-0.06717121298707544,0.05171882550287031
10.765765765765765,-0.06437326785246304,-0.06498257836172486,0.05207254692329323
10.78078078078078,-0.062327811706088594,-0.06292124951406484,0.05239209138500097
10.795795795795796,-0.06042514264768469,-0.06099634056089564,0.052670850746757605
10.81081081081081,-0.058668082682477356,-0.05921210907808889,0.052903064418958146
10.825825825825826,-0.057054906479804414,-0.05756835378738543,0.053083977655736046
10.84084084084084,-0.055579937554977574,-0.05606092882503224,0.05320997414192398
10.855855855855856,-0.05423422852475781,-0.05468234189338778,0.05327868671951074
10.87087087087087,-0.05300628815888931,-0.05342240336654626,0.053289089747449225
10.885885885885886,-0.05188281993403905,-0.05226889512688922,0.053241575338914944
10.9009009009009,-0.050849440424931384,-0.051208231073059725,0.05313801377737148
10.915915915915916,-0.049891350599887335,-0.050226085361903074,0.052981795987826645
10.93093093093093,-0.048993938432426165,-0.04930796906732436,0.052777853254071215
10.945945945945946,-0.0481432967926729,-0.04843974067495964,0.052532646681367694
10.96096096096096,-0.047326646038050285,-0.04760804039435986,0.052254116525493076
10.975975975975976,-0.04653265587053172,-0.04680064246448989,0.05195157985232583
10.99099099099099,-0.04575166572706942,-0.04600672333805906,0.05163556456551465
11.006006006006006,-0.04497580712541124,-0.04521704680011107,0.05131756922119279
11.02102102102102,-0.04419903492584383,-0.04442406969021166,0.05100974179796154
11.036036036036036,-0.04341707732316442,-0.04362197396025726,0.05072447708808803
11.05105105105105,-0.04262731648596327,-0.042806632323655336,0.05047394159702094
11.066066066066066,-0.04182861305157732,-0.04197551574912736,0.05026954610748811
11.08108108108108,-0.04102108812301335,-0.041127551535707414,0.05012139789061421
11.096096096096096,-0.04020587599185474,-0.04026294069005902,0.050037774672024436
11.11111111111111,-0.03938485957216442,-0.039382942839135765,0.05002466823864536
11.126126126126126,-0.038560398578098835,-0.03848963599563226,0.05008544467499171
11.14114114114114,-0.037735057976776926,-0.037585657222075367,0.05022065950095258
11.156156156156156,-0.03691134141456428,-0.03667392871320236,0.05042805014566542
11.17117117117117,-0.03609143140064618,-0.03575737216584261,0.05070270787286014
11.186186186186186,-0.03527693529910857,-0.03483861268369271,0.051037410417424336
11.2012012012012,-0.034468633877952605,-0.03391967203514414,0.05142307928702154
11.216216216216216,-0.03366622750086351,-0.033001650006139756,0.05184931493898336
11.23123123123123,-0.032868074179354764,-0.03208439200788944,0.05230496004594587
11.246246246246246,-0.03207091371622621,-0.031166141117943687,0.052778645126531284
11.26126126126126,-0.031269573082952286,-0.030243173413659327,0.05325927994029718
11.276276276276276,-0.030456649934166254,-0.02930941680812426,0.05373646573651469
11.29129129129129,-0.029622173665250336,-0.02835605557508519,0.05420081543878191
11.306306306306306,-0.028753246513079082,-0.027371125256586637,0.054644179521012526
11.32132132132132,-0.027833670703536286,-0.026339105548800014,0.05505978380181977
11.336336336336336,-0.026843571364016373,-0.025240521891825185,0.05544229137994914
11.35135135135135,-0.02575902864160812,-0.024051569664695974,0.0557878045694625
11.366366366366366,-0.0245517360005696,-0.022743777919137585,0.056093824267180244
11.381381381381381,-0.023188704831691685,-0.021283732292271262,0.05635918402747891
11.396396396396396,-0.021632038124647545,-0.01963287895025673,0.056583974519682785
11.411411411411411,-0.01983879788505695,-0.0177474329798985,0.05676947123002172
11.426426426426426,-0.01776099209064288,-0.01557841542859902,0.05691807443244824
11.441441441441441,-0.015345707157823005,-0.013071843072935251,0.05703326577744578
11.456456456456456,-0.012535411018852997,-0.010169093857418815,0.05711958056278694
11.471471471471471,-0.009268449875163303,-0.006807468672172907,0.05718258916289807
11.486486486486486,-0.005479758370982716,-0.0029209666105835886,0.05722887562624508
11.501501501501501,-0.0011017981890634326,0.0015587140599328652,0.05726599666440795
11.516516516516516,0.0039342662290382125,0.006700943389810174,0.057302400861784536
11.531531531531531,0.00969715411187361,0.012574697882859276,0.05734728676587845
11.546546546546546,0.016253825933025722,0.019246881094274564,0.05741038045501583
11.561561561561561,0.023667632571552934,0.026780449712184646,0.05750161898367779
11.576576576576576,0.03199628947682091,0.03523238068450194,0.0576307361521334
11.591591591591591,0.041289723372010895,0.0446515283952042,0.05780676099253076
11.606606606606606,0.05158785361008211,0.055076434548990236,0.058037455827803536
11.621621621621621,0.06291838436662076,0.06653316633266944,0.0583287371968908
11.636636636636636,0.07529469615405188,0.0790332693834936,0.05868413588173051
11.651651651651651,0.0887139341899698,0.09257192973869889,0.05910435804710551
11.666666666666666,0.10315539538477632,0.10712644186236421,0.05958700533398859
11.681681681681681,0.11857931368404342,0.12265507679214532,0.060126496857339846
11.696696696696696,0.13492613412724283,0.13909643453584902,0.06071421232186369
11.711711711711711,0.1521163488061246,0.15636934777957942,0.061338847175783265
11.726726726726726,0.17005094330046167,0.17437338021016016,0.061986943480006884
11.741741741741741,0.18861247147209909,0.19298993361619388,0.06264353932104647
11.756756756756756,0.20766674198156382,0.21208394553237903,0.06329286879364864
11.771771771771771,0.2270650645683877,0.2315061262719339,0.06391904501896786
11.786786786786786,0.24664697140860992,0.2510956538033534,0.06450666912803471
11.801801801801801,0.2662433020543974,0.2706832200288135,0.06504132565414932
11.816816816816816,0.28567952231926114,0.2900943050547639,0.06550994552754426
11.831831831831831,0.3047791397374165,0.3091525485702287,0.06590103806160992
11.846846846846846,0.3233670813516459,0.32768308990429584,0.06620480984484381
11.861861861861861,0.3412729126755879,0.34551575997874284,0.0664131992555701
11.876876876876876,0.3583337976539443,0.3624880274078257,0.06651985957414068
11.891891891891891,0.37439712539595377,0.3784476248636031,0.06652012174137312
11.906906906906906,0.38932275711204667,0.3932548075913555,0.06641096102769396
11.921921921921921,0.40298487290220564,0.40678422075404186,0.06619098216473752
11.936936936936936,0.4152734202522606,0.4189263736816218,0.06586042695613438
11.951951951951951,0.4260951825781215,0.42958873540756,0.06542119890201921
11.966966966966966,0.43537449620402696,0.43869647628490727,0.06487689228756802
11.981981981981981,0.44305364802751435,0.44619288507977195,0.06423280917707201
11.996996996996996,0.4490929848804404,0.45203949061462195,0.06349594686017647
12.012012012012011,0.4534707608677913,0.45621591322239596,0.06267494007032853
12.027027027027026,0.4561827426371176,0.4587194657224461,0.0617799460241985
12.042042042042041,0.45724158644312496,0.4595645181096247,0.06082246524891088
12.057057057057056,0.45667599656475916,0.4587816361883233,0.05981509661515722
12.072072072072071,0.4545296731530507,0.45641650307094295,0.05877123051857542
12.087087087087086,0.450860059382107,0.45252863431023144,0.05770468948850094
12.102102102102101,0.44573690267168165,0.4471899023524958,0.05662933052368401
12.117117117117116,0.43924065203271373,0.4404828933310386,0.055558628046583416
12.132132132132131,0.4314607221458107,0.4324991278879018,0.05450526031028901
12.147147147147146,0.4224936633043248,0.42333718640205187,0.05348072496501541
12.162162162162161,0.41244128353659487,0.41310078637885217,0.05249501067135403
12.177177177177176,0.40140877397186725,0.40189686467072683,0.05155635042152231
12.192192192192191,0.389502890091585,0.3898337188564806,0.0506710780191688
12.207207207207206,0.3768302396119494,0.3770192601615017,0.04984360180732678
12.222222222222221,0.36349572252053775,0.36355942487889037,0.049076499694388445
12.237237237237236,0.3496011607736984,0.3495567828963434,0.0483707279724685
12.252252252252251,0.33524414516482237,0.3351093714950351,0.04772592502366129
12.267267267267266,0.320517115852771,0.320309771077488,0.04714078156226535
12.282282282282281,0.3055066819583365,0.3052444279282678,0.04661344302005563
12.297297297297296,0.29029317534916654,0.28999321842648923,0.046141907799409014
12.312312312312311,0.27495042490413957,0.27462924001844546,0.0457243873150055
12.327327327327327,0.25954573060699204,0.25921880717270906,0.04535959923805791
12.342342342342342,0.24414001195725438,0.24382162566771434,0.04504697298141104
12.357357357357357,0.22878810238108369,0.22849111585821863,0.044786755026318265
12.372372372372372,0.2135391603815172,0.2132748548032814,0.04458001024353668
12.387387387387387,0.1984371687755615,0.19821510796187464,0.04442852331161585
12.402402402402402,0.18352149514944852,0.1833494231574678,0.044334611406210984
12.417417417417417,0.16882748923151014,0.16871126225392047,0.044300865413174045
12.432432432432432,0.15438709586478627,0.1543306490775697,0.04432984188384613
12.447447447447447,0.14022946533767688,0.14023481523047432,0.044423731551676136
12.462462462462462,0.12638154574591334,0.12644882831085447,0.0445840320659773
12.477477477477477,0.11286864463215332,0.11299618951650797,0.044811252227477234
12.492492492492492,0.09971494927525985,0.09989938956644971,0.045104672132433986
12.507507507507507,0.0869439966452989,0.08718041332295504,0.045462178294306974
12.522522522522522,0.07457908523032077,0.07486118448416208,0.04588018552658802
12.537537537537537,0.0626436217558551,0.06296394235205992,0.04635364908400125
12.552552552552552,0.05116139637336783,0.0515115431037583,0.046876162461839205
12.567567567567567,0.040156780327338513,0.040527678365932435,0.047440129489885255
12.582582582582582,0.029654840565716763,0.03003700437473799,0.048036994749244874
12.597597597597597,0.01968136637002102,0.020065175741731608,0.04865751421431677
12.612612612612612,0.010262803961717658,0.010638778954984086,0.049292048197172054
12.627627627627627,0.001426096271030438,0.0017851622962075737,0.04993086058441325
12.642642642642642,-0.006801573324820355,-0.006467839125833562,0.05056441126052086
12.657657657657657,-0.014393132471642808,-0.014092282061099635,0.051183631775304446
12.672672672672672,-0.021322063316898707,-0.021060593514506575,0.05178017716377758
12.687687687687687,-0.02756293211853595,-0.02734614171612354,0.05234664901913878
12.702702702702702,-0.03309199620523783,-0.03292388923256195,0.05287678633594174
12.717717717717717,-0.03788787647687388,-0.037771114443123525,0.053365621347446685
12.732732732732732,-0.041932280562062704,-0.04186818433102567,0.05380959776639052
12.747747747747747,-0.04521075873106361,-0.04519935844707367,0.054206648749311734
12.762762762762762,-0.04771347179090003,-0.0477536010937502,0.054556231797759244
12.777777777777777,-0.04943594756748104,-0.0495253763546472,0.054859317916266956
12.792792792792792,-0.05037980032432573,-0.05051539866888621,0.055118332850701744
12.807807807807807,-0.05055338572144796,-0.05073131035100933,0.0553370492552244
12.822822822822824,-0.04997236285224662,-0.05018825693350035,0.05552043023679298
12.837837837837839,-0.04866013470906358,-0.048909331629314635,0.05567442688207553
12.852852852852854,-0.0466481393327493,-0.04692586174864268,0.0558057349795388
12.867867867867869,-0.04397596610447067,-0.044277512713487455,0.05592151902033924
12.882882882882884,-0.04069127530635293,-0.04101218950410526,0.05602911442609468
12.897897897897899,-0.036849504301722964,-0.03718572097090329,0.05613572147963202
12.912912912912914,-0.03251335044080332,-0.03286131937081048,0.056248106273266284
12.927927927927929,-0.027752028912510003,-0.028108815523339593,0.056372324815208395
12.942942942942944,-0.02264031290418157,-0.02300367877696001,0.0565134860151737
12.957957957957959,-0.01725737310880708,-0.01762584005852482,0.0566755675112353
12.972972972972974,-0.011685443218769074,-0.012058345090674312,0.056861295270132846
12.987987987987989,-0.006008346882165154,-0.006385872817809796,0.057072093811558734
13.003003003003004,-3.099289937324808e-4,-6.931606285941173e-4,0.057308109098852145
13.018018018018019,0.005327560443338282,0.004936617350355054,0.05756830097846506
13.033033033033034,0.010825078741451666,0.010423470087978701,0.05785059691434721
13.048048048048049,0.01610834784883451,0.015692158553592357,0.05815209400869173
13.063063063063064,0.021109307544952462,0.020673666575769304,0.05846929227647363
13.078078078078079,0.025767420190375832,0.025306530419208672,0.058798339211308524
13.093093093093094,0.0300307892663887,0.029537989291198934,0.059135264230364935
13.108108108108109,0.03385706175672975,0.033324925562388405,0.05947618199545376
13.123123123123124,0.03721409287508903,0.036634570742489575,0.05981744617241838
13.138138138138139,0.04008036015262417,0.039444960801472605,0.06015574001622456
13.153153153153154,0.04244512201423344,0.04174513197293769,0.06048809705599703
13.168168168168169,0.04430832339287374,0.04353505552519814,0.060811853526208215
13.183183183183184,0.04568025752372363,0.04482531703695706,0.0611245430929749
13.198198198198199,0.04658099882878303,0.04563655243046949,0.06142375262302715
13.213213213213214,0.04703962684216883,0.04599865937803848,0.06170696391545839
13.228228228228229,0.047093265562461364,0.045949808667080774,0.0619714093135627
13.243243243243244,0.04678596655018845,0.04553528558856841,0.062213968226551446
13.258258258258259,0.04616746754527363,0.04480619623630368,0.06243112674976479
13.273273273273274,0.04529186129923809,0.04381807753919256,0.06261901441552668
13.288288288288289,0.04421621155131142,0.042629452628229245,0.06277352187983784
13.303303303303304,0.042999154417945606,0.041300374503712094,0.06289049265293264
13.318318318318319,0.04169952368759422,0.0398910007113459,0.06296597243599901
13.333333333333334,0.040375037428270755,0.038460239753573676,0.06299649255201928
13.348348348348349,0.039081080817586836,0.03706450628105017,0.06297936014787109
13.363363363363364,0.03786961620190344,0.03575661689671118,0.06291292748088338
13.378378378378379,0.03678824621966605,0.034584851959927915,0.06279681532322486
13.393393393393394,0.03587944964077336,0.03359220149848795,0.06263207057698453
13.408408408408409,0.03518000272857777,0.03281580567384668,0.062421244669331105
13.423423423423424,0.03472059182559595,0.032286592656917044,0.062168386280369935
13.438438438438439,0.034525615906272324,0.032029109671913976,0.06187894868487389
13.453453453453454,0.034613171401361664,0.03206153668961655,0.06155961792200155
13.468468468468469,0.03499520597893201,0.03239586703257808,0.06121807283455287
13.483483483483484,0.03567782337490403,0.033038235118616116,0.06086269162852761
13.498498498498499,0.03666171791082841,0.033989368739205696,0.06050222201985213
13.513513513513514,0.03794271503424268,0.03524514158550745,0.0601454333550841
13.528528528528529,0.03951239300508477,0.03679720107442274,0.059800769427681325
13.543543543543544,0.04135876060983248,0.03863364673040582,0.059476020147415584
13.558558558558559,0.043466966356804033,0.04073973527071487,0.05917802880630086
13.573573573573574,0.04582001581951758,0.043098589949994,0.0589124494434592
13.588588588588589,0.048399475480146,0.04569189348812699,0.05868356577516587
13.603603603603604,0.05118614342716118,0.048500545900983634,0.058494179405780236
13.618618618618619,0.05416066944993841,0.05150527067356207,0.058345570734927896
13.633633633633634,0.05730410934840964,0.054687154886141676,0.058237531386687066
13.64864864864865,0.06059840057144366,0.058028111084113265,0.05816846244700967
13.663663663663664,0.06402674858181204,0.06151125085851589,0.05813552868040861
13.67867867867868,0.06757391562083745,0.06512116229232635,0.05813485555762735
13.693693693693694,0.07122640584612881,0.06884408566743305,0.0581617536390751
13.70870870870871,0.07497254320179796,0.07266798417908235,0.05821095379405919
13.723723723723724,0.07880244093108067,0.07658250894050565,0.0582768369524804
13.73873873873874,0.08270786444128873,0.0805788603528697,0.05835364355081521
13.753753753753754,0.0866819923548988,0.0846495510220768,0.05843565045000912
13.76876876876877,0.09071908407155936,0.08878807884783915,0.05851730672558092
13.783783783783784,0.09481406601302454,0.09298852266124898,0.05859332416970309
13.7987987987988,0.09896205283865786,0.09724507674096923,0.05865872334305248
13.813813813813814,0.10315782412064232,0.10155154450459009,0.05870884121131224
13.82882882882883,0.10739528096990611,0.10590081537005812,0.058739311311241826
13.843843843843844,0.11166691052544522,0.11028435185298574,0.058746031407612025
13.85885885885886,0.11596328861325161,0.11469171600028634,0.05872513605418332
13.873873873873874,0.12027265178062928,0.11911016484785582,0.05867299173606191
13.88888888888889,0.12458056890232377,0.12352434337857751,0.05858622992365641
13.903903903903904,0.1288697393517137,0.1279161002233002,0.05846182834159079
13.91891891891892,0.1331199392552984,0.13226444605896762,0.05829724344411457
13.933933933933934,0.13730812978766926,0.1365456675163253,0.058090588364220645
13.94894894894895,0.14140873228789755,0.14073360086166276,0.05784084171320056
13.963963963963964,0.1453940649158086,0.14480006042637897,0.05754806496200066
13.97897897897898,0.14923492552790593,0.14871540753452245,0.05721360104603243
13.993993993993994,0.15290129641048106,0.15244923737553712,0.05684022525745615
14.00900900900901,0.15636313935671833,0.15597115466655057,0.05643222184922825
14.024024024024024,0.15959124499852467,0.1592516046387603,0.0559953659059132
14.03903903903904,0.16255809867072252,0.16226272418804216,0.0555367992279472
14.054054054054054,0.16523872639978682,0.1649791789614268,0.055064800110452096
14.06906906906907,0.16761148852406485,0.1673789554170193,0.05458845861747734
14.084084084084084,0.16965879433674244,0.1694440819576318,0.054117279828343724
14.0990990990991,0.1713677181907288,0.17116125940345214,0.05366074621036489
14.114114114114114,0.17273050485906974,0.17252238758966443,0.05322787560495267
14.12912912912913,0.17374495881436117,0.17352498105197495,0.05282681249622746
14.144144144144144,0.17441471784140553,0.17417247202561373,0.052464486937447506
14.15915915915916,0.17474941560652235,0.17447440294031086,0.052146368018466165
14.174174174174174,0.174764740281485,0.17444651305380016,0.05187632799989466
14.18918918918919,0.1744823970839254,0.17411072483133402,0.05165662072724506
14.204204204204204,0.17392998185518224,0.17349503531606783,0.05148796552260569
14.21921921921922,0.17314077089451269,0.17263331634075504,0.0513697172642078
14.234234234234235,0.1721534296394548,0.17156502538715568,0.05130009623146449
14.24924924924925,0.17101163990770496,0.17033482663594174,0.051276448248059804
14.264264264264265,0.16976364278852787,0.16899211970971365,0.051295506645397095
14.27927927927928,0.16846169236194689,0.1675904722210793,0.05135363186987644
14.294294294294295,0.16716141465067058,0.1661869518778069,0.051447011041321995
14.30930930930931,0.16592106690988423,0.16484135487597704,0.051571807210027125
14.324324324324325,0.16480069475651443,0.16361532983487687,0.05172425538401689
14.33933933933934,0.16386118880689285,0.1625714006642458,0.05190070882650351
14.354354354354355,0.16316324832435264,0.16177189740969053,0.05209764419011643
14.36936936936937,0.16276626656591772,0.16127781101061503,0.05231163754509488
14.384384384384385,0.1627271605372344,0.16114759554289268,0.052539325216991097
14.3993993993994,0.16309917599890486,0.1614359492368227,0.052777363597960696
14.414414414414415,0.16393070594989492,0.16219261254898013,0.05302240079961553
14.42942942942943,0.16526416651440776,0.16346122694731227,0.053271070296302896
14.444444444444445,0.16713497729339447,0.16527830100169413,0.05352001279132435
14.45945945945946,0.16957069310038464,0.1676723301729042,0.05376592780606722
14.474474474474475,0.17259033017014103,0.17066311295054587,0.054005651499311864
14.48948948948949,0.1762039223874751,0.1742612986605935,0.054236252663888825
14.504504504504505,0.18041233225017841,0.17846819171587663,0.054455135447767006
14.51951951951952,0.18520732799064848,0.18327582408969936,0.05466013572124475
14.534534534534535,0.19057192370010528,0.18866729344994057,0.05484959851094144
14.54954954954955,0.1964809647743604,0.19461734998610558,0.05502242652026855
14.564564564564565,0.20290192787959677,0.2010932018069297,0.055178094028950984
14.57957957957958,0.20979589409022495,0.20805549804469828,0.05531662565311257
14.594594594594595,0.21711864671988262,0.215459441342005,0.05543854461609589
14.60960960960961,0.22482184207191142,0.22325597769068106,0.0555447994114148
14.624624624624625,0.2328542018555538,0.23139301168742743,0.05563668032642293
14.63963963963964,0.2411626799298502,0.2398165988162806,0.05571573787928732
14.654654654654655,0.24969356263069065,0.24847207270283034,0.055783713842397546
14.66966966966967,0.25839347031712623,0.25730507355302035,0.05584249258035817
14.684684684684685,0.267210237009452,0.26626245326725306,0.05589407656090967
14.6996996996997,0.27609365422486,0.2752930421333282,0.05594058583119622
14.714714714714715,0.2849960736434581,0.28434827081136194,0.05598427765368144
14.72972972972973,0.2938728705555048,0.29338264898280864,0.05602757984947072
14.744744744744745,0.30268277585845477,0.30235410820626835,0.05607312994822546
14.75975975975976,0.3113880885913249,0.31122422106618086,0.0561238120049146
14.774774774774775,0.31995478367250507,0.3199583116456382,0.05618278374070771
14.78978978978979,0.3283525308159156,0.3285254738549322,0.05625348821313361
14.804804804804805,0.33655464077660907,0.3368985144357302,0.056339646197901785
14.81981981981982,0.3445379543851033,0.34505383680676016,0.05644522757453769
14.834834834834835,0.3522826885304837,0.35297128059340105,0.056574402014391345
14.84984984984985,0.3597722515806483,0.36063392994177085,0.05673147101121252
14.864864864864865,0.3669930388815412,0.36802790177183325,0.05692078467940038
14.87987987987988,0.3739342171099008,0.37514212314362133,0.057146647735329854
14.894894894894895,0.380587504478209,0.3819681050207055,0.05741321967110088
14.90990990990991,0.386946952179758,0.38849971799882366,0.05772441434668797
14.924924924924925,0.3930087310575689,0.3947329740727447,0.05808380409603306
14.93993993993994,0.3987709262997867,0.40066581726050715,0.05849453300294163
14.954954954954955,0.4042333420033924,0.40629792488933564,0.05895924329962564
14.96996996996997,0.40939731669274865,0.4116305205555227,0.05948001793079291
14.984984984984985,0.4142655503066871,0.41666619917649705,0.06005834127740435
15,0.4188419427507567,0.42140876412735456,0.06069507892467873
