PCSB01101/PCSB01101-03_650-01_00-01_00.ppk=Accel World vs. Sword Art Online (3.61+!) [3.65]
PCSG00972/PCSG00972-03_670-01_00-01_02.ppk=METAL MAX Xeno (3.61+!) [3.67]
PCSB01341/PCSB01341-03_690-01_00-01_02.ppk=My Big Sister
PCSB01128/PCSB01128-03_650-01_00-01_01.ppk=Ys VIII: Lacrimosa of DANA (3.61+!) [3.65]
PCSH10116/PCSH10116-03_670-01_00-01_01.ppk=InkSplosion (ENG/CHI/KOR/JPN) (3.61+!) [3.67]
PCSG90296/PCSG90296-03_650-01_00-01_01.ppk=Sen no Hatou, Tsukisome no Kouki (DEMO) (3.61+!) [3.65]
PCSG01114/PCSG01114-03_680-01_00-01_00.ppk=WorldEnd Syndrome (3.61+!) [3.68]
PCSB01114/PCSB01114-03_650-01_00-01_00.ppk=SteamWorld Dig 2 (3.61+!) [3.65]
PCSG90304/PCSG90304-03_650-01_00-01_00.ppk=俺達の世界わ終っている。新世界体験版 (DEMO) (3.61+!) [3.65]
PCSB01203/PCSB01203-03_650-01_00-01_01.ppk=Energy Invasion (3.61+!) [3.65]
PCSE00981/PCSE00981-03_630-01_00-01_01.ppk=Geki Yaba Runner (3.61+!) [3.63]
PCSE01149/PCSE01149-03_680-01_00-01_01.ppk=Night Trap - 25th Anniversary Edition (3.61+!) [3.68]
PCSG00814/PCSG00814-03_630-01_00-01_01.ppk=Bentou no Subarashisa o Ano 2-Tabi 3-Tabi (3.61+!) [3.63]
PCSG90292/PCSG90292-03_650-01_00-01_00.ppk=Ninki Seiyuu no Tsukurikata (DEMO) (3.61+!) [3.65]
PCSE00903/PCSE00903-03_610-01_00-01_00.ppk=Sword Art Online: Hollow Realization (3.61+!) [3.61]
PCSG01106/PCSG01106-03_650-01_00-01_00.ppk=Kamidanomi Shisugite Ore no Mirai ga Yabai (3.61+!) [3.65]
PCSG01128/PCSG01128-03_670-01_00-01_02.ppk=Super Robot Taisen X
PCSG01073/PCSG01073-03_650-01_00-01_01.ppk=Gintama Rumble (3.61+!) [3.65]
PCSG00716/PCSG00716-03_630-01_00-01_01.ppk=Clover Day's: Making for Happiness (3.61+!) [3.63]
PCSH10119/PCSH10119-03_670-01_00-01_01.ppk=36 Fragments of Midnight (ENG/CHI/KOR) (3.61+!) [3.67]
PCSB01130/PCSB01130-03_650-01_00-01_01.ppk=Danganronpa V3: Killing Harmony (DEMO) (3.61+!) [3.65]
PCSG01082/PCSG01082-03_630-01_00-01_01.ppk=DYING: Reborn (3.61+!) [3.63]
PCSG01178/PCSG01178-03_670-01_00-01_00.ppk=NadeRevo! Nadeshiko Revolution (3.61+!) [3.67]
PCSB01190/PCSB01190-03_670-01_00-01_00.ppk=Reverie (3.61+!) [3.67]
PCSB01066/PCSB01066-03_630-01_00-01_01.ppk=Akiba's Beat (3.61+!) [3.63]
PCSB01015/PCSB01015-03_630-01_00-01_01.ppk=Talisman: Digital Edition (3.61+!) [3.63]
PCSG00960/PCSG00960-03_630-01_00-01_02.ppk=Ken ga Kimi: Momoyo Tsuzuri (3.61+!) [3.63]
PCSE01081/PCSE01081-03_650-01_00-01_01.ppk=Twin Robots (3.61+!) [3.65]
PCSG00920/PCSG00920-03_630-01_00-01_03.ppk=Super Robot Taisen V (3.61+!) [3.63]
PCSB01024/PCSB01024-03_610-01_00-01_00.ppk=Tokyo Twilight Ghost Hunters: Daybreak Special Gigs (3.61+!) [3.61]
PCSG00957/PCSG00957-03_630-01_00-01_01.ppk=Garou: Mark of the Wolves (3.61+!) [3.63]
PCSH00287/PCSH00287-03_630-01_00-01_03.ppk=Crypt of the Necrodancer (3.61+!) [3.63]
PCSB01232/PCSB01232-03_680-01_00-01_02.ppk=Ice Cream Surfer (3.61+!) [3.68]
PCSB00934/PCSB00934-03_610-01_00-01_02.ppk=Space Overlords (3.61+!) [3.61]
PCSH10042/PCSH10042-03_630-01_00-01_01.ppk=Gundam Breaker 3 BREAK EDITION (ENG) (3.61+!) [3.63]
PCSE00998/PCSE00998-03_630-01_00-01_01.ppk=Atelier Shallie Plus: Alchemists of the Dusk Sea (3.61+!) [3.63]
PCSE01049/PCSE01049-03_630-01_00-01_00.ppk=The Legend of Dark Witch (3.61+!) [3.63]
PCSG00992/PCSG00992-03_630-01_00-01_01.ppk=Harukanaru Toki no Naka de 3 Ultimate (3.61+!) [3.63]
PCSG90311/PCSG90311-03_680-01_00-01_01.ppk=Tayutama 2: You're the Only One (DEMO) (3.61+!) [3.68]
PCSG00899/PCSG00899-03_610-01_00-01_01.ppk=Tokyo Tattoo Girls (3.61+!) [3.61]
PCSE01001/PCSE01001-03_670-01_00-01_01.ppk=Hakuoki - Edo Blossoms (3.61+!) [3.67]
PCSH10038/PCSH10038-03_630-01_00-01_00.ppk=Accel World vs Sword Art Online: Millennium Twilight (3.61+!) [3.63]
PCSG01277/PCSG01277-03_690-01_00-01_00.ppk=Gnosia
PCSB01215/PCSB01215-03_650-01_00-01_00.ppk=Little Red Lie (3.61+!) [3.65]
PCSB01063/PCSB01063-03_630-01_00-01_02.ppk=Zero Escape: The Nonary Games (3.61+!) [3.63]
PCSG01170/PCSG01170-03_670-01_00-01_02.ppk=Sir Eatsalot (3.61+!) [3.67]
PCSG01213/PCSG01213-03_680-01_00-01_00.ppk=Koshotengai no Hashihime Noma
PCSB01228/PCSB01228-03_680-01_00-01_02.ppk=TETRA's Escape (3.61+!) [3.68]
PCSB01093/PCSB01093-03_630-01_00-01_00.ppk=Utawarerumono: Mask of Deception (3.61+!) [3.63]
PCSE01218/PCSE01218-03_650-01_00-01_02.ppk=Little Red Lie (3.61+!) [3.65]
PCSG00990/PCSG00990-03_630-01_00-01_01.ppk=RepKiss (3.61+!) [3.63]
PCSG00868/PCSG00868-03_610-01_00-01_01.ppk=Sword Art Online: Hollow Realization (3.61+!) [3.61]
PCSB01090/PCSB01090-03_630-01_00-01_01.ppk=Valkyria Revolution (3.61+!) [3.63]
PCSE01098/PCSE01098-03_650-01_00-01_02.ppk=Still Time (3.61+!) [3.65]
PCSE01280/PCSE01280-03_680-01_00-01_01.ppk=Sigi - A Fart for Melusina (3.61+!) [3.68]
PCSG01147/PCSG01147-03_670-01_00-01_01.ppk=Reverie (3.61+!) [3.67]
PCSE00441/PCSE00441-03_610-01_00-01_00.ppk=The Keeper of 4 Elements (3.61+!) [3.61]
PCSB01166/PCSB01166-03_670-01_00-01_02.ppk=VA-11 HALL-A: Cyberpunk Bartender Action (3.61+!) [3.67]
PCSG01252/PCSG01252-03_690-01_00-01_01.ppk=Haruoto Alice ＊ Gram (3.61+!) [3.69]
PCSB01155/PCSB01155-03_650-01_00-01_02.ppk=My Name is Mayo (3.61+!) [3.65]
PCSH00263/PCSH00263-03_650-01_00-01_06.ppk=MUSYNC (CHI) (3.61+!) [3.65]
PCSB01182/PCSB01182-03_650-01_00-01_00.ppk=Semispheres (3.61+!) [3.65]
PCSE01332/PCSE01332-03_680-01_00-01_01.ppk=London Detective Mysteria (DEMO) (3.61+!) [3.68]
PCSH10155/PCSH10155-03_690-01_00-01_00.ppk=Energy Cycle
PCSE01408/PCSE01408-03_690-01_00-01_00.ppk=Grass Cutter
PCSH10039/PCSH10039-03_630-01_00-01_02.ppk=Chaos;Child (3.61+!) [3.63]
PCSE01232/PCSE01232-03_670-01_00-01_01.ppk=Cosmic Star Heroine (3.61+!) [3.67]
PCSH00284/PCSH00284-03_610-01_00-01_01.ppk=Psycho-Pass: Mandatory Happiness (3.61+!) [3.61]
PCSG01103/PCSG01103-03_650-01_00-01_00.ppk=Tokyo Clanpool (3.61+!) [3.65]
PCSE01397/PCSE01397-03_690-01_00-01_00.ppk=Attack of the Toy Tanks
PCSB00965/PCSB00965-03_630-01_00-01_04.ppk=Gem Smashers (3.61+!) [3.63]
PCSE01236/PCSE01236-03_670-01_00-01_05.ppk=NeuroVoider (3.61+!) [3.67]
PCSE01219/PCSE01219-03_670-01_00-01_01.ppk=Deep Ones (3.61+!) [3.67]
PCSB01095/PCSB01095-03_630-01_00-01_00.ppk=A Rose in the Twilight (3.61+!) [3.63]
PCSB01169/PCSB01169-03_650-01_00-01_00.ppk=Burly Men at Sea (3.61+!) [3.65]
PCSB01267/PCSB01267-03_680-01_00-01_01.ppk=Word Search by POWGI (3.61+!) [3.68]
PCSE00927/PCSE00927-03_630-01_00-01_02.ppk=Akiba's Beat (3.61+!) [3.63]
PCSG01099/PCSG01099-03_650-01_00-01_01.ppk=Ninja Usagimaru: Two Tails of Adventure (3.61+!) [3.65]
PCSG00781/PCSG00781-03_610-01_00-01_02.ppk=RecoLove: Blue Ocean (3.61+!) [3.61]
PCSE01338/PCSE01338-03_690-01_00-01_01.ppk=One Word by POWGI (3.61+!) [3.69]
PCSE01080/PCSE01080-03_690-01_00-01_02.ppk=METAGAL (3.61+!) [3.69]
PCSG00877/PCSG00877-03_610-01_00-01_01.ppk=Neo ATLAS 1469 (3.61+!) [3.61]
PCSG01049/PCSG01049-03_650-01_00-01_01.ppk=Tokyo Yamanote Boys for V: Fan Disc (3.61+!) [3.65]
PCSB01268/PCSB01268-03_680-01_00-01_01.ppk=Jack N' Jill DX (3.61+!) [3.68]
PCSB01340/PCSB01340-03_690-01_00-01_01.ppk=Hoggy2
PCSB01065/PCSB01065-03_630-01_00-01_00.ppk=Touhou Double Focus (3.61+!) [3.63]
PCSE01074/PCSE01074-03_630-01_00-01_01.ppk=Plague Road (3.61+!) [3.63]
PCSE01241/PCSE01241-03_680-01_00-01_01.ppk=The Dreamlands: Aisling's Quest (3.61+!) [3.68]
PCSG01191/PCSG01191-03_670-01_00-01_02.ppk=Liar Princess and the Blind Prince (3.61+!) [3.67]
PCSG90251/PCSG90251-03_610-01_00-01_00.ppk=World of Final Fantasy Dungeon (DEMO) (3.61+!) [3.61]
PCSH10094/PCSH10094-03_650-01_00-01_01.ppk=One More Dungeon (ENG-SPA-DEU-FRA-RUS-JPN-TC-SC) (3.61+!) [3.65]
PCSH00282/PCSH00282-03_610-01_00-01_02.ppk=Blast 'Em Bunnies (CHI) (3.61+!) [3.61]
PCSG00340/PCSG00340-03_670-01_00-01_03.ppk=Manga Kakeru (3.61+!) [3.67]
PCSG00951/PCSG00951-03_650-01_00-01_01.ppk=Nep-Nep Connect: Chaos Chanpuru (3.61+!) [3.65]
PCSH10062/PCSH10062-03_650-01_00-01_00.ppk=The Legend of Heroes Sora No Kiseki SC Evolution Trial Version (DEMO) (3.61+!) [3.65]
PCSG01251/PCSG01251-03_690-01_00-01_02.ppk=GhoulBoy
PCSB01330/PCSB01330-03_690-01_00-01_00.ppk=Pic-a-Pix Classic (3.61+!) [3.69]
PCSH10027/PCSH10027-03_630-01_00-01_01.ppk=Toukiden 2 Free Alliances Version (3.61+!) [3.63]
PCSB01191/PCSB01191-03_650-01_00-01_01.ppk=One More Dungeon (3.61+!) [3.65]
PCSG90305/PCSG90305-03_670-01_00-01_00.ppk=Natsuiro Kokoro Log (DEMO) (3.61+!) [3.67]
PCSE01143/PCSE01143-03_670-01_00-01_00.ppk=Penny-Punching Princess (3.61+!) [3.67]
PCSB01017/PCSB01017-03_610-01_00-01_01.ppk=Darkest Dungeon (3.61+!) [3.61]
PCSB01168/PCSB01168-03_650-01_00-01_01.ppk=Revenant Saga (3.61+!) [3.65]
PCSE01310/PCSE01310-03_680-01_00-01_02.ppk=Slayaway Camp: Butcher's Cut (3.61+!) [3.68]
PCSH10051/PCSH10051-03_650-01_00-01_00.ppk=Danganronpa V3: Killing Harmony (3.61+!) [3.65]
PCSE01367/PCSE01367-03_690-01_00-01_00.ppk=Awesome Pea (3.61+!) [3.69]
PCSE00984/PCSE00984-03_630-01_00-01_01.ppk=DYING: Reborn (3.61+!) [3.63]
PCSB00969/PCSB00969-03_610-01_00-01_01.ppk=Xenoraid (3.61+!) [3.61]
PCSG00936/PCSG00936-03_630-01_00-01_03.ppk=Danganronpa V3: Killing Harmony (3.61+!) [3.63]
PCSE01382/PCSE01382-03_690-01_00-01_01.ppk=Furwind (3.61+!) [3.69]
PCSB01133/PCSB01133-03_650-01_00-01_02.ppk=Vegas Party (3.61+!) [3.65]
PCSB01167/PCSB01167-03_650-01_00-01_00.ppk=Asdivine Hearts (3.61+!) [3.65]
PCSG01010/PCSG01010-03_630-01_00-01_01.ppk=Nidhogg (3.61+!) [3.63]
PCSG01235/PCSG01235-03_690-01_00-01_00.ppk=Nora, Princess, and Stray Cat 2 (3.61+!) [3.69]
PCSG01181/PCSG01181-03_680-01_00-01_00.ppk=Darkest Dungeon オリジナルサウンドトラック
PCSE00835/PCSE00835-03_610-01_00-01_01.ppk=Neon Chrome (3.61+!) [3.61]
PCSE01187/PCSE01187-03_690-01_00-01_00.ppk=London Detective Mysteria (3.61+!) [3.69]
PCSG00981/PCSG00981-03_610-01_00-01_00.ppk=Flowers: Toki-Hen (3.61+!) [3.61]
PCSG01050/PCSG01050-03_630-01_00-01_00.ppk=Farming Simulator 18 (3.61+!) [3.63]
PCSH10067/PCSH10067-03_670-01_00-01_00.ppk=Secret of Mana (3.61+!) [3.67]
PCSB01158/PCSB01158-03_650-01_00-01_00.ppk=Squareboy vs Bullies: Arena Edition (3.61+!) [3.65]
PCSG01211/PCSG01211-03_680-01_00-01_01.ppk=Kin'iro no Corda 3: Full Voice Special (3.61+!) [3.68]
PCSH10100/PCSH10100-03_670-01_00-01_00.ppk=Metal Max Xeno (CHI/KOR) (3.61+!) [3.67]
PCSG01079/PCSG01079-03_670-01_00-01_00.ppk=Utawarerumono: Chiriyuku Mono e no Komoriuta (3.61+!) [3.67]
PCSG01134/PCSG01134-03_650-01_00-01_01.ppk=Ephemeral: Fantasy on Dark (3.61+!) [3.65]
PCSG00977/PCSG00977-03_650-01_00-01_02.ppk=Touhou Genso Maroku W: The Devil of Decline (3.61+!) [3.65]
PCSG00993/PCSG00993-03_630-01_00-01_00.ppk=Sousei no Onmyouji (3.61+!) [3.63]
PCSB01073/PCSB01073-03_630-01_00-01_02.ppk=GOD WARS Future Past (3.61+!) [3.63]
PCSG01100/PCSG01100-03_670-01_00-01_01.ppk=Doukoku Soshite... (3.61+!) [3.67]
PCSE01142/PCSE01142-03_650-01_00-01_00.ppk=Semispheres (3.61+!) [3.65]
PCSG01070/PCSG01070-03_650-01_00-01_00.ppk=Song of Heiligenstadt (3.61+!) [3.65]
PCSE01054/PCSE01054-03_630-01_00-01_01.ppk=Skylight Freerange (3.61+!) [3.63]
PCSE01092/PCSE01092-03_630-01_00-01_02.ppk=Plantera (3.61+!) [3.63]
PCSG01212/PCSG01212-03_680-01_00-01_01.ppk=Kin'iro no Corda 3: AnotherSky feat. Jinnan / Shiseikan / Amane Gakuen (3.61+!) [3.68]
PCSE01376/PCSE01376-03_690-01_00-01_00.ppk=Pic-a-Pix Classic (3.61+!) [3.69]
PCSB01161/PCSB01161-03_650-01_00-01_01.ppk=TOKYO TATTOO GIRLS (3.61+!) [3.65]
PCSG00947/PCSG00947-03_610-01_00-01_01.ppk=Macross Delta Scramble (3.61+!) [3.61]
PCSB01382/PCSB01382-03_690-01_00-01_02.ppk=Super Wiloo Demake
PCSB01048/PCSB01048-03_610-01_00-01_01.ppk=Hue (3.61+!) [3.61]
PCSE00876/PCSE00876-03_630-01_00-01_04.ppk=iO (3.61+!) [3.63]
PCSG90319/PCSG90319-03_690-01_00-01_00.ppk=春音アリス*グラム Snow Drop 体験版 (DEMO) (3.61+!) [3.69]
PCSG01257/PCSG01257-03_690-01_00-01_01.ppk=I Am The Hero
PCSE01335/PCSE01335-03_690-01_00-01_00.ppk=Asdivine Hearts II (3.61+!) [3.69]
PCSE01172/PCSE01172-03_650-01_00-01_02.ppk=Alteric (3.61+!) [3.65]
PCSE01255/PCSE01255-03_680-01_00-01_01.ppk=Fill-a-Pix: Phil's Epic Adventure (3.61+!) [3.68]
PCSB01141/PCSB01141-03_650-01_00-01_00.ppk=NeverEnd (3.61+!) [3.65]
PCSE01220/PCSE01220-03_650-01_00-01_00.ppk=One Eyed Kutkh (3.61+!) [3.65]
PCSG00962/PCSG00962-03_630-01_00-01_00.ppk=Valkyria Revolution (3.61+!) [3.63]
PCSE01128/PCSE01128-03_650-01_00-01_01.ppk=Save the Ninja Clan (3.61+!) [3.65]
PCSG01188/PCSG01188-03_670-01_00-01_01.ppk=THE KING OF FIGHTERS '97 GLOBAL MATCH (3.61+!) [3.67]
PCSB01307/PCSB01307-03_680-01_00-01_01.ppk=Word Sudoku by POWGI (3.61+!) [3.68]
PCSG01015/PCSG01015-03_630-01_00-01_01.ppk=Tokeijikake no Ley Line: Kagerou ni Samayou Majo (3.61+!) [3.63]
PCSE01154/PCSE01154-03_650-01_00-01_02.ppk=Son of Scoregasm (3.61+!) [3.65]
PCSE00971/PCSE00971-03_650-01_00-01_01.ppk=Deadbolt (3.61+!) [3.65]
PCSE01145/PCSE01145-03_680-01_00-01_02.ppk=Spacejacked (3.61+!) [3.68]
PCSE01035/PCSE01035-03_630-01_00-01_00.ppk=Farming Simulator 18 (3.61+!) [3.63]
PCSE01013/PCSE01013-03_610-01_00-01_00.ppk=Mutant Mudds Deluxe (3.61+!) [3.61]
PCSG90303/PCSG90303-03_650-01_00-01_00.ppk=Toaru Majutsu no Virtual-On (DEMO) (3.61+!) [3.65]
PCSG01060/PCSG01060-03_630-01_00-01_02.ppk=Hulu (3.61+!) [3.63]
PCSE01349/PCSE01349-03_690-01_00-01_01.ppk=Bouncy Bullets
PCSB00414/PCSB00414-03_670-01_00-01_01.ppk=Rainbow Skies (3.61+!) [3.67]
PCSG01189/PCSG01189-03_670-01_00-01_02.ppk=Infinita Strada Hana (3.61+!) [3.67]
PCSE01192/PCSE01192-03_650-01_00-01_01.ppk=Energy Invasion (3.61+!) [3.65]
PCSG00975/PCSG00975-03_630-01_00-01_01.ppk=Harukanaru Toki no Naka de 6: Gentou Rondo (3.61+!) [3.63]
PCSG01076/PCSG01076-03_650-01_00-01_01.ppk=Oretachi no Sekai wa Owatteiru (3.61+!) [3.65]
PCSG00964/PCSG00964-03_630-01_00-01_01.ppk=UNDER NIGHT IN-BIRTH Exe:Late[st] (3.61+!) [3.63]
PCSE01082/PCSE01082-03_690-01_00-01_01.ppk=Peasant Knight (3.61+!) [3.69]
PCSE01112/PCSE01112-03_650-01_00-01_02.ppk=The Count Lucanor (3.61+!) [3.65]
PCSB01179/PCSB01179-03_650-01_00-01_00.ppk=Volgarr the Viking (3.61+!) [3.65]
PCSE01418/PCSE01418-03_690-01_00-01_00.ppk=Illusion of L'Phalcia
PCSG01019/PCSG01019-03_630-01_00-01_00.ppk=Tsumikui: Sen no Noroi Sen no Inori for V (3.61+!) [3.63]
PCSG01135/PCSG01135-03_650-01_00-01_01.ppk=Tonari ni Kanojo no Iru Shiawase: Two Farce (3.61+!) [3.65]
PCSE01173/PCSE01173-03_650-01_00-01_01.ppk=North (3.61+!) [3.65]
PCSE01044/PCSE01044-03_630-01_00-01_01.ppk=Atelier Firis: The Alchemist and the Mysterious Journey (3.61+!) [3.63]
PCSB01150/PCSB01150-03_650-01_00-01_01.ppk=Demon Gaze II (3.61+!) [3.65]
PCSE01374/PCSE01374-03_690-01_00-01_01.ppk=Super Weekend Mode (3.61+!) [3.69]
PCSE01125/PCSE01125-03_690-01_00-01_01.ppk=Shakedown: Hawaii
PCSE01166/PCSE01166-03_670-01_00-01_00.ppk=Psychedelica of the Ashen Hawk (3.61+!) [3.67]
PCSE01116/PCSE01116-03_650-01_00-01_00.ppk=Undertale (3.61+!) [3.65]
PCSB01038/PCSB01038-03_610-01_00-01_01.ppk=YOMAWARI: NIGHT ALONE/HTOLNIQ: THE FIREFLY DIARY (3.61+!) [3.61]
PCSE01023/PCSE01023-03_630-01_00-01_01.ppk=Salt and Sanctuary (3.61+!) [3.63]
PCSB01321/PCSB01321-03_690-01_00-01_00.ppk=Necrosphere Deluxe
PCSE01137/PCSE01137-03_650-01_00-01_02.ppk=NeverEnd (3.61+!) [3.65]
PCSG01000/PCSG01000-03_630-01_00-01_00.ppk=ISLAND (3.61+!) [3.63]
PCSH10068/PCSH10068-03_650-01_00-01_00.ppk=The Lost Child (3.61+!) [3.65]
PCSB01084/PCSB01084-03_650-01_00-01_01.ppk=Papers, Please (3.61+!) [3.65]
PCSE01022/PCSE01022-03_650-01_00-01_01.ppk=Chaos;Child (3.61+!) [3.65]
PCSB01055/PCSB01055-03_610-01_00-01_00.ppk=Wanted Corp. (3.61+!) [3.61]
PCSB01193/PCSB01193-03_650-01_00-01_02.ppk=Super Hydorah (3.61+!) [3.65]
PCSE00699/PCSE00699-03_670-01_00-01_00.ppk=Roundabout (3.61+!) [3.67]
PCSB01124/PCSB01124-03_630-01_00-01_03.ppk=Dragons Online (3.61+!) [3.63]
PCSH10109/PCSH10109-03_680-01_00-01_02.ppk=Persona 5 Dancing Star Night (3.61+!) [3.68]
PCSE01085/PCSE01085-03_670-01_00-01_04.ppk=League of Evil (3.61+!) [3.67]
PCSG01044/PCSG01044-03_630-01_00-01_00.ppk=Karumaruka * Circle (3.61+!) [3.63]
PCSG01006/PCSG01006-03_610-01_00-01_01.ppk=Bard's Gold (3.61+!) [3.61]
PCSE00950/PCSE00950-03_630-01_00-01_01.ppk=Shantae: Half-Genie Hero (3.61+!) [3.63]
PCSE01042/PCSE01042-03_650-01_00-01_01.ppk=Bad Apple Wars (3.61+!) [3.65]
PCSG01001/PCSG01001-03_630-01_00-01_00.ppk=Side Kicks! (3.61+!) [3.63]
PCSG01231/PCSG01231-03_680-01_00-01_00.ppk=Sakura Sakura (3.61+!) [3.68]
PCSE01147/PCSE01147-03_650-01_00-01_01.ppk=Antiquia Lost (3.61+!) [3.65]
PCSE01264/PCSE01264-03_690-01_00-01_01.ppk=Mecho Wars: Desert Ashes (3.61+!) [3.69]
PCSB01020/PCSB01020-03_610-01_00-01_00.ppk=GAROU: MARK OF THE WOLVES (3.61+!) [3.61]
PCSE01176/PCSE01176-03_650-01_00-01_01.ppk=One More Dungeon (3.61+!) [3.65]
PCSE01017/PCSE01017-03_630-01_00-01_01.ppk=Cladun Returns: This is Sengoku! (DEMO) (3.61+!) [3.63]
PCSE01229/PCSE01229-03_670-01_00-01_01.ppk=Reverie (3.61+!) [3.67]
PCSB01127/PCSB01127-03_650-01_00-01_01.ppk=Danganronpa V3: Killing Harmony (3.61+!) [3.65]
PCSE00992/PCSE00992-03_650-01_00-01_02.ppk=The Bard's Tale: Remastered and Resnarkled (3.61+!) [3.65]
PCSG01185/PCSG01185-03_670-01_00-01_00.ppk=Natsuiro Kokoro Log
PCSE01428/PCSE01428-03_690-01_00-01_00.ppk=Mekabolt
PCSE01369/PCSE01369-03_690-01_00-01_00.ppk=Iron Snout
PCSG01227/PCSG01227-03_680-01_00-01_01.ppk=Chronus Arc (3.61+!) [3.68]
PCSG90316/PCSG90316-03_680-01_00-01_00.ppk=Zanki Zero (DEMO) (3.61+!) [3.68]
PCSG01268/PCSG01268-03_690-01_00-01_02.ppk=神凪ノ杜 五月雨綴り
PCSB01322/PCSB01322-03_690-01_00-01_00.ppk=Drowning (3.61+!) [3.69]
PCSE00864/PCSE00864-03_630-01_00-01_01.ppk=Blue-Collar Astronaut (3.61+!) [3.63]
PCSB01074/PCSB01074-03_650-01_00-01_01.ppk=Sokoban Next (3.61+!) [3.65]
PCSE01158/PCSE01158-03_650-01_00-01_01.ppk=Mecho Tales (3.61+!) [3.65]
PCSG01175/PCSG01175-03_670-01_00-01_01.ppk=Azayaka na Irodori no Naka de, Kimi Rashiku (3.61+!) [3.67]
PCSG01167/PCSG01167-03_670-01_00-01_00.ppk=Enkan no Memoria: Kakera Tomoshi
PCSG00841/PCSG00841-03_630-01_00-01_01.ppk=Dungeon Travelers 2-2: Yamiochi no Otome to Hajimari no Sho (3.61+!) [3.63]
PCSH10124/PCSH10124-03_680-01_00-01_01.ppk=Super Destronaut DX (3.61+!) [3.68]
PCSE01094/PCSE01094-03_650-01_00-01_01.ppk=Romancing SaGa 2 (3.61+!) [3.65]
PCSE00990/PCSE00990-03_630-01_00-01_01.ppk=Touhou Genso Wanderer (3.61+!) [3.63]
PCSB01164/PCSB01164-03_650-01_00-01_00.ppk=Factotum90 (3.61+!) [3.65]
PCSE01336/PCSE01336-03_680-01_00-01_00.ppk=Planet RIX-13 (3.61+!) [3.68]
PCSE00958/PCSE00958-03_610-01_00-01_00.ppk=GAROU: MARK OF THE WOLVES (3.61+!) [3.61]
PCSG01013/PCSG01013-03_630-01_00-01_01.ppk=Gun Gun Pixies (3.61+!) [3.63]
PCSG01230/PCSG01230-03_680-01_00-01_00.ppk=Revenant Dogma (3.61+!) [3.68]
PCSE01254/PCSE01254-03_680-01_00-01_00.ppk=Fate/EXTELLA LINK (3.61+!) [3.68]
PCSB01207/PCSB01207-03_650-01_00-01_00.ppk=Time Recoil (3.61+!) [3.65]
PCSG90328/PCSG90328-03_690-01_00-01_00.ppk=Making * Lovers (DEMO)
PCSB00895/PCSB00895-03_630-01_00-01_02.ppk=Dino Dini's Kick Off Revival (3.61+!) [3.63]
PCSB01117/PCSB01117-03_650-01_00-01_01.ppk=Ninja Usagimaru: Two Tails of Adventure (3.61+!) [3.65]
PCSE01186/PCSE01186-03_650-01_00-01_00.ppk=Time Recoil (3.61+!) [3.65]
PCSE00669/PCSE00669-03_610-01_00-01_02.ppk=Spider: Rite of the Shrouded Moon (3.61+!) [3.61]
PCSG00946/PCSG00946-03_610-01_00-01_02.ppk=Penny-Punching Princess (3.61+!) [3.61]
PCSH10098/PCSH10098-03_670-01_00-01_01.ppk=Midnight Deluxe (ENG/CHI) (3.61+!) [3.67]
PCSB01201/PCSB01201-03_680-01_00-01_02.ppk=I Am The Hero (3.61+!) [3.68]
PCSG01030/PCSG01030-03_670-01_00-01_01.ppk=Persona 5: Dancing Star Night (3.61+!) [3.67]
PCSE01238/PCSE01238-03_680-01_00-01_02.ppk=TETRA's Escape (3.61+!) [3.68]
PCSH00292/PCSH00292-03_610-01_00-01_00.ppk=Toukiden 2 (3.61+!) [3.61]
PCSB01064/PCSB01064-03_610-01_00-01_01.ppk=Mutant Mudds Deluxe (3.61+!) [3.61]
PCSB01003/PCSB01003-03_630-01_00-01_01.ppk=Toukiden 2 (3.61+!) [3.63]
PCSG00939/PCSG00939-03_630-01_00-01_01.ppk=Omega Labyrinth Z (3.61+!) [3.63]
PCSE00870/PCSE00870-03_630-01_00-01_01.ppk=Spheroids (3.61+!) [3.63]
PCSB01037/PCSB01037-03_610-01_00-01_01.ppk=Slain: Back from Hell (3.61+!) [3.61]
PCSE01055/PCSE01055-03_670-01_00-01_01.ppk=Root Double -Before Crime * After Days- Xtend Edition (3.61+!) [3.67]
PCSE01089/PCSE01089-03_630-01_00-01_00.ppk=Spellspire (3.61+!) [3.63]
PCSE01417/PCSE01417-03_690-01_00-01_00.ppk=Pantsu Hunter
PCSE00993/PCSE00993-03_630-01_00-01_00.ppk=The Longest Five Minutes (3.61+!) [3.63]
PCSB00738/PCSB00738-03_630-01_00-01_02.ppk=Bodycheck (3.61+!) [3.63]
PCSG90300/PCSG90300-03_670-01_00-01_00.ppk=円環のメモーリア -カケラ灯し- 体験版 (DEMO) (3.61+!) [3.67]
PCSE01358/PCSE01358-03_690-01_00-01_02.ppk=I and Me (3.61+!) [3.69]
PCSE01240/PCSE01240-03_670-01_00-01_01.ppk=Sir Eatsalot (3.61+!) [3.67]
PCSB00868/PCSB00868-03_610-01_00-01_00.ppk=Uncanny Valley (3.61+!) [3.61]
PCSG00985/PCSG00985-03_610-01_00-01_01.ppk=Touhou Genso Wanderer (3.61+!) [3.61]
PCSB00513/PCSB00513-03_630-01_00-01_04.ppk=SuperMagical (3.61+!) [3.63]
PCSG00912/PCSG00912-03_650-01_00-01_02.ppk=Un:BIRTHDAY SONG: Koi wo Utau Shinigami - Another Record (3.61+!) [3.65]
PCSG01027/PCSG01027-03_650-01_00-01_02.ppk=Gundemoniums (3.61+!) [3.65]
PCSG01062/PCSG01062-03_650-01_00-01_00.ppk=Steam Prison: Nanatsu no Bitoku (3.61+!) [3.65]
PCSE00951/PCSE00951-03_650-01_00-01_01.ppk=Summon Night 6: Lost Borders (3.61+!) [3.65]
PCSH10001/PCSH10001-03_630-01_00-01_00.ppk=Super Robot Wars V (ENG) (3.61+!) [3.63]
PCSG01034/PCSG01034-03_680-01_00-01_01.ppk=Sengoku Hime 7: Sen'un Tsuranuku Guren no Ishi (3.61+!) [3.68]
PCSG01138/PCSG01138-03_650-01_00-01_00.ppk=Amenity's Life (3.61+!) [3.65]
PCSH00240/PCSH00240-03_610-01_00-01_02.ppk=DYING: Reborn (CHI) (3.61+!) [3.61]
PCSB01067/PCSB01067-03_630-01_00-01_00.ppk=Cladun Returns: This is Sengoku! (DEMO) (3.61+!) [3.63]
PCSB01342/PCSB01342-03_690-01_00-01_02.ppk=Devious Dungeon 2 (3.61+!) [3.69]
PCSE01071/PCSE01071-03_650-01_00-01_00.ppk=Accel World vs. Sword Art Online (3.61+!) [3.65]
PCSE01395/PCSE01395-03_690-01_00-01_01.ppk=Wordsweeper by POWGI
PCSG00917/PCSG00917-03_650-01_00-01_00.ppk=Starry Sky: Autumn Stories (3.61+!) [3.65]
PCSE01414/PCSE01414-03_690-01_00-01_00.ppk=Mochi Mochi Boy
PCSE01101/PCSE01101-03_650-01_00-01_00.ppk=SteamWorld Dig 2 (3.61+!) [3.65]
PCSG01164/PCSG01164-03_670-01_00-01_01.ppk=Jikkyou Powerful Pro Yakyuu 2018 (3.61+!) [3.67]
PCSG01154/PCSG01154-03_680-01_00-01_02.ppk=Darkest Dungeon
PCSE00756/PCSE00756-03_650-01_00-01_04.ppk=VA-11 HALL-A (3.61+!) [3.65]
PCSE01365/PCSE01365-03_690-01_00-01_00.ppk=Dreamwalker (3.61+!) [3.69]
PCSB01213/PCSB01213-03_650-01_00-01_00.ppk=One Eyed Kutkh (3.61+!) [3.65]
PCSE01037/PCSE01037-03_630-01_00-01_01.ppk=The Caligula Effect (3.61+!) [3.63]
PCSE01144/PCSE01144-03_650-01_00-01_01.ppk=Under Night In-Birth Exe:Late[st] (3.61+!) [3.65]
PCSB01333/PCSB01333-03_690-01_00-01_01.ppk=Furwind (3.61+!) [3.69]
PCSG01195/PCSG01195-03_670-01_00-01_03.ppk=God Wars: Nihon Shinwa Taisen (3.61+!) [3.67]
PCSE01111/PCSE01111-03_650-01_00-01_01.ppk=Rabi-Ribi (3.61+!) [3.65]
PCSH10120/PCSH10120-03_690-01_00-01_00.ppk=Peasant Knight
PCSE01157/PCSE01157-03_650-01_00-01_02.ppk=Gunhouse (3.61+!) [3.65]
PCSE01102/PCSE01102-03_650-01_00-01_00.ppk=Utawarerumono: Mask of Truth (3.61+!) [3.65]
PCSE01068/PCSE01068-03_670-01_00-01_02.ppk=Bunny Must Die! Chelsea and the 7 Devils (3.61+!) [3.67]
PCSG01111/PCSG01111-03_650-01_00-01_00.ppk=Ninki Seiyuu no Tsukurikata (3.61+!) [3.65]
PCSG01137/PCSG01137-03_670-01_00-01_02.ppk=2064: Read Only Memories (3.61+!) [3.67]
PCSE01072/PCSE01072-03_680-01_00-01_02.ppk=Super Mutant Alien Assault (3.61+!) [3.68]
PCSH10009/PCSH10009-03_630-01_00-01_00.ppk=Tokyo Xanadu (3.61+!) [3.63]
PCSE01422/PCSE01422-03_690-01_00-01_00.ppk=Pic-a-Pix Color 2
PCSE01114/PCSE01114-03_650-01_00-01_02.ppk=Vegas Party (3.61+!) [3.65]
PCSE00895/PCSE00895-03_690-01_00-01_02.ppk=NightCry (3.61+!) [3.69]
PCSB01135/PCSB01135-03_670-01_00-01_01.ppk=Mercenary Kings Reloaded (3.61+!) [3.67]
PCSE00964/PCSE00964-03_630-01_00-01_01.ppk=Talisman: Digital Edition (3.61+!) [3.63]
PCSG01228/PCSG01228-03_680-01_00-01_00.ppk=ZANKI ZERO DIGITAL SOUNDTRACK BONUS TRACK (3.61+!) [3.68]
PCSE00621/PCSE00621-03_610-01_00-01_00.ppk=Vertical Drop Heroes HD (3.61+!) [3.61]
PCSB01025/PCSB01025-03_610-01_00-01_00.ppk=World of Final Fantasy Dungeon (DEMO) (3.61+!) [3.61]
PCSG90318/PCSG90318-03_690-01_00-01_00.ppk=スキとスキとでサンカク恋愛 体験版 (DEMO) (3.61+!) [3.69]
PCSB00972/PCSB00972-03_610-01_00-01_00.ppk=Sword Art Online: Hollow Realization (3.61+!) [3.61]
PCSG01187/PCSG01187-03_670-01_00-01_00.ppk=Flowers: Fuyu-hen (3.61+!) [3.67]
PCSH10024/PCSH10024-03_630-01_00-01_00.ppk=GOD WARS Future Past (CHI) (3.61+!) [3.63]
PCSB01318/PCSB01318-03_690-01_00-01_00.ppk=Pic-a-Pix Pieces (3.61+!) [3.69]
PCSB01106/PCSB01106-03_650-01_00-01_02.ppk=Twin Robots (3.61+!) [3.65]
PCSG00834/PCSG00834-03_610-01_00-01_00.ppk=Toukiden 2 Free Alliances Version / Co-Op Battle Version (3.61+!) [3.61]
PCSE01148/PCSE01148-03_650-01_00-01_00.ppk=Licky The Lucky Lizard Lives Again (3.61+!) [3.65]
PCSE00914/PCSE00914-03_650-01_00-01_02.ppk=99Vidas (3.61+!) [3.65]
PCSB01054/PCSB01054-03_650-01_00-01_01.ppk=Nurse Love Addiction (3.61+!) [3.65]
PCSG90302/PCSG90302-03_670-01_00-01_00.ppk=NadeRevo! Nadeshiko Revolution (DEMO) (3.61+!) [3.67]
PCSB01075/PCSB01075-03_650-01_00-01_01.ppk=Chaos;Child (3.61+!) [3.65]
PCSH10108/PCSH10108-03_680-01_00-01_02.ppk=Persona 3 Dancing Moon Night (3.61+!) [3.68]
PCSG01080/PCSG01080-03_650-01_00-01_01.ppk=Yomawari: Midnight Shadows (3.61+!) [3.65]
PCSE00985/PCSE00985-03_630-01_00-01_01.ppk=Lara Croft GO (3.61+!) [3.63]
PCSB01202/PCSB01202-03_650-01_00-01_00.ppk=Xenon Valkyrie+ (3.61+!) [3.65]
PCSB01023/PCSB01023-03_650-01_00-01_01.ppk=DEADBOLT (3.61+!) [3.65]
PCSE00974/PCSE00974-03_610-01_00-01_01.ppk=Slain: Back from Hell (3.61+!) [3.61]
PCSB01142/PCSB01142-03_650-01_00-01_01.ppk=Plague Road (3.61+!) [3.65]
PCSB01019/PCSB01019-03_610-01_00-01_01.ppk=Root Letter (3.61+!) [3.61]
PCSB01070/PCSB01070-03_630-01_00-01_01.ppk=The Deer God (3.61+!) [3.63]
PCSG90308/PCSG90308-03_670-01_00-01_00.ppk=Sweet Pool (DEMO) (3.61+!) [3.67]
PCSG00967/PCSG00967-03_630-01_00-01_02.ppk=Owaru Sekai to Birthday (3.61+!) [3.63]
PCSG01241/PCSG01241-03_690-01_00-01_01.ppk=Kenka Banchou Otome 2nd Rumble!! (3.61+!) [3.69]
PCSB01039/PCSB01039-03_630-01_00-01_01.ppk=Touhou Genso Wanderer (3.61+!) [3.63]
PCSH10037/PCSH10037-03_630-01_00-01_01.ppk=MUSOU Stars (3.61+!) [3.63]
PCSG01239/PCSG01239-03_680-01_00-01_00.ppk=Hinemosu Shikihime (3.61+!) [3.68]
PCSE01248/PCSE01248-03_690-01_00-01_02.ppk=War Theatre (3.61+!) [3.69]
PCSE01016/PCSE01016-03_630-01_00-01_02.ppk=Siralim 2 (3.61+!) [3.63]
PCSG01028/PCSG01028-03_650-01_00-01_01.ppk=Kono Subarashii Sekai ni Shukufuku wo! Kono Yokubukai Game ni Shinpan wo! (3.61+!) [3.65]
PCSE01113/PCSE01113-03_650-01_00-01_01.ppk=Samurai Shodown V Special (3.61+!) [3.65]
PCSG01088/PCSG01088-03_630-01_00-01_00.ppk=ワールド・エレクション
PCSG90299/PCSG90299-03_650-01_00-01_00.ppk=Amenity's Life (DEMO) (3.61+!) [3.65]
PCSB00944/PCSB00944-03_650-01_00-01_01.ppk=Energy Cycle (3.61+!) [3.65]
PCSB01105/PCSB01105-03_670-01_00-01_02.ppk=Bit Dungeon Plus (3.61+!) [3.67]
PCSB01264/PCSB01264-03_690-01_00-01_02.ppk=Block-a-Pix Deluxe (3.61+!) [3.69]
PCSG01066/PCSG01066-03_650-01_00-01_00.ppk=Chouchou Jiken Lovesodick (3.61+!) [3.65]
PCSB00789/PCSB00789-03_610-01_00-01_01.ppk=Spider: Rite of the Shrouded Moon (3.61+!) [3.61]
PCSB01334/PCSB01334-03_690-01_00-01_01.ppk=Super Weekend Mode
PCSG01151/PCSG01151-03_670-01_00-01_01.ppk=GALTIA V Edition
PCSE00996/PCSE00996-03_630-01_00-01_01.ppk=Hue (3.61+!) [3.63]
PCSG01284/PCSG01284-03_690-01_00-01_00.ppk=Making*Lovers
PCSB01224/PCSB01224-03_670-01_00-01_01.ppk=Cosmic Star Heroine (3.61+!) [3.67]
PCSE01033/PCSE01033-03_630-01_00-01_00.ppk=Ys Origin (3.61+!) [3.63]
PCSG01232/PCSG01232-03_690-01_00-01_02.ppk=Back in 1995
PCSE00999/PCSE00999-03_610-01_00-01_00.ppk=Cladun Returns: This is Sengoku! (3.61+!) [3.61]
PCSH10138/PCSH10138-03_690-01_00-01_00.ppk=Heroes Trials
PCSG01222/PCSG01222-03_680-01_00-01_00.ppk=Rainbow Skies (3.61+!) [3.68]
PCSE01141/PCSE01141-03_650-01_00-01_01.ppk=Demon Gaze II (3.61+!) [3.65]
PCSE00962/PCSE00962-03_610-01_00-01_00.ppk=World of Final Fantasy Dungeon (DEMO) (3.61+!) [3.61]
PCSB01249/PCSB01249-03_680-01_00-01_00.ppk=Waking Violet (3.61+!) [3.68]
PCSH10158/PCSH10158-03_690-01_00-01_01.ppk=Energy Cycle Edge
PCSB01125/PCSB01125-03_630-01_00-01_00.ppk=Spellspire (3.61+!) [3.63]
PCSE00318/PCSE00318-03_670-01_00-01_01.ppk=Rainbow Skies (3.61+!) [3.67]
PCSB01189/PCSB01189-03_650-01_00-01_01.ppk=North (3.61+!) [3.65]
PCSG01086/PCSG01086-03_650-01_00-01_00.ppk=Amaekata wa Kanojo Nari ni. (3.61+!) [3.65]
PCSB01152/PCSB01152-03_690-01_00-01_03.ppk=Super Life of Pixel (3.61+!) [3.69]
PCSE01383/PCSE01383-03_690-01_00-01_01.ppk=Hoggy2
PCSE01146/PCSE01146-03_650-01_00-01_03.ppk=Super Hydorah (3.61+!) [3.65]
PCSB01332/PCSB01332-03_690-01_00-01_00.ppk=Mixups by POWGI (3.61+!) [3.69]
PCSE01287/PCSE01287-03_680-01_00-01_01.ppk=Jack N' Jill DX (3.61+!) [3.68]
PCSE00913/PCSE00913-03_610-01_00-01_01.ppk=Volgarr the Viking (3.61+!) [3.61]
PCSG01219/PCSG01219-03_680-01_00-01_00.ppk=Jikkyou Powerful Pro Yakyuu Championship 2018 (3.61+!) [3.68]
PCSG90309/PCSG90309-03_670-01_00-01_00.ppk=カノジョ＊ステップ 体験版 (DEMO) (3.61+!) [3.67]
PCSG01065/PCSG01065-03_650-01_00-01_00.ppk=Gakuen Club: Himitsu no Nightclub
PCSG01041/PCSG01041-03_670-01_00-01_01.ppk=Spheroids (3.61+!) [3.67]
PCSG01162/PCSG01162-03_680-01_00-01_01.ppk=Collar×Malice －Unlimited－ (3.61+!) [3.68]
PCSG01204/PCSG01204-03_680-01_00-01_01.ppk=NG (3.61+!) [3.68]
PCSG01113/PCSG01113-03_680-01_00-01_02.ppk=Zanki Zero (3.61+!) [3.68]
PCSH10025/PCSH10025-03_630-01_00-01_00.ppk=Berserk and the Band of the Hawk (3.61+!) [3.63]
PCSG01249/PCSG01249-03_690-01_00-01_01.ppk=EVE rebirth terror
PCSE00820/PCSE00820-03_630-01_00-01_02.ppk=Dino Dini's Kick Off Revival (3.61+!) [3.63]
PCSE01231/PCSE01231-03_670-01_00-01_01.ppk=Little Adventure on the Prairie (3.61+!) [3.67]
PCSB01081/PCSB01081-03_630-01_00-01_00.ppk=Ys Origin (3.61+!) [3.63]
PCSG01237/PCSG01237-03_680-01_00-01_00.ppk=Stay (3.61+!) [3.68]
PCSB01102/PCSB01102-03_630-01_00-01_00.ppk=Toukiden 2 Free Alliances Version (3.61+!) [3.63]
PCSE01284/PCSE01284-03_690-01_00-01_02.ppk=Block-a-Pix Deluxe (3.61+!) [3.69]
PCSB01174/PCSB01174-03_670-01_00-01_01.ppk=DEAD AHEAD: ZOMBIE WARFARE (3.61+!) [3.67]
PCSG00898/PCSG00898-03_610-01_00-01_00.ppk=Mary Skelter Nightmare (3.61+!) [3.61]
PCSG00997/PCSG00997-03_630-01_00-01_00.ppk=Hatsuyuki Sakura (3.61+!) [3.63]
PCSE00919/PCSE00919-03_610-01_00-01_01.ppk=Darkest Dungeon (3.61+!) [3.61]
PCSB01018/PCSB01018-03_610-01_00-01_03.ppk=Last Wings (3.61+!) [3.61]
PCSB01271/PCSB01271-03_680-01_00-01_02.ppk=Super Skull Smash Go! 2 Turbo (3.61+!) [3.68]
PCSG01184/PCSG01184-03_650-01_00-01_00.ppk=Iconoclasts (3.61+!) [3.65]
PCSE00972/PCSE00972-03_650-01_00-01_03.ppk=2064: Read Only Memories (3.61+!) [3.65]
PCSG01290/PCSG01290-03_690-01_00-01_00.ppk=Chevalier of Sapphire Blade Digital Soundtrack
PCSE01002/PCSE01002-03_630-01_00-01_00.ppk=Mr. Pumpkin's Adventure (3.61+!) [3.63]
PCSG90312/PCSG90312-03_680-01_00-01_01.ppk=古書店街の橋姫 々 体験版 (DEMO) (3.61+!) [3.68]
PCSH10064/PCSH10064-03_650-01_00-01_00.ppk=Semispheres (ENG/CHI/KOR/JPN) (3.61+!) [3.65]
PCSE01406/PCSE01406-03_690-01_00-01_01.ppk=Conga Master Go
PCSG01017/PCSG01017-03_630-01_00-01_00.ppk=Daredemo Shodan ni Nareru Igo Kyoushitsu (3.61+!) [3.63]
PCSE01282/PCSE01282-03_680-01_00-01_01.ppk=Fernz Gate (3.61+!) [3.68]
PCSE01034/PCSE01034-03_630-01_00-01_01.ppk=Berserk and the Band of the Hawk (3.61+!) [3.63]
PCSH00169/PCSH00169-03_610-01_00-01_03.ppk=CastleStorm (CHI) (3.61+!) [3.61]
PCSE01256/PCSE01256-03_690-01_00-01_01.ppk=Heroes Trials (3.61+!) [3.69]
PCSG01240/PCSG01240-03_690-01_00-01_00.ppk=Super Destronaut DX: Intruders Edition
PCSE01235/PCSE01235-03_670-01_00-01_01.ppk=Stardew Valley (3.61+!) [3.67]
PCSE01093/PCSE01093-03_650-01_00-01_00.ppk=Active Soccer 2 DX (3.61+!) [3.65]
PCSG00958/PCSG00958-03_630-01_00-01_01.ppk=Rei-Jin-G-Lu-P (3.61+!) [3.63]
PCSB01094/PCSB01094-03_630-01_00-01_01.ppk=Operation Babel: New Tokyo Legacy (3.61+!) [3.63]
PCSG01278/PCSG01278-03_690-01_00-01_01.ppk=Devious Dungeon 2
PCSG00932/PCSG00932-03_630-01_00-01_00.ppk=Itadaki Street: Dragon Quest & Final Fantasy 30th Anniversary (3.61+!) [3.63]
PCSH10022/PCSH10022-03_650-01_00-01_02.ppk=Toukiden 2 (CHI) (3.61+!) [3.65]
PCSG00862/PCSG00862-03_630-01_00-01_01.ppk=DYNAMIC CHORD feat.KYOHSO V edition (3.61+!) [3.63]
PCSB01328/PCSB01328-03_690-01_00-01_00.ppk=Zeroptian Invasion
PCSB00968/PCSB00968-03_650-01_00-01_02.ppk=Still Time (3.61+!) [3.65]
PCSE00928/PCSE00928-03_610-01_00-01_01.ppk=Fate/Extella: The Umbral Star (3.61+!) [3.61]
PCSB01163/PCSB01163-03_670-01_00-01_00.ppk=Secret of Mana (3.61+!) [3.67]
PCSG00805/PCSG00805-03_610-01_00-01_01.ppk=Code: Realize - Shukufuku no Mirai (3.61+!) [3.61]
PCSG01209/PCSG01209-03_670-01_00-01_01.ppk=Radio Hammer Station (3.61+!) [3.67]
PCSG01166/PCSG01166-03_680-01_00-01_01.ppk=Steins;Gate Elite (3.61+!) [3.68]
PCSE00968/PCSE00968-03_630-01_00-01_01.ppk=Asdivine Hearts (3.61+!) [3.63]
PCSH10015/PCSH10015-03_610-01_00-01_00.ppk=Toukiden 2 (DEMO)
PCSE01194/PCSE01194-03_670-01_00-01_01.ppk=Midnight Deluxe (3.61+!) [3.67]
PCSB01295/PCSB01295-03_680-01_00-01_00.ppk=London Detective Mysteria (DEMO) (3.61+!) [3.68]
PCSH10128/PCSH10128-03_680-01_00-01_01.ppk=TETRA'S Escape (ENG/CHI/KOR/JPN) (3.61+!) [3.68]
PCSE01322/PCSE01322-03_680-01_00-01_00.ppk=Revenant Dogma (3.61+!) [3.68]
PCSG00883/PCSG00883-03_630-01_00-01_01.ppk=Zero Escape: 9 Jikan 9 nin 9 no Tobira Zennin Shibo Dos Double Pack (3.61+!) [3.63]
PCSE01083/PCSE01083-03_630-01_00-01_01.ppk=Blasting Agent: Ultimate Edition (3.61+!) [3.63]
PCSG01024/PCSG01024-03_630-01_00-01_00.ppk=Hanasaki Work Spring (3.61+!) [3.63]
PCSG00983/PCSG00983-03_610-01_00-01_01.ppk=Sengoku Shura SOUL (3.61+!) [3.61]
PCSE01005/PCSE01005-03_610-01_00-01_01.ppk=Demetrios - The BIG Cynical Adventure (3.61+!) [3.61]
PCSE01263/PCSE01263-03_680-01_00-01_01.ppk=Super Destronaut DX (3.61+!) [3.68]
PCSE01341/PCSE01341-03_690-01_00-01_01.ppk=Alvastia Chronicles (3.61+!) [3.69]
PCSE01251/PCSE01251-03_670-01_00-01_01.ppk=Riddled Corpses EX (3.61+!) [3.67]
PCSE01066/PCSE01066-03_630-01_00-01_00.ppk=Toukiden 2 Free Alliances Version (3.61+!) [3.63]
PCSG01091/PCSG01091-03_670-01_00-01_02.ppk=Fate/Extella LINK (3.61+!) [3.67]
PCSE01388/PCSE01388-03_690-01_00-01_00.ppk=The Tower of Beatrice
PCSE01065/PCSE01065-03_630-01_00-01_01.ppk=Revenant Saga (3.61+!) [3.63]
PCSG01087/PCSG01087-03_650-01_00-01_00.ppk=Kimi no Hitomi ni Hit Me (3.61+!) [3.65]
PCSE01104/PCSE01104-03_650-01_00-01_01.ppk=Touhou Kobuto V: Burst Battle (3.61+!) [3.65]
PCSH10088/PCSH10088-03_670-01_00-01_00.ppk=SUPER ROBOT WARS X (ENG) (3.61+!) [3.67]
PCSG01265/PCSG01265-03_690-01_00-01_01.ppk=Kono Damegami ni Kyouiku wo
PCSG00793/PCSG00793-03_610-01_00-01_00.ppk=SD Gundam G Generation Genesis (Require External Data DLC) (3.61+!) [3.61]
PCSG01243/PCSG01243-03_690-01_00-01_00.ppk=Alvastia Chronicles (3.61+!) [3.69]
PCSB01183/PCSB01183-03_650-01_00-01_00.ppk=Digimon Story: Cyber Sleuth - Hacker's Memory (3.61+!) [3.65]
PCSG01242/PCSG01242-03_690-01_00-01_01.ppk=Asdivine Hearts II (3.61+!) [3.69]
PCSH10149/PCSH10149-03_690-01_00-01_01.ppk=Pato Box
PCSE01032/PCSE01032-03_650-01_00-01_00.ppk=Windjammers (3.61+!) [3.65]
PCSE01247/PCSE01247-03_680-01_00-01_01.ppk=Chicken Range (3.61+!) [3.68]
PCSB00945/PCSB00945-03_650-01_00-01_00.ppk=Energy Balance (3.61+!) [3.65]
PCSG01064/PCSG01064-03_650-01_00-01_01.ppk=Teikoku Kaleido: Kakumei no Rondo
PCSB01160/PCSB01160-03_650-01_00-01_00.ppk=Cursed Castilla (Maldita Castilla EX) (3.61+!) [3.65]
PCSG90325/PCSG90325-03_690-01_00-01_00.ppk=ノラと皇女と野良猫ハート2 体験版 (DEMO) (3.61+!) [3.69]
PCSE01348/PCSE01348-03_690-01_00-01_01.ppk=Daggerhood (3.61+!) [3.69]
PCSB01153/PCSB01153-03_650-01_00-01_01.ppk=SAMURAI SHODOWN V SPECIAL (3.61+!) [3.65]
PCSH10023/PCSH10023-03_650-01_00-01_03.ppk=Toukiden 2: Carryover (CHI) (DEMO) (3.61+!) [3.65]
PCSG90269/PCSG90269-03_610-01_00-01_00.ppk=RecoLove: Blue Ocean (DEMO) (3.61+!) [3.61]
PCSG90289/PCSG90289-03_650-01_00-01_00.ppk=Kamidanomi Shisugite Ore no Mirai ga Yabai (DEMO) (3.61+!) [3.65]
PCSG00918/PCSG00918-03_650-01_00-01_01.ppk=Starry Sky: Winter Stories (3.61+!) [3.65]
PCSG90266/PCSG90266-03_630-01_00-01_00.ppk=New Dangan Ronpa V3: Minna no Koroshiai Shin Gakki (DEMO) (3.61+!) [3.63]
PCSE01283/PCSE01283-03_680-01_00-01_01.ppk=Gundemoniums (3.61+!) [3.68]
PCSH10052/PCSH10052-03_650-01_00-01_01.ppk=Danganronpa V3: Killing Harmony (DEMO) (3.61+!) [3.65]
PCSH00214/PCSH00214-03_630-01_00-01_04.ppk=DEEMO The Last Recital (CHI) (3.61+!) [3.63]
PCSB01180/PCSB01180-03_680-01_00-01_03.ppk=The Long Reach (3.61+!) [3.68]
PCSE01119/PCSE01119-03_650-01_00-01_00.ppk=It's Spring Again (3.61+!) [3.65]
PCSG01192/PCSG01192-03_680-01_00-01_01.ppk=Shiro to Kuro no Alice -Twilight Line- (3.61+!) [3.68]
PCSB01304/PCSB01304-03_680-01_00-01_00.ppk=Planet RIX-13 (3.61+!) [3.68]
PCSB01288/PCSB01288-03_680-01_00-01_01.ppk=Gunhouse (3.61+!) [3.68]
PCSG01245/PCSG01245-03_690-01_00-01_01.ppk=Kin'iro no Corda: Octave (3.61+!) [3.69]
PCSG01119/PCSG01119-03_650-01_00-01_01.ppk=Digimon Story Cyber Sleuth: Hacker's Memory (3.61+!) [3.65]
PCSE01050/PCSE01050-03_650-01_00-01_02.ppk=Polara (3.61+!) [3.65]
PCSG01033/PCSG01033-03_650-01_00-01_01.ppk=Blast 'Em Bunnies (3.61+!) [3.65]
PCSB01238/PCSB01238-03_680-01_00-01_01.ppk=Dragon Sinker: Descendants of Legend
PCSE01159/PCSE01159-03_690-01_00-01_02.ppk=DISTRAINT: Deluxe Edition
PCSG01026/PCSG01026-03_630-01_00-01_00.ppk=Eiyuu Densetsu: Akatsuki no Kiseki (3.61+!) [3.63]
PCSG00949/PCSG00949-03_630-01_00-01_01.ppk=三國志13 with パワーアップキット
PCSH00241/PCSH00241-03_610-01_00-01_00.ppk=SD GUNDAM G GENERATION GENESIS (3.61+!) [3.61]
PCSE01279/PCSE01279-03_680-01_00-01_01.ppk=Death Mark (3.61+!) [3.68]
PCSE01339/PCSE01339-03_680-01_00-01_01.ppk=Word Sudoku by POWGI (3.61+!) [3.68]
PCSG00701/PCSG00701-03_650-01_00-01_03.ppk=Touhou Sky Arena: Gensoukyou Kuusen Hime Matsuri Climax (3.61+!) [3.65]
PCSE01237/PCSE01237-03_670-01_00-01_01.ppk=InkSplosion (3.61+!) [3.67]
PCSG01089/PCSG01089-03_650-01_00-01_01.ppk=A Certain Magical Virtual-On (3.61+!) [3.65]
PCSE01400/PCSE01400-03_690-01_00-01_02.ppk=Cybarian: The Time Traveling Warrior
PCSB01247/PCSB01247-03_680-01_00-01_02.ppk=Fullblast (3.61+!) [3.68]
PCSB00946/PCSB00946-03_630-01_00-01_02.ppk=Spheroids (3.61+!) [3.63]
PCSH10122/PCSH10122-03_680-01_00-01_00.ppk=Devious Dungeon (3.61+!) [3.68]
PCSG90315/PCSG90315-03_680-01_00-01_00.ppk=Sakura Sakura (DEMO) (3.61+!) [3.68]
PCSE01151/PCSE01151-03_650-01_00-01_00.ppk=Squareboy vs Bullies: Arena Edition (3.61+!) [3.65]
PCSE00980/PCSE00980-03_610-01_00-01_00.ppk=Air Race Speed (3.61+!) [3.61]
PCSG01029/PCSG01029-03_630-01_00-01_01.ppk=Gal*Gun: Double Peace Bilingual (3.61+!) [3.63]
PCSG00782/PCSG00782-03_610-01_00-01_02.ppk=RecoLove: Gold Beach (3.61+!) [3.61]
PCSE01135/PCSE01135-03_650-01_00-01_01.ppk=Burly Men at Sea (3.61+!) [3.65]
PCSG00908/PCSG00908-03_630-01_00-01_00.ppk=Saki: Zenkoku-hen Plus (3.61+!) [3.63]
PCSG01264/PCSG01264-03_690-01_00-01_00.ppk=MEMORIES OFF -INNOCENT FILLE- FOR DEAREST (CHI/JPN) (3.61+!) [3.69]
PCSE01355/PCSE01355-03_690-01_00-01_00.ppk=Scintillatron 4096 (3.61+!) [3.69]
PCSG01221/PCSG01221-03_690-01_00-01_01.ppk=Beniiro Tenjou Ayakashi Kitan Futaai
PCSB01056/PCSB01056-03_650-01_00-01_00.ppk=Hakuoki: Edo Blossoms (3.61+!) [3.65]
PCSB01184/PCSB01184-03_650-01_00-01_01.ppk=36 Fragments of Midnight (3.61+!) [3.65]
PCSE01288/PCSE01288-03_680-01_00-01_01.ppk=Punch Line (3.61+!) [3.68]
PCSB01028/PCSB01028-03_630-01_00-01_01.ppk=Shantae: Half-Genie Hero (3.61+!) [3.63]
PCSB01021/PCSB01021-03_610-01_00-01_00.ppk=Exile's End (3.61+!) [3.61]
PCSH10133/PCSH10133-03_680-01_00-01_01.ppk=Memories Off -Innocent Fille- (3.61+!) [3.68]
PCSG01107/PCSG01107-03_650-01_00-01_00.ppk=Nora To Oujo To Noraneko Heart (3.61+!) [3.65]
PCSG00637/PCSG00637-03_650-01_00-01_01.ppk=Taiheiyou no Arashi: Shijousaidai no Gekisen Normandy Koubousen
PCSE01427/PCSE01427-03_690-01_00-01_00.ppk=Himno
PCSE01004/PCSE01004-03_650-01_00-01_01.ppk=Nurse Love Addiction (3.61+!) [3.65]
PCSE00955/PCSE00955-03_630-01_00-01_01.ppk=Fallen Legion: Flames of Rebellion (3.61+!) [3.63]
PCSE01057/PCSE01057-03_650-01_00-01_00.ppk=Code: Realize - Future Blessings (3.61+!) [3.65]
PCSG00600/PCSG00600-03_610-01_00-01_02.ppk=Fate/Extella (3.61+!) [3.61]
PCSB00910/PCSB00910-03_610-01_00-01_01.ppk=Neon Chrome (3.61+!) [3.61]
PCSH10151/PCSH10151-03_690-01_00-01_00.ppk=Zeroptian Invasion
PCSH10157/PCSH10157-03_690-01_00-01_00.ppk=Energy Invasion
PCSE01188/PCSE01188-03_680-01_00-01_02.ppk=I Am The Hero (3.61+!) [3.68]
PCSE00956/PCSE00956-03_670-01_00-01_02.ppk=Mercenary Kings Reloaded (3.61+!) [3.67]
PCSE01181/PCSE01181-03_670-01_00-01_01.ppk=DEAD AHEAD: ZOMBIE WARFARE (3.61+!) [3.67]
PCSH10082/PCSH10082-03_670-01_00-01_00.ppk=The Legend of Heroes Sora No Kiseki the 3rd Evolution (3.61+!) [3.67]
PCSG00861/PCSG00861-03_610-01_00-01_01.ppk=DYNAMIC CHORD feat.Liar-S V edition (3.61+!) [3.61]
PCSB01103/PCSB01103-03_630-01_00-01_01.ppk=The Caligula Effect (3.61+!) [3.63]
PCSE00923/PCSE00923-03_630-01_00-01_02.ppk=Shu (3.61+!) [3.63]
PCSG01289/PCSG01289-03_690-01_00-01_00.ppk=軍靴をはいた猫
PCSE01371/PCSE01371-03_690-01_00-01_00.ppk=Zeroptian Invasion
PCSE01426/PCSE01426-03_690-01_00-01_00.ppk=Legend of the Skyfish
PCSG00994/PCSG00994-03_610-01_00-01_00.ppk=Daisenryaku WEB
PCSG00902/PCSG00902-03_610-01_00-01_01.ppk=Torikago no Marriage: Hatsukoi no Tsubasa (3.61+!) [3.61]
PCSE00973/PCSE00973-03_630-01_00-01_00.ppk=Hakuoki: Kyoto Winds (3.61+!) [3.63]
PCSG01007/PCSG01007-03_630-01_00-01_01.ppk=Kamaitachi no Yoru: Rinne Saisei (3.61+!) [3.63]
PCSG01117/PCSG01117-03_650-01_00-01_00.ppk=Goetia: The Infinite Tower (3.61+!) [3.65]
PCSH10026/PCSH10026-03_630-01_00-01_00.ppk=Atelier Firis ~The Alchemist and the Mysterious Journey~ (3.61+!) [3.63]
PCSE01051/PCSE01051-03_650-01_00-01_02.ppk=Factotum90 (3.61+!) [3.65]
PCSB01212/PCSB01212-03_670-01_00-01_01.ppk=Deep Ones (3.61+!) [3.67]
PCSH10075/PCSH10075-03_670-01_00-01_01.ppk=A Certain Magical Virtual-On (3.61+!) [3.67]
PCSE00901/PCSE00901-03_630-01_00-01_01.ppk=Dex (3.61+!) [3.63]
PCSG01115/PCSG01115-03_650-01_00-01_02.ppk=VitaminX Destination (3.61+!) [3.65]
PCSG01102/PCSG01102-03_670-01_00-01_01.ppk=Attack on Titan 2 (3.61+!) [3.67]
PCSE01164/PCSE01164-03_670-01_00-01_01.ppk=Psychedelica of the Black Butterfly (3.61+!) [3.67]
PCSG01205/PCSG01205-03_680-01_00-01_00.ppk=Boku to Nurse no Kenshuu Nisshi (3.61+!) [3.68]
PCSE01258/PCSE01258-03_680-01_00-01_02.ppk=Halloween Forever (3.61+!) [3.68]
PCSG01179/PCSG01179-03_690-01_00-01_00.ppk=Catherine: Full Body (3.61+!) [3.69]
PCSE01100/PCSE01100-03_650-01_00-01_01.ppk=Danganronpa V3: Killing Harmony (3.61+!) [3.65]
PCSE01048/PCSE01048-03_630-01_00-01_00.ppk=Fairune (3.61+!) [3.63]
PCSB01079/PCSB01079-03_650-01_00-01_01.ppk=Velocity 2X: Critical Mass Edition (3.61+!) [3.65]
PCSE01419/PCSE01419-03_690-01_00-01_00.ppk=Asdivine Menace
PCSG01063/PCSG01063-03_670-01_00-01_00.ppk=Ikemen Sengoku: Toki wo Kakeru Koi - Aratanaru Deai (3.61+!) [3.67]
PCSB01358/PCSB01358-03_690-01_00-01_00.ppk=Attack of the Toy Tanks
PCSG90307/PCSG90307-03_670-01_00-01_00.ppk=Galtia V Edition 体験版 (DEMO) (3.61+!) [3.67]
PCSE01011/PCSE01011-03_650-01_00-01_00.ppk=Collar X Malice (3.61+!) [3.65]
PCSB01082/PCSB01082-03_630-01_00-01_04.ppk=Kung Fury: Street Rage (3.61+!) [3.63]
PCSH10137/PCSH10137-03_690-01_00-01_00.ppk=Warlock's Tower
PCSE01384/PCSE01384-03_690-01_00-01_01.ppk=Gravity Duck
PCSH10090/PCSH10090-03_670-01_00-01_02.ppk=7'scarlet (CHI/KOR) (3.61+!) [3.67]
PCSE01361/PCSE01361-03_690-01_00-01_00.ppk=Necrosphere Deluxe (3.61+!) [3.69]
PCSG01153/PCSG01153-03_650-01_00-01_00.ppk=Katahane -An' call Belle- (3.61+!) [3.65]
PCSB01053/PCSB01053-03_630-01_00-01_01.ppk=Full Throttle Remastered (3.61+!) [3.63]
PCSB00920/PCSB00920-03_610-01_00-01_04.ppk=Bridge Constructor (3.61+!) [3.61]
PCSG90321/PCSG90321-03_690-01_00-01_00.ppk=Soi Kano: Gyutto Dakishimete (DEMO) (3.61+!) [3.69]
PCSE01259/PCSE01259-03_670-01_00-01_00.ppk=Muv-Luv (3.61+!) [3.67]
PCSB01072/PCSB01072-03_630-01_00-01_01.ppk=Salt and Sanctuary (3.61+!) [3.63]
PCSG01255/PCSG01255-03_690-01_00-01_00.ppk=Catherine: Full Body Soundtrack (3.61+!) [3.69]
PCSG90330/PCSG90330-03_690-01_00-01_00.ppk=Yumeutsutsu Re:Master (DEMO)
PCSG00842/PCSG00842-03_630-01_00-01_00.ppk=Damascus Gear: Saikyou Exodus (3.61+!) [3.63]
PCSH00300/PCSH00300-03_610-01_00-01_02.ppk=Coven and Labyrinth of Refrain (KOR) (3.61+!) [3.61]
PCSB01145/PCSB01145-03_650-01_00-01_00.ppk=Utawarerumono: Mask of Truth (3.61+!) [3.65]
PCSE01180/PCSE01180-03_670-01_00-01_01.ppk=Damascus Gear: Operation Osaka (3.61+!) [3.67]
PCSE01334/PCSE01334-03_680-01_00-01_01.ppk=Fast Striker (3.61+!) [3.68]
PCSB01132/PCSB01132-03_650-01_00-01_02.ppk=It's Spring Again (3.61+!) [3.65]
PCSB01062/PCSB01062-03_630-01_00-01_00.ppk=Tokyo Xanadu (3.61+!) [3.63]
PCSB01251/PCSB01251-03_680-01_00-01_02.ppk=Super Destronaut DX (3.61+!) [3.68]
PCSB01012/PCSB01012-03_610-01_00-01_01.ppk=Steins;Gate 0 (3.61+!) [3.61]
PCSE00982/PCSE00982-03_610-01_00-01_02.ppk=My Name is Mayo (3.61+!) [3.61]
PCSH00299/PCSH00299-03_610-01_00-01_00.ppk=Fate/Extella (3.61+!) [3.61]
PCSB00948/PCSB00948-03_630-01_00-01_04.ppk=iO (3.61+!) [3.63]
PCSG00911/PCSG00911-03_610-01_00-01_01.ppk=Re:BIRTHDAY SONG: Koi o Utau Shinigami (3.61+!) [3.61]
PCSB01099/PCSB01099-03_650-01_00-01_00.ppk=Code: Realize ~Future Blessings~ (3.61+!) [3.65]
PCSG01039/PCSG01039-03_650-01_00-01_01.ppk=Hello Lady! Superior Dynamis (3.61+!) [3.65]
PCSI00009/PCSI00009-03_000-01_00-01_00.ppk=PlayStation Mobile Development Assistant for Unity
PCSG00961/PCSG00961-03_630-01_00-01_00.ppk=Fata Morgana no Yakata (3.61+!) [3.63]
PCSE00869/PCSE00869-03_610-01_00-01_03.ppk=Bridge Constructor (3.61+!) [3.61]
PCSB01096/PCSB01096-03_630-01_00-01_01.ppk=Siralim 2 (3.61+!) [3.63]
PCSH10004/PCSH10004-03_630-01_00-01_00.ppk=Super Robot Wars V (CHI) (3.61+!) [3.63]
PCSB01052/PCSB01052-03_630-01_00-01_01.ppk=Cladun Returns: This Is Sengoku! (3.61+!) [3.63]
PCSG01266/PCSG01266-03_690-01_00-01_01.ppk=Yumeutsutsu Re:Master
PCSE01169/PCSE01169-03_650-01_00-01_01.ppk=36 Fragments of Midnight (3.61+!) [3.65]
PCSE01224/PCSE01224-03_670-01_00-01_00.ppk=THE KING OF FIGHTERS ’97 GLOBAL MATCH (3.61+!) [3.67]
PCSG00573/PCSG00573-03_650-01_00-01_02.ppk=The Lost Child (3.61+!) [3.65]
PCSB01136/PCSB01136-03_650-01_00-01_01.ppk=Fallen Legion: Flames of Rebellion (3.61+!) [3.65]
PCSG01253/PCSG01253-03_690-01_00-01_01.ppk=Karigurashi Renai
PCSE01275/PCSE01275-03_680-01_00-01_01.ppk=Persona 5: Dancing in Starlight (3.61+!) [3.68]
PCSH10121/PCSH10121-03_680-01_00-01_00.ppk=Fate/Extella LINK (3.61+!) [3.68]
PCSG01259/PCSG01259-03_690-01_00-01_01.ppk=Silverio Trinity: BEYOND THE HORIZON (3.61+!) [3.69]
PCSB01361/PCSB01361-03_690-01_00-01_02.ppk=Cybarian: The Time Traveling Warrior
PCSG01143/PCSG01143-03_670-01_00-01_01.ppk=Browser San Goku Shi (3.61+!) [3.67]
PCSB01047/PCSB01047-03_630-01_00-01_00.ppk=Lichtspeer (3.61+!) [3.63]
PCSG01267/PCSG01267-03_690-01_00-01_00.ppk=your diary +
PCSB01032/PCSB01032-03_630-01_00-01_00.ppk=Hakuoki: Kyoto Winds (3.61+!) [3.63]
PCSB01204/PCSB01204-03_670-01_00-01_01.ppk=Midnight Deluxe (3.61+!) [3.67]
PCSG90294/PCSG90294-03_650-01_00-01_00.ppk=Hello Lady! Superior Dynamis (DEMO) (3.61+!) [3.65]
PCSB01309/PCSB01309-03_690-01_00-01_02.ppk=Daggerhood (3.61+!) [3.69]
PCSE01278/PCSE01278-03_690-01_00-01_01.ppk=Code: Realize ~Wintertide Miracles~ (3.61+!) [3.69]
PCSE00364/PCSE00364-03_630-01_00-01_08.ppk=WeatherNation (3.61+!) [3.63]
PCSE01274/PCSE01274-03_680-01_00-01_01.ppk=Persona 3: Dancing in Moonlight (3.61+!) [3.68]
PCSB01120/PCSB01120-03_650-01_00-01_00.ppk=Romancing SaGa 2 (3.61+!) [3.65]
PCSE01277/PCSE01277-03_680-01_00-01_03.ppk=STAY (3.61+!) [3.68]
PCSH10059/PCSH10059-03_650-01_00-01_02.ppk=Digimon Story Cyber Sleuth Hacker's Memory (CHI) (3.61+!) [3.65]
PCSH10060/PCSH10060-03_650-01_00-01_00.ppk=The Legend of Heroes Sora No Kiseki SC Evolution (3.61+!) [3.65]
PCSE00942/PCSE00942-03_630-01_00-01_02.ppk=SuperMagical (3.61+!) [3.63]
PCSG90314/PCSG90314-03_680-01_00-01_00.ppk=初情スプリンクル (DEMO) (3.61+!) [3.68]
PCSG00988/PCSG00988-03_630-01_00-01_00.ppk=Hatsuru Kotonaki Mirai Yori (3.61+!) [3.63]
PCSG00865/PCSG00865-03_610-01_00-01_01.ppk=Idol Death Game TV (3.61+!) [3.61]
PCSH10008/PCSH10008-03_630-01_00-01_00.ppk=VALKYRIA: AZURE REVOLUTION (3.61+!) [3.63]
PCSG01218/PCSG01218-03_680-01_00-01_00.ppk=Grisaia Phantom Trigger EP3 & EP4 (3.61+!) [3.68]
PCSB01041/PCSB01041-03_650-01_00-01_01.ppk=The Bard's Tale: Remastered and Resnarkled (3.61+!) [3.65]
PCSG00968/PCSG00968-03_650-01_00-01_01.ppk=Taishou Mebiusline: Teito Bibouroku Hare (3.61+!) [3.65]
PCSH10099/PCSH10099-03_680-01_00-01_02.ppk=Bullet Girls Phantasia (ENG/CHI/JPN/KOR) (3.61+!) [3.68]
PCSG90313/PCSG90313-03_690-01_00-01_01.ppk=紅色天井艶妖綺譚 二藍 (DEMO) (3.61+!) [3.69]
PCSB01131/PCSB01131-03_650-01_00-01_02.ppk=The Count Lucanor (3.61+!) [3.65]
PCSG01282/PCSG01282-03_690-01_00-01_01.ppk=Shinigami to Shoujo
PCSE01171/PCSE01171-03_650-01_00-01_00.ppk=Digimon Story: Cyber Sleuth - Hacker's Memory (3.61+!) [3.65]
PCSE01380/PCSE01380-03_690-01_00-01_00.ppk=Frane: Dragons' Odyssey
PCSB01317/PCSB01317-03_690-01_00-01_01.ppk=Perils of Baking - Refrosted
PCSE01175/PCSE01175-03_650-01_00-01_01.ppk=Spiral Splatter (3.61+!) [3.65]
PCSE01015/PCSE01015-03_630-01_00-01_00.ppk=Touhou Double Focus (3.61+!) [3.63]
PCSG01288/PCSG01288-03_690-01_00-01_00.ppk=Refalsia no Genei
PCSG01020/PCSG01020-03_630-01_00-01_00.ppk=Ikemen Bakumatsu: Unmei no Koi (3.61+!) [3.63]
PCSH10152/PCSH10152-03_690-01_00-01_01.ppk=Iron Snout
PCSE01368/PCSE01368-03_690-01_00-01_00.ppk=Bonds of the Skies (3.61+!) [3.69]
PCSG01256/PCSG01256-03_690-01_00-01_00.ppk=Necrosphere Deluxe (3.61+!) [3.69]
PCSE01221/PCSE01221-03_670-01_00-01_00.ppk=Metropolis: Lux Obscura (3.61+!) [3.67]
PCSB01068/PCSB01068-03_630-01_00-01_01.ppk=Oceanhorn: Monster of Uncharted Seas (3.61+!) [3.63]
PCSG00567/PCSG00567-03_630-01_00-01_01.ppk=YU-NO: Konoyo no Hate de Koi o Utau Shoujo (3.61+!) [3.63]
PCSH10147/PCSH10147-03_690-01_00-01_01.ppk=Access Denied (3.61+!) [3.69]
PCSG00895/PCSG00895-03_610-01_00-01_01.ppk=Yahari Game Demo Ore no Seishun Love-Kome wa Machigatteiru. Zoku (3.61+!) [3.61]
PCSE01318/PCSE01318-03_690-01_00-01_01.ppk=Nurse Love Syndrome
PCSB01214/PCSB01214-03_670-01_00-01_00.ppk=Metropolis: Lux Obscura (3.61+!) [3.67]
PCSG00929/PCSG00929-03_610-01_00-01_02.ppk=Atelier Firis ~The Alchemist and the Mysterious Journey~ (3.61+!) [3.61]
PCSE00957/PCSE00957-03_610-01_00-01_01.ppk=Knobswitch (3.61+!) [3.61]
PCSG01016/PCSG01016-03_630-01_00-01_01.ppk=Accel World vs Sword Art Online: Millennium Twilight (3.61+!) [3.63]
PCSG90286/PCSG90286-03_650-01_00-01_00.ppk=Kimi no Hitomi ni Hit Me (DEMO) (3.61+!) [3.65]
PCSE01031/PCSE01031-03_680-01_00-01_01.ppk=Chasm (3.61+!) [3.68]
PCSB01100/PCSB01100-03_680-01_00-01_02.ppk=Super Mutant Alien Assault (3.61+!) [3.68]
PCSG01109/PCSG01109-03_650-01_00-01_00.ppk=Onigiri (3.61+!) [3.65]
PCSG01014/PCSG01014-03_650-01_00-01_00.ppk=Nil Admirari no Tenbin: Kuroyuri En'youtan (3.61+!) [3.65]
PCSE01019/PCSE01019-03_650-01_00-01_03.ppk=Bodycheck (3.61+!) [3.65]
PCSB01043/PCSB01043-03_630-01_00-01_01.ppk=Atelier Shallie Plus: Alchemists of the Dusk Sea (3.61+!) [3.63]
PCSE01314/PCSE01314-03_690-01_00-01_01.ppk=VASARA Collection
PCSE01139/PCSE01139-03_650-01_00-01_01.ppk=Yomawari: Midnight Shadows (3.61+!) [3.65]
PCSE01415/PCSE01415-03_690-01_00-01_02.ppk=Super Wiloo Demake
PCSH10123/PCSH10123-03_680-01_00-01_01.ppk=FullBlast (ENG/CHI/KOR/JPN) (3.61+!) [3.68]
PCSG00903/PCSG00903-03_630-01_00-01_02.ppk=NEW GAME! -THE CHALLENGE STAGE!- (3.61+!) [3.63]
PCSH10065/PCSH10065-03_650-01_00-01_01.ppk=FORTUNE STREET DRAGON QUEST ＆ FINAL FANTASY 30th ANNIVERSARY (3.61+!) [3.65]
PCSG90281/PCSG90281-03_650-01_00-01_00.ppk=学園CLUB ～ヒミツのナイトクラブ～ 体験版 (DEMO) (3.61+!) [3.65]
PCSG00941/PCSG00941-03_650-01_00-01_01.ppk=Crank In
PCSH10078/PCSH10078-03_650-01_00-01_02.ppk=Unepic (CHI-ENG-FRA-DEU-ITA-KOR-RUS-TW) (3.61+!) [3.65]
PCSE01150/PCSE01150-03_650-01_00-01_01.ppk=Tokyo Tattoo Girls (3.61+!) [3.65]
PCSG01182/PCSG01182-03_670-01_00-01_00.ppk=Kanojo * Step (3.61+!) [3.67]
PCSE00444/PCSE00444-03_610-01_00-01_00.ppk=Battalion Commander (3.61+!) [3.61]
PCSB01122/PCSB01122-03_650-01_00-01_01.ppk=Rabi-Ribi (3.61+!) [3.65]
PCSG01123/PCSG01123-03_650-01_00-01_00.ppk=Banbutsu otome danjonzu (3.61+!) [3.65]
PCSB01107/PCSB01107-03_690-01_00-01_02.ppk=Peasant Knight (3.61+!) [3.69]
PCSE01152/PCSE01152-03_650-01_00-01_01.ppk=Cursed Castilla (Maldita Castilla EX) (3.61+!) [3.65]
PCSE00822/PCSE00822-03_610-01_00-01_00.ppk=Uncanny Valley (3.61+!) [3.61]
PCSE01245/PCSE01245-03_680-01_00-01_02.ppk=Ice Cream Surfer (3.61+!) [3.68]
PCSB00839/PCSB00839-03_680-01_00-01_01.ppk=Roundabout (3.61+!) [3.68]
PCSB01059/PCSB01059-03_650-01_00-01_00.ppk=Mary Skelter: Nightmares (3.61+!) [3.65]
PCSH10101/PCSH10101-03_680-01_00-01_02.ppk=NEW GAME! -THE CHALLENGE STAGE!- (3.61+!) [3.68]
PCSB01049/PCSB01049-03_610-01_00-01_00.ppk=KILLALLZOMBIES (3.61+!) [3.61]
PCSB01210/PCSB01210-03_650-01_00-01_01.ppk=Little Adventure on the Prairie (3.61+!) [3.65]
PCSG90322/PCSG90322-03_690-01_00-01_02.ppk=フルキス (DEMO) (3.61+!) [3.69]
PCSB00527/PCSB00527-03_630-01_00-01_00.ppk=forma.8 (3.61+!) [3.63]
PCSG01146/PCSG01146-03_650-01_00-01_00.ppk=Dragon Sinker
PCSG00802/PCSG00802-03_610-01_00-01_00.ppk=SaGa SCARLET GRACE (3.61+!) [3.61]
PCSE01000/PCSE01000-03_630-01_00-01_01.ppk=Full Throttle Remastered (3.61+!) [3.63]
PCSG01196/PCSG01196-03_670-01_00-01_01.ppk=sweet pool (3.61+!) [3.67]
PCSG90291/PCSG90291-03_650-01_00-01_00.ppk=Nora to Koujo to Noraneko Heart (DEMO) (3.61+!) [3.65]
PCSB01240/PCSB01240-03_670-01_00-01_02.ppk=Devious Dungeon (3.61+!) [3.67]
PCSG00991/PCSG00991-03_630-01_00-01_01.ppk=Getsuei no Kusari: Kouran Moratorium (3.61+!) [3.63]
PCSE00862/PCSE00862-03_610-01_00-01_01.ppk=Skylight Freerange 2: Gachduine (3.61+!) [3.61]
PCSE01038/PCSE01038-03_650-01_00-01_05.ppk=Vostok Inc. (3.61+!) [3.65]
PCSE01249/PCSE01249-03_670-01_00-01_02.ppk=Devious Dungeon (3.61+!) [3.67]
PCSE01343/PCSE01343-03_690-01_00-01_02.ppk=Back in 1995
PCSG01072/PCSG01072-03_650-01_00-01_01.ppk=VA-11 Hall-A (3.61+!) [3.65]
PCSE01385/PCSE01385-03_690-01_00-01_02.ppk=Devious Dungeon 2 (3.61+!) [3.69]
PCSG01094/PCSG01094-03_650-01_00-01_00.ppk=IDOLiSH7 Twelve Fantasia! (3.61+!) [3.65]
PCSG00797/PCSG00797-03_610-01_00-01_01.ppk=Boku wa Mori Sekai no Kami Tonaru (3.61+!) [3.61]
PCSE01026/PCSE01026-03_630-01_00-01_01.ppk=GOD WARS Future Past (3.61+!) [3.63]
PCSG01260/PCSG01260-03_690-01_00-01_02.ppk=FuruKiss (3.61+!) [3.69]
PCSG01110/PCSG01110-03_650-01_00-01_01.ppk=Code: Realize ~Shirogane no Kiseki~ (3.61+!) [3.65]
PCSG01084/PCSG01084-03_650-01_00-01_00.ppk=Wagamama High Spec (3.61+!) [3.65]
PCSG90323/PCSG90323-03_690-01_00-01_00.ppk=Catherine: Full Body (DEMO) (3.61+!) [3.69]
PCSG01023/PCSG01023-03_630-01_00-01_01.ppk=Tsuihou Senkyo (3.61+!) [3.63]
PCSE01096/PCSE01096-03_670-01_00-01_02.ppk=Bit Dungeon Plus (3.61+!) [3.67]
PCSG00922/PCSG00922-03_610-01_00-01_00.ppk=Furuki Yoki Jidai no Boukentan (3.61+!) [3.61]
PCSG01018/PCSG01018-03_630-01_00-01_02.ppk=Musou Stars
PCSG00987/PCSG00987-03_630-01_00-01_01.ppk=Blue Reflection: Maboroshi ni Mau - Shoujo no Ken (3.61+!) [3.63]
PCSH10017/PCSH10017-03_630-01_00-01_00.ppk=Akiba's Beat (3.61+!) [3.63]
PCSH10085/PCSH10085-03_670-01_00-01_01.ppk=The Legend of Heroes Sora No Kiseki the 3rd Evolution Trial Version (DEMO) (3.61+!) [3.67]
PCSG01136/PCSG01136-03_650-01_00-01_01.ppk=Demon Gaze II Global Edition (ENG/JPN) (3.61+!) [3.65]
PCSG01198/PCSG01198-03_670-01_00-01_00.ppk=Amatsutsumi (3.61+!) [3.67]
PCSB01290/PCSB01290-03_680-01_00-01_01.ppk=Energy Cycle Edge (DEMO) (3.61+!) [3.68]
PCSG00986/PCSG00986-03_650-01_00-01_02.ppk=Nights of Azure 2: Bride of the New Moon (3.61+!) [3.65]
PCSE01356/PCSE01356-03_690-01_00-01_02.ppk=Access Denied (3.61+!) [3.69]
PCSE00995/PCSE00995-03_610-01_00-01_01.ppk=Dynasty Warriors: Godseekers (3.61+!) [3.61]
PCSG01270/PCSG01270-03_690-01_00-01_00.ppk=Pic-a-Pix Pieces
PCSE01286/PCSE01286-03_680-01_00-01_01.ppk=Word Search by POWGI (3.61+!) [3.68]
PCSG00999/PCSG00999-03_610-01_00-01_01.ppk=Touhou Koubutou V (3.61+!) [3.61]
PCSB01230/PCSB01230-03_670-01_00-01_01.ppk=InkSplosion (3.61+!) [3.67]
PCSE01036/PCSE01036-03_630-01_00-01_01.ppk=Kung Fury: Street Rage (3.61+!) [3.63]
PCSG00959/PCSG00959-03_630-01_00-01_01.ppk=Desire: Remaster Ver. (3.61+!) [3.63]
PCSB01226/PCSB01226-03_670-01_00-01_01.ppk=Stardew Valley (3.61+!) [3.67]
PCSB01154/PCSB01154-03_650-01_00-01_01.ppk=Licky The Lucky Lizard Lives Again (3.61+!) [3.65]
PCSE01045/PCSE01045-03_690-01_00-01_02.ppk=Warlock's Tower
PCSB01080/PCSB01080-03_630-01_00-01_00.ppk=Farming Simulator 18 (3.61+!) [3.63]
PCSG01159/PCSG01159-03_690-01_00-01_01.ppk=VARIABLE BARRICADE (3.61+!) [3.69]
PCSG01275/PCSG01275-03_690-01_00-01_00.ppk=Hakuisei Renai Shoukougun RE:Therapy
PCSG90298/PCSG90298-03_650-01_00-01_00.ppk=塔亰Clanpool　体験版 (DEMO) (3.61+!) [3.65]
PCSH10057/PCSH10057-03_650-01_00-01_00.ppk=Hakuouki Shinkai Hanano-Sho (3.61+!) [3.65]
PCSE01377/PCSE01377-03_690-01_00-01_01.ppk=Crossovers by POWGI (3.61+!) [3.69]
PCSG00970/PCSG00970-03_630-01_00-01_00.ppk=KLAP!! ～Kind Love And Punish～ Fun Party
PCSE01052/PCSE01052-03_630-01_00-01_00.ppk=STRANGER OF SWORD CITY REVISITED (3.61+!) [3.63]
PCSB01119/PCSB01119-03_630-01_00-01_02.ppk=Plantera (3.61+!) [3.63]
PCSE01268/PCSE01268-03_680-01_00-01_02.ppk=Pato Box (3.61+!) [3.68]
PCSG00916/PCSG00916-03_630-01_00-01_01.ppk=Starry Sky: Summer Stories (3.61+!) [3.63]
PCSH10126/PCSH10126-03_680-01_00-01_01.ppk=GOD WARS THE COMPLETE LEGEND (3.61+!) [3.68]
PCSH10143/PCSH10143-03_690-01_00-01_00.ppk=Bouncy Bullets
PCSH00242/PCSH00242-03_610-01_00-01_00.ppk=SD GUNDAM G GENERATION GENESIS (ENG) (3.61+!) [3.61]
PCSE01153/PCSE01153-03_670-01_00-01_00.ppk=Secret of Mana (3.61+!) [3.67]
PCSG01262/PCSG01262-03_690-01_00-01_00.ppk=Bonds of the Skies (3.61+!) [3.69]
PCSH00301/PCSH00301-03_610-01_00-01_01.ppk=GENKAITOKKI MOERO CRYSTAL (3.61+!) [3.61]
PCSB00973/PCSB00973-03_570-01_00-01_01.ppk=Atelier Sophie: The Alchemist of the Mysterious Book
PCSH10091/PCSH10091-03_670-01_00-01_02.ppk=Psychedelica of Gray Hawk (CHI/KOR) (3.61+!) [3.67]
PCSB01061/PCSB01061-03_650-01_00-01_00.ppk=Collar x Malice (3.61+!) [3.65]
PCSG00919/PCSG00919-03_610-01_00-01_00.ppk=Orfleurs: Koufuku no Hanataba (3.61+!) [3.61]
PCSB01173/PCSB01173-03_650-01_00-01_00.ppk=99Vidas (3.61+!) [3.65]
PCSG01210/PCSG01210-03_680-01_00-01_00.ppk=Seven Days: Anata to Sugosu Nanokakan (3.61+!) [3.68]
PCSG01223/PCSG01223-03_690-01_00-01_01.ppk=Nelke & the Legendary Alchemists: Ateliers of the New World (3.61+!) [3.69]
PCSG01247/PCSG01247-03_690-01_00-01_01.ppk=Panic Palette (3.61+!) [3.69]
PCSE01340/PCSE01340-03_690-01_00-01_01.ppk=Ghoulboy: Dark Sword of Goblin (3.61+!) [3.69]
PCSB01044/PCSB01044-03_610-01_00-01_01.ppk=Dynasty Warriors: Godseekers (3.61+!) [3.61]
PCSH10096/PCSH10096-03_680-01_00-01_01.ppk=League of Evil (ENG/CHI/KOR) (3.61+!) [3.68]
PCSG01254/PCSG01254-03_690-01_00-01_00.ppk=Soi Kano ~Gyutto Dakishimete~
PCSG01071/PCSG01071-03_650-01_00-01_02.ppk=Photon 3 (3.61+!) [3.65]
PCSB01092/PCSB01092-03_650-01_00-01_01.ppk=Bad Apple Wars (3.61+!) [3.65]
PCSE01021/PCSE01021-03_630-01_00-01_02.ppk=The Deer God (3.61+!) [3.63]
PCSG00954/PCSG00954-03_610-01_00-01_01.ppk=Sengoku Musou: Sanada Maru
PCSG01269/PCSG01269-03_690-01_00-01_00.ppk=RPG Dragons Odyssey Frane (3.61+!) [3.69]
PCSB01192/PCSB01192-03_650-01_00-01_04.ppk=Iconoclasts (3.61+!) [3.65]
PCSE01046/PCSE01046-03_630-01_00-01_00.ppk=A Rose in the Twilight (3.61+!) [3.63]
PCSB01188/PCSB01188-03_650-01_00-01_01.ppk=Spiral Splatter (3.61+!) [3.65]
PCSB01360/PCSB01360-03_690-01_00-01_00.ppk=Paradox Soul
PCSE01333/PCSE01333-03_680-01_00-01_00.ppk=Atari Flashback Classics (3.61+!) [3.68]
PCSG01258/PCSG01258-03_690-01_00-01_01.ppk=Kono Subarashii Sekai ni Syukufuku wo! Kibou no Meikyuu to Tsudoishi Boukenshatachi
PCSB01030/PCSB01030-03_610-01_00-01_01.ppk=Fate/Extella: The Umbral Star (3.61+!) [3.61]
PCSE00966/PCSE00966-03_610-01_00-01_00.ppk=Iron Sea Defenders (3.61+!) [3.61]
PCSB00954/PCSB00954-03_630-01_00-01_02.ppk=Shu (3.61+!) [3.63]
PCSB01157/PCSB01157-03_650-01_00-01_00.ppk=Undertale (3.61+!) [3.65]
PCSG01116/PCSG01116-03_650-01_00-01_02.ppk=Atelier Lydie & Suelle: Fushigi na Kaiga no Renkinjutsushi (3.61+!) [3.65]
PCSG01150/PCSG01150-03_680-01_00-01_01.ppk=CharadeManiacs (3.61+!) [3.68]
PCSB01242/PCSB01242-03_670-01_00-01_00.ppk=Riddled Corpses EX (3.61+!) [3.67]
PCSG01132/PCSG01132-03_680-01_00-01_00.ppk=殺し屋とストロベリー
PCSH00293/PCSH00293-03_650-01_00-01_04.ppk=Ninja Usagimaru: Two Tails of Adventure (3.61+!) [3.65]
PCSG01174/PCSG01174-03_670-01_00-01_01.ppk=Winning Post 8 2018
PCSE01398/PCSE01398-03_690-01_00-01_02.ppk=Neon Junctions
PCSB00953/PCSB00953-03_630-01_00-01_02.ppk=Dex (3.61+!) [3.63]
PCSG01200/PCSG01200-03_680-01_00-01_00.ppk=Dungeon Hunter 5 (3.61+!) [3.68]
PCSG01177/PCSG01177-03_670-01_00-01_00.ppk=Shiki hime no niwa (3.61+!) [3.67]
PCSE01179/PCSE01179-03_670-01_00-01_00.ppk=The Lost Child (3.61+!) [3.67]
PCSH10007/PCSH10007-03_610-01_00-01_01.ppk=DYNASTY WARRIORS: Godseekers (DEMO)
PCSE00036/PCSE00036-03_610-01_00-01_01.ppk=Wanted Corp. (3.61+!) [3.61]
PCSH10089/PCSH10089-03_670-01_00-01_00.ppk=SUPER ROBOT WARS X (CHI/KOR) (3.61+!) [3.67]
PCSG00938/PCSG00938-03_630-01_00-01_01.ppk=Wand of Fortune R2: Jikuu ni Shizumu Mokushiroku (3.61+!) [3.63]
PCSB01050/PCSB01050-03_610-01_00-01_00.ppk=Sword Art Online: Hollow Realization - Original Soundtrack (3.61+!) [3.61]
PCSG00971/PCSG00971-03_630-01_00-01_01.ppk=Asdivine Hearts (3.61+!) [3.63]
PCSG01236/PCSG01236-03_680-01_00-01_01.ppk=Fast Striker
PCSG01093/PCSG01093-03_650-01_00-01_00.ppk=Kono Subarashii Sekai ni Shukufuku wo! Attack of the Destroyer (3.61+!) [3.65]
PCSE01193/PCSE01193-03_670-01_00-01_01.ppk=Dragooned (3.61+!) [3.67]
PCSG00942/PCSG00942-03_610-01_00-01_02.ppk=Otome Riron to Sono Shuuhen: Bon Voyage (3.61+!) [3.61]
PCSH00308/PCSH00308-03_630-01_00-01_01.ppk=ROMANCE OF THE THREE KINGDOMS XIII: Fame and Strategy (3.61+!) [3.63]
PCSB01291/PCSB01291-03_680-01_00-01_00.ppk=Energy Cycle Edge (3.61+!) [3.68]
PCSG00915/PCSG00915-03_670-01_00-01_01.ppk=DYNAMIC CHORD feat.apple-polisher V edition (3.61+!) [3.67]
PCSI00007/PCSI00007-01_650-01_00-01_00.ppk=PlayStation Suite Development Assistant
PCSG00996/PCSG00996-03_630-01_00-01_00.ppk=Kono Yo no Hate de Koi wo Utau Shoujo YU-NO Original NEC PC-9800 Series Version (3.61+!) [3.63]
PCSE01063/PCSE01063-03_630-01_00-01_01.ppk=Gem Smashers (3.61+!) [3.63]
PCSE01168/PCSE01168-03_670-01_00-01_01.ppk=7'scarlet (3.61+!) [3.67]
PCSH10127/PCSH10127-03_680-01_00-01_00.ppk=Jack N' Jill DX (ENG/CHI/JPN) (3.61+!) [3.68]
PCSE00929/PCSE00929-03_610-01_00-01_00.ppk=Stranded: A Mars Adventure (3.61+!) [3.61]
PCSG01263/PCSG01263-03_690-01_00-01_00.ppk=Asdivine Dios
PCSE01330/PCSE01330-03_680-01_00-01_01.ppk=Energy Cycle Edge (3.61+!) [3.68]
PCSH10058/PCSH10058-03_650-01_00-01_00.ppk=MUSYNC (3.61+!) [3.65]
PCSH00223/PCSH00223-03_610-01_00-01_00.ppk=WORLD OF FINAL FANTASY (3.61+!) [3.61]
PCSB01324/PCSB01324-03_690-01_00-01_00.ppk=Awesome Pea (3.61+!) [3.69]
PCSG01043/PCSG01043-03_630-01_00-01_00.ppk=Rewrite Harvest festa! (3.61+!) [3.63]
PCSG01216/PCSG01216-03_670-01_00-01_01.ppk=Bloodstained: Curse of the Moon (3.61+!) [3.67]
PCSB01254/PCSB01254-03_680-01_00-01_03.ppk=STAY (3.61+!) [3.68]
PCSG01281/PCSG01281-03_690-01_00-01_01.ppk=Chevalier of Sapphire Blade
PCSE01105/PCSE01105-03_650-01_00-01_01.ppk=Danganronpa V3: Killing Harmony (DEMO) (3.61+!) [3.65]
PCSG01005/PCSG01005-03_630-01_00-01_01.ppk=Shiin (3.61+!) [3.63]
PCSE00940/PCSE00940-03_630-01_00-01_01.ppk=Toukiden 2 (3.61+!) [3.63]
PCSE01183/PCSE01183-03_650-01_00-01_01.ppk=Sokoban Next (3.61+!) [3.65]
PCSG01112/PCSG01112-03_650-01_00-01_00.ppk=Undertale (3.61+!) [3.65]
PCSE01099/PCSE01099-03_630-01_00-01_00.ppk=Drive Girls (3.61+!) [3.63]
PCSE00949/PCSE00949-03_610-01_00-01_01.ppk=Steins;Gate 0 (3.61+!) [3.61]
PCSG01083/PCSG01083-03_650-01_00-01_00.ppk=Iwaihime -Matsuri- (3.61+!) [3.65]
PCSB01391/PCSB01391-03_690-01_00-01_00.ppk=Himno
PCSE01401/PCSE01401-03_690-01_00-01_00.ppk=Paradox Soul
PCSB01315/PCSB01315-03_690-01_00-01_02.ppk=Access Denied (3.61+!) [3.69]
PCSB01218/PCSB01218-03_670-01_00-01_00.ppk=THE KING OF FIGHTERS '97 GLOBAL MATCH (3.61+!) [3.67]
PCSE01162/PCSE01162-03_680-01_00-01_03.ppk=The Long Reach (3.61+!) [3.68]
PCSE00893/PCSE00893-03_630-01_00-01_00.ppk=Tokyo Xanadu (3.61+!) [3.63]
PCSE01190/PCSE01190-03_670-01_00-01_00.ppk=Dragon Sinker (3.61+!) [3.67]
PCSB01109/PCSB01109-03_690-01_00-01_02.ppk=Metagal (3.61+!) [3.69]
PCSB01246/PCSB01246-03_680-01_00-01_01.ppk=Fill-a-Pix: Phil's Epic Adventure (3.61+!) [3.68]
PCSG90279/PCSG90279-03_650-01_00-01_01.ppk=いただきストリート　ドラゴンクエスト＆ファイナルファンタジー　30th ANNIVERSARY　体験版 (DEMO) (3.61+!) [3.65]
PCSH10018/PCSH10018-03_630-01_00-01_00.ppk=Superdimension Neptune VS Sega Hard Girls (3.61+!) [3.63]
PCSB01146/PCSB01146-03_650-01_00-01_01.ppk=Son of Scoregasm (3.61+!) [3.65]
PCSE00897/PCSE00897-03_610-01_00-01_01.ppk=Xenoraid (3.61+!) [3.61]
PCSG00948/PCSG00948-03_610-01_00-01_00.ppk=Suran digit (3.61+!) [3.61]
PCSB01087/PCSB01087-03_630-01_00-01_01.ppk=Atelier Firis: The Alchemist and the Mysterious Journey (3.61+!) [3.63]
PCSE01363/PCSE01363-03_690-01_00-01_00.ppk=Drowning (3.61+!) [3.69]
PCSG00952/PCSG00952-03_630-01_00-01_02.ppk=Akiba's Beat (3.61+!) [3.63]
PCSH10019/PCSH10019-03_650-01_00-01_01.ppk=Radio Hammer Station (3.61+!) [3.65]
PCSB01140/PCSB01140-03_650-01_00-01_01.ppk=Save the Ninja Clan (3.61+!) [3.65]
PCSG00884/PCSG00884-03_690-01_00-01_02.ppk=NightCry (3.61+!) [3.69]
PCSH00160/PCSH00160-03_610-01_00-01_05.ppk=The Legend of Dark Witch (CHI) (3.61+!) [3.61]
PCSG01161/PCSG01161-03_650-01_00-01_00.ppk=OCCULTIC;NINE Soundtrack (3.61+!) [3.65]
PCSE01262/PCSE01262-03_670-01_00-01_01.ppk=Bloodstained: Curse of the Moon (3.61+!) [3.67]
PCSG00943/PCSG00943-03_610-01_00-01_02.ppk=Berserk Musou
PCSB01121/PCSB01121-03_680-01_00-01_00.ppk=Chasm (3.61+!) [3.68]
PCSH00266/PCSH00266-03_610-01_00-01_00.ppk=Sword Art Online: Hollow Realization (3.61+!) [3.61]
PCSE01097/PCSE01097-03_630-01_00-01_02.ppk=Oceanhorn: Monster of Uncharted Seas (3.61+!) [3.63]
PCSE01047/PCSE01047-03_630-01_00-01_01.ppk=Operation Babel: New Tokyo Legacy (3.61+!) [3.63]
PCSB01327/PCSB01327-03_690-01_00-01_00.ppk=Iron Snout
PCSG01193/PCSG01193-03_670-01_00-01_00.ppk=Mikagami Sumika no Seifuku Katsudou (3.61+!) [3.67]
PCSE01006/PCSE01006-03_630-01_00-01_02.ppk=Zero Escape: The Nonary Games (3.61+!) [3.63]
PCSB01144/PCSB01144-03_650-01_00-01_01.ppk=Yomawari: Midnight Shadows (3.61+!) [3.65]
PCSG01142/PCSG01142-03_670-01_00-01_01.ppk=Bullet Girls Phantasia (3.61+!) [3.67]
PCSE01067/PCSE01067-03_650-01_00-01_00.ppk=Ninja Usagimaru: Two Tails of Adventure (3.61+!) [3.65]
PCSE01198/PCSE01198-03_650-01_00-01_01.ppk=Rogue Aces (3.61+!) [3.65]
PCSE01225/PCSE01225-03_670-01_00-01_03.ppk=Super Skull Smash Go! 2 Turbo (3.61+!) [3.67]
PCSE00797/PCSE00797-03_630-01_00-01_02.ppk=forma.8 (3.61+!) [3.63]
PCSG01149/PCSG01149-03_650-01_00-01_00.ppk=Grisaia Phantom Trigger 01 & 02 (3.61+!) [3.65]
PCSH00285/PCSH00285-03_610-01_00-01_06.ppk=Volume (3.61+!) [3.61]
PCSG01042/PCSG01042-03_650-01_00-01_02.ppk=Kenka Bancho Otome ~Absolutely Invincible My Honey~ (3.61+!) [3.65]
PCSH10077/PCSH10077-03_650-01_00-01_04.ppk=Psychedelica of Black Butterfly (3.61+!) [3.65]
PCSE01379/PCSE01379-03_690-01_00-01_00.ppk=Asdivine Dios
PCSE01056/PCSE01056-03_650-01_00-01_01.ppk=Papers, Please (3.61+!) [3.65]
PCSE01431/PCSE01431-03_690-01_00-01_01.ppk=Fifty Words by POWGI
PCSG01035/PCSG01035-03_630-01_00-01_00.ppk=GUNDAM BREAKER 3 BREAK EDITION
PCSG00989/PCSG00989-03_630-01_00-01_02.ppk=Moe Moe 2-Ji Daisenryaku 3 (3.61+!) [3.63]
PCSE01302/PCSE01302-03_680-01_00-01_10.ppk=Revenge of the Bird King (3.61+!) [3.68]
PCSH10142/PCSH10142-03_690-01_00-01_00.ppk=Daggerhood (3.61+!) [3.69]
PCSE01103/PCSE01103-03_650-01_00-01_01.ppk=Ys VIII: Lacrimosa of DANA (3.61+!) [3.65]
PCSE01260/PCSE01260-03_670-01_00-01_00.ppk=Muv-Luv Alternative (3.61+!) [3.67]
PCSG01220/PCSG01220-03_680-01_00-01_00.ppk=METALMAX DIGITAL SOUNDTRACK BONUS TRACK (3.61+!) [3.68]
PCSE01342/PCSE01342-03_680-01_00-01_02.ppk=Perils of Baking - Refrosted (3.61+!) [3.68]
PCSG01272/PCSG01272-03_690-01_00-01_00.ppk=Furwind (3.61+!) [3.69]
PCSB01194/PCSB01194-03_670-01_00-01_00.ppk=The Lost Child (3.61+!) [3.67]
PCSH10156/PCSH10156-03_690-01_00-01_00.ppk=Energy Balance
PCSH10049/PCSH10049-03_650-01_00-01_01.ppk=Ys Origin (3.61+!) [3.65]
PCSE01357/PCSE01357-03_690-01_00-01_00.ppk=Pic-a-Pix Pieces (3.61+!) [3.69]
PCSE01191/PCSE01191-03_650-01_00-01_01.ppk=Xenon Valkyrie+ (3.61+!) [3.65]
PCSG01105/PCSG01105-03_650-01_00-01_00.ppk=Ouka Sabaki Zan (3.61+!) [3.65]
PCSG01121/PCSG01121-03_650-01_00-01_00.ppk=Seiken Densetsu 2: Secret of Mana (3.61+!) [3.65]
PCSG01163/PCSG01163-03_670-01_00-01_02.ppk=Anata no Shikihime Kyoudoutan (3.61+!) [3.67]
PCSG01183/PCSG01183-03_670-01_00-01_01.ppk=Memories Off -Innocent Fille- (3.61+!) [3.67]
PCSG01031/PCSG01031-03_670-01_00-01_01.ppk=Persona 3: Dancing Moon Night (3.61+!) [3.67]
PCSG01194/PCSG01194-03_680-01_00-01_00.ppk=Sanzen Sekai Yuugi: Re Multi Universe Myself
PCSB01151/PCSB01151-03_650-01_00-01_05.ppk=Vostok Inc. (3.61+!) [3.65]
PCSB01013/PCSB01013-03_650-01_00-01_01.ppk=SUMMON NIGHT6 LostBorders (3.61+!) [3.65]
PCSG01124/PCSG01124-03_650-01_00-01_00.ppk=Kin-iro no Corda 2 ff (3.61+!) [3.65]
PCSE00859/PCSE00859-03_690-01_00-01_01.ppk=Emerald Shores (3.61+!) [3.69]
PCSE00963/PCSE00963-03_610-01_00-01_01.ppk=Root Letter (3.61+!) [3.61]
PCSG01021/PCSG01021-03_650-01_00-01_01.ppk=OCCULTIC;NINE (3.61+!) [3.65]
PCSG01238/PCSG01238-03_690-01_00-01_01.ppk=Root Letter Last Answer (3.61+!) [3.69]
PCSE01077/PCSE01077-03_690-01_00-01_03.ppk=Super Life of Pixel (3.61+!) [3.69]
PCSG90310/PCSG90310-03_680-01_00-01_00.ppk=floral flowlove (DEMO) (3.61+!) [3.68]
PCSB01029/PCSB01029-03_610-01_00-01_00.ppk=Iron Sea Defenders (3.61+!) [3.61]
PCSB01034/PCSB01034-03_650-01_00-01_01.ppk=2064: Read Only Memories (3.61+!) [3.65]
PCSE01014/PCSE01014-03_650-01_00-01_00.ppk=Mary Skelter: Nightmares (3.61+!) [3.65]
PCSB01046/PCSB01046-03_630-01_00-01_01.ppk=Toukiden 2: Carryover (DEMO) (3.61+!) [3.63]
PCSH10140/PCSH10140-03_690-01_00-01_01.ppk=Bit Dungeon Plus
PCSE00911/PCSE00911-03_610-01_00-01_02.ppk=Space Overlords (3.61+!) [3.61]
PCSB01266/PCSB01266-03_680-01_00-01_00.ppk=Sigi - A Fart for Melusina (3.61+!) [3.68]
PCSH10000/PCSH10000-03_610-01_00-01_01.ppk=WORLD OF FINAL FANTASY (DEMO)
PCSE01010/PCSE01010-03_630-01_00-01_00.ppk=Lichtspeer (3.61+!) [3.63]
PCSG01226/PCSG01226-03_680-01_00-01_00.ppk=Fernz Gate
PCSE01378/PCSE01378-03_690-01_00-01_00.ppk=Mixups by POWGI (3.61+!) [3.69]
PCSG00705/PCSG00705-03_610-01_00-01_02.ppk=Citizens of Earth: Tatakae! Fukudaitouryou to 40-nin no Shimintachi!
PCSH10097/PCSH10097-03_690-01_00-01_02.ppk=METAGAL
PCSE01246/PCSE01246-03_680-01_00-01_01.ppk=Timespinner (3.61+!) [3.68]
PCSG01045/PCSG01045-03_650-01_00-01_01.ppk=Jikkyou Powerful Pro Yakyuu Championship 2017 (3.61+!) [3.65]
PCSG01141/PCSG01141-03_650-01_00-01_00.ppk=Taishou x Alice: Heads & Tails
PCSH10150/PCSH10150-03_690-01_00-01_01.ppk=Super Weekend Mode
PCSE01041/PCSE01041-03_630-01_00-01_02.ppk=Deemo: The Last Recital
PCSG90285/PCSG90285-03_650-01_00-01_00.ppk=Amaekata wa Kanojo Nari ni. (DEMO) (3.61+!) [3.65]
PCSB01306/PCSB01306-03_690-01_00-01_01.ppk=One Word by POWGI (3.61+!) [3.69]
PCSE01177/PCSE01177-03_650-01_00-01_01.ppk=Iconoclasts (3.61+!) [3.65]
PCSE01386/PCSE01386-03_690-01_00-01_01.ppk=My Big Sister
PCSE00959/PCSE00959-03_630-01_00-01_02.ppk=Utawarerumono: Mask of Deception (3.61+!) [3.63]
PCSH10005/PCSH10005-03_610-01_00-01_00.ppk=Hakuouki Shinkai Kazeno-Sho (3.61+!) [3.61]
PCSG00933/PCSG00933-03_630-01_00-01_01.ppk=Re:Zero - kara Hajimeru Isekai Seikatsu - Death or Kiss (3.61+!) [3.63]
PCSB00791/PCSB00791-03_630-01_00-01_01.ppk=Top Trumps Turbo (3.61+!) [3.63]
PCSB01259/PCSB01259-03_680-01_00-01_01.ppk=Punch Line (3.61+!) [3.68]
PCSE01184/PCSE01184-03_680-01_00-01_01.ppk=MUSYNX (3.61+!) [3.68]
PCSB01083/PCSB01083-03_650-01_00-01_00.ppk=Windjammers (3.61+!) [3.65]
PCSB01040/PCSB01040-03_630-01_00-01_01.ppk=Lara Croft GO (3.61+!) [3.63]
PCSG01201/PCSG01201-03_680-01_00-01_00.ppk=Tonari ni Kanojo no Iru Shiawase ~Winter Guest~ (3.61+!) [3.68]
PCSG00995/PCSG00995-03_630-01_00-01_01.ppk=Chaos;Child: Love chu chu!! (3.61+!) [3.63]
PCSG90253/PCSG90253-03_610-01_00-01_00.ppk=Sword Art Online: Hollow Realization Beater's Player Edition (3.61+!) [3.61]
PCSE01305/PCSE01305-03_690-01_00-01_02.ppk=The House in Fata Morgana
PCSH10006/PCSH10006-03_610-01_00-01_01.ppk=Dynasty Warriors: Godseekers (3.61+!) [3.61]
PCSB00823/PCSB00823-03_650-01_00-01_01.ppk=Rogue Aces (3.61+!) [3.65]
PCSG01037/PCSG01037-03_630-01_00-01_01.ppk=Rabi Laby: Puzzle Out Stories (3.61+!) [3.63]
PCSG01095/PCSG01095-03_650-01_00-01_00.ppk=Grisaia no Kajitsu: Side Episode (3.61+!) [3.65]
PCSB01060/PCSB01060-03_630-01_00-01_01.ppk=Period Cube ~Shackles of Amadeus~ (3.61+!) [3.63]
PCSG90326/PCSG90326-03_690-01_00-01_00.ppk=your diary + 体験版
PCSE01040/PCSE01040-03_650-01_00-01_01.ppk=KOI (3.61+!) [3.65]
PCSE01359/PCSE01359-03_690-01_00-01_01.ppk=Fate/EXTELLA LINK Digital Soundtrack (3.61+!) [3.69]
PCSG01250/PCSG01250-03_690-01_00-01_00.ppk=Suki to Suki to de Sankaku Ren'ai
PCSB01108/PCSB01108-03_630-01_00-01_01.ppk=Blasting Agent: Ultimate Edition (3.61+!) [3.63]
PCSG90320/PCSG90320-03_690-01_00-01_00.ppk=かりぐらし恋愛 体験版  (DEMO) (3.61+!) [3.69]
PCSB01185/PCSB01185-03_670-01_00-01_00.ppk=Pic-a-Pix Color (3.61+!) [3.67]
PCSB01027/PCSB01027-03_650-01_00-01_02.ppk=Pox Nora (3.61+!) [3.65]
PCSE01281/PCSE01281-03_690-01_00-01_01.ppk=Chronus Arc (3.61+!) [3.69]
PCSB01187/PCSB01187-03_650-01_00-01_01.ppk=Alteric (3.61+!) [3.65]
PCSE01261/PCSE01261-03_680-01_00-01_02.ppk=FullBlast (3.61+!) [3.68]
PCSB01085/PCSB01085-03_630-01_00-01_01.ppk=Berserk and the Band of the Hawk (3.61+!) [3.63]
PCSG00963/PCSG00963-03_630-01_00-01_01.ppk=end sleep
PCSB01097/PCSB01097-03_630-01_00-01_01.ppk=Drive Girls (3.61+!) [3.63]
PCSB01036/PCSB01036-03_610-01_00-01_02.ppk=Demetrios - The BIG Cynical Adventure (3.61+!) [3.61]
PCSG01287/PCSG01287-03_690-01_00-01_00.ppk=Asdivine Menace
PCSG90293/PCSG90293-03_650-01_00-01_00.ppk=D.S.-Dal Segno- (DEMO) (3.61+!) [3.65]
PCSE01253/PCSE01253-03_670-01_00-01_02.ppk=Pic-a-Pix Color (3.61+!) [3.67]
PCSE01012/PCSE01012-03_630-01_00-01_01.ppk=Period Cube ~Shackles of Amadeus~ (3.61+!) [3.63]
PCSB01113/PCSB01113-03_670-01_00-01_05.ppk=League of Evil (3.61+!) [3.67]
PCSE01266/PCSE01266-03_680-01_00-01_00.ppk=Waking Violet (3.61+!) [3.68]
PCSE00961/PCSE00961-03_650-01_00-01_02.ppk=Pox Nora (3.61+!) [3.65]
PCSB01245/PCSB01245-03_690-01_00-01_01.ppk=Heroes Trials (3.61+!) [3.69]
PCSE01003/PCSE01003-03_630-01_00-01_01.ppk=Valkyria Revolution (3.61+!) [3.63]
PCSB01301/PCSB01301-03_680-01_00-01_00.ppk=Timespinner (3.61+!) [3.68]
PCSG01248/PCSG01248-03_690-01_00-01_01.ppk=Professional Baseball Spirits 2019
PCSG01157/PCSG01157-03_670-01_00-01_01.ppk=Harukanaru Toki no Naka de Ultimate (3.61+!) [3.67]
PCSG00910/PCSG00910-03_630-01_00-01_01.ppk=DIABOLIK LOVERS LOST EDEN (3.61+!) [3.63]
PCSE01420/PCSE01420-03_690-01_00-01_01.ppk=Kid Tripp
PCSE01394/PCSE01394-03_690-01_00-01_00.ppk=Word Wheel by POWGI
PCSE01136/PCSE01136-03_680-01_00-01_02.ppk=Defender's Quest: Valley of the Forgotten DX (3.61+!) [3.68]
PCSB01129/PCSB01129-03_650-01_00-01_01.ppk=Touhou Kobuto V: Burst Battle (3.61+!) [3.65]
PCSB01051/PCSB01051-03_630-01_00-01_02.ppk=DYING: Reborn (3.61+!) [3.63]
PCSE01360/PCSE01360-03_690-01_00-01_02.ppk=Dragonfly Chronicles (3.61+!) [3.69]
PCSG90306/PCSG90306-03_680-01_00-01_00.ppk=参千世界遊戯 ～Re Multi Universe Myself～ 体験版 (DEMO) (3.61+!) [3.68]
PCSH10044/PCSH10044-03_650-01_00-01_01.ppk=Omega Labyrinth Z (3.61+!) [3.65]
PCSG00800/PCSG00800-03_610-01_00-01_01.ppk=Yaken no Reodem (3.61+!) [3.61]
PCSE00965/PCSE00965-03_630-01_00-01_00.ppk=KillAllZombies (3.61+!) [3.63]
