{
  "$schema": "https://github.com/fastfetch-cli/fastfetch/raw/dev/doc/json_schema.json",
      "logo": {
        "source": "~/.config/fastfetch/logo4.png",
        "type": "auto",
        "color": {"1": "blue"},
        "color": {"2": "blue"},
        "height": 15,
        "width": 30,
        "padding": {
            "top": 3,
            "left": 3
        }
    },
  "modules": [
    "os",
    "kernel",
    "InitSystem",
    "Bootmgr",
    "tpm",
    "lm",
    "de",
    "wm",
    "packages",

    "cpu",
    "gpu",
    "display",
    "chassis",
    "host",
    "bios",
    "memory",
    "swap",
    "disk",
    "battery",
    "poweradapter",

    "uptime",
    "DNS",
    {
            "type": "localip",
            "key": "LAN IP",
            "showIpv6": true,
            "showPrefixLen": true
        },

    "Wifi",

    "break",
  ]
}
