{
    "type": "record",
    "name": "numberPortabilityEvent",
    "namespace": "telia.ee.resman",
    "fields": [ {
            "name": "voucherNumber",
            "type": "string",
            "doc": "Unique application identifier to a number portability request. CRM-s VOUCHER_NUMBER"
        },
        {
            "name": "recipientOperatorRegistryCode",
            "type": "int",
            "doc": "Business registry code of new network (recipient).CRM value: VOP_REG_NUM"
        },
        {
            "name": "donorOperatorRegistryCode",
            "type": "int",
            "doc": "Business registry code of current network (donor). CRM value: DOP_REG_NUM"
        },
        {
            "name": "portingNumber",
            "type": "string",
            "doc": "Number to port (+372... ?). CRM value: PORTING_NUMBER"
        },
        {
            "name": "numberTypeEnum",
            "type": [ "null", {
                "type": "enum",
                "name": "numberType",
                "symbols": [ "fix", "mobile" ]
            } ],
            "doc": "Fix or mobile number. CRM value: NUMBER_TYPE"
        },
        {
            "name": "statusCodeEnum",
            "type": [ "null", {
                "type": "enum",
                "name": "statusCode",
                "symbols": [ "TODO" ]
            } ],
            "doc": "The status of the number portability request. CRM value: STATUS_CODE"
        },
        {
            "name": "executionDate",
            "type": [ "null", {
                "type": "int",
                "logicalType": "time-millis"
            } ],
            "doc": "The date when the number will be ported. (Input: pp.kk.aaaa hh:mi). CRM value: EXECUTION_DATE"
        },
        {
            "name": "customerId",
            "type": "string",
            "doc": "Personal identification code (isikukood) or business registry code. CRM value: CUSTOMER_ID"
        },
        {
            "name": "customerName",
            "type": "string",
            "doc": "The name of the customer. CRM value: CUSTOMER_NAME"
        },
        {
            "name": "clientTypeEnum",
            "type": [ "null", {
                "type": "enum",
                "name": "clientType",
                "symbols": [ "business", "consumer", "other" ]
            } ],
            "doc": "Business, consumer or other types of client. CRM value: CLIENT_TYPE"
        },
        {
            "name": "authorizedPersonId",
            "type": [
                "null",
                "string"
            ],
            "default": null,
            "doc": "Personal identification code (isikukood) of the authorized person. CRM value: AUTH_PERSON_ID"
        },
        {
            "name": "authorizedPersonName",
            "type": [
                "null",
                "string"
            ],
            "default": null,
            "doc": "Name of the authorized person. CRM value: AUTHORIZED_PERSON"
        },
        {
            "name": "legalPersonId",
            "type": [
                "null",
                "string"
            ],
            "default": null,
            "doc": "Authorizer's business registry code. CRM value: LEGAL_PERSON_ID"
        },
        {
            "name": "legalPerson",
            "type": [
                "null",
                "string"
            ],
            "default": null,
            "doc": "Name of the authorizer. CRM value: LEGAL_PERSON"
        },
        {
            "name": "portingId",
            "type": "string",
            "doc": "NSPC (National Signalling Point Code). CRM value: PORTING_ID"
        },
        {
            "name": "serviceNumber",
            "type": "string",
            "doc": "NSN (National Significant Number). CRM value: SERV_NUM"
        }
    ]
}