<?xml version="1.0" encoding="iso-8859-1"?>
<!-- Generator: Adobe Illustrator 16.0.0, SVG Export Plug-In . SVG Version: 6.00 Build 0)  -->
<!DOCTYPE svg PUBLIC "-//W3C//DTD SVG 1.1//EN" "http://www.w3.org/Graphics/SVG/1.1/DTD/svg11.dtd">
<svg xmlns="http://www.w3.org/2000/svg" xmlns:xlink="http://www.w3.org/1999/xlink" version="1.1" id="Capa_1" x="0px" y="0px" width="512px" height="512px" viewBox="0 0 405.561 405.561" style="enable-background:new 0 0 405.561 405.561;" xml:space="preserve">
<g>
	<g>
		<path d="M206.429,317.872H6.791c-3.672,0-6.652,2.976-6.652,6.64v42.489c0,13.039,10.612,23.647,23.644,23.647h165.643    c13.027,0,23.639-10.608,23.639-23.647v-42.489C213.064,320.848,210.088,317.872,206.429,317.872z" fill="#933EC5"/>
		<path d="M254.701,30.765L207.777,15.25c-0.668-0.231-1.369-0.339-2.084-0.339H6.652C2.975,14.912,0,17.896,0,21.563v108.62    c0,3.675,2.975,6.648,6.652,6.648h52.606L30.717,268.349l-26.331,10.86c-2.488,1.023-4.115,3.454-4.115,6.152v14.41    c0,3.68,2.976,6.65,6.648,6.65h198.764c3.675,0,6.641-2.981,6.641-6.65v-17.732c0-3.209-2.265-5.938-5.396-6.546l-57.776-11.003    l5.119-46.384l15.428-6.861c1.971-0.872,3.392-2.662,3.816-4.771l11.083-55.747c0.699-3.515-1.522-6.95-5.011-7.767l-9.278-2.172    v-3.402h34.172c1.423-0.037,2.797-0.534,3.911-1.402l48.282-41.559c1.617-1.258,2.562-3.197,2.562-5.25v-52.09    C259.258,34.217,257.422,31.668,254.701,30.765z" fill="#933EC5"/>
		<path d="M301.369,30.432h-25.48c-3.685,0-6.656,2.984-6.656,6.648v48.768c0,3.676,2.981,6.648,6.656,6.648h25.48    c3.686,0,6.656-2.977,6.656-6.648V37.08C308.025,33.411,305.05,30.432,301.369,30.432z" fill="#933EC5"/>
		<path d="M398.902,55.078c-0.005,0-0.016,0-0.031,0l-70.898,0.076V50.38c0-3.678-2.976-6.649-6.646-6.649    c-3.685,0-6.65,2.976-6.65,6.649v22.905c0,3.669,2.976,6.648,6.65,6.648s6.646-2.984,6.646-6.648v-4.829l70.972-0.021    c3.664-0.016,6.63-3.058,6.616-6.735C405.548,58.041,402.577,55.078,398.902,55.078z" fill="#933EC5"/>
	</g>
</g>
<g>
</g>
<g>
</g>
<g>
</g>
<g>
</g>
<g>
</g>
<g>
</g>
<g>
</g>
<g>
</g>
<g>
</g>
<g>
</g>
<g>
</g>
<g>
</g>
<g>
</g>
<g>
</g>
<g>
</g>
</svg>
