<svg width="64" height="64" viewBox="0 0 64 64" fill="none" xmlns="http://www.w3.org/2000/svg">
    <path
        d="M16.223 23.82C16.252 23.5546 16.3482 23.301 16.5023 23.083C16.6564 22.865 16.8635 22.6899 17.104 22.574C17.6726 22.1974 18.34 21.9977 19.022 22C19.75 22 20.114 22.336 20.114 23.008V35.972C20.1242 37.0928 19.8186 38.1939 19.232 39.149C18.6681 40.0876 17.8664 40.8606 16.908 41.39C15.9627 41.9185 14.897 42.194 13.814 42.19C12.349 42.2044 10.919 41.7418 9.74 40.872C8.57589 40.0516 7.73063 38.8545 7.347 37.483C7.30608 37.3558 7.27795 37.2248 7.263 37.092C7.29225 36.8534 7.38079 36.6259 7.52052 36.4302C7.66026 36.2346 7.84676 36.0771 8.063 35.972C8.56065 35.6276 9.15082 35.4418 9.756 35.439C9.93729 35.4119 10.1225 35.4437 10.2844 35.5295C10.4464 35.6153 10.5766 35.7508 10.656 35.916C10.9107 36.6378 11.3442 37.2832 11.916 37.792C12.4217 38.2028 13.0566 38.4211 13.708 38.408C14.0495 38.4161 14.3886 38.3485 14.701 38.2102C15.0134 38.0719 15.2914 37.8663 15.515 37.608C16.0015 37.0466 16.2567 36.3214 16.229 35.579L16.223 23.82ZM27.394 35.02V38.884C27.3999 39.6294 27.1856 40.3599 26.778 40.984C26.6538 41.2443 26.4652 41.4685 26.2299 41.6353C25.9947 41.8021 25.7207 41.9059 25.434 41.937C24.948 41.937 24.4627 41.573 23.978 40.845C23.7306 40.5064 23.5668 40.114 23.5 39.7V23.988C23.5291 23.7225 23.6253 23.4688 23.7796 23.2507C23.9339 23.0327 24.1412 22.8577 24.382 22.742C24.9506 22.3654 25.618 22.1657 26.3 22.168H30.892C32.0866 22.1446 33.2659 22.4394 34.309 23.022C35.2701 23.5639 36.0603 24.3641 36.59 25.332C37.1319 26.3378 37.4073 27.4656 37.39 28.608C37.3927 29.4926 37.1871 30.3655 36.79 31.156C36.4024 31.9392 35.8705 32.6422 35.222 33.228C34.6003 33.7923 33.884 34.2425 33.106 34.558C32.3595 34.8624 31.5612 35.0193 30.755 35.02H27.394ZM30.782 31.38C31.1546 31.3895 31.5253 31.3235 31.8717 31.186C32.2182 31.0485 32.5333 30.8424 32.798 30.58C33.0622 30.3249 33.2707 30.0177 33.4103 29.678C33.5499 29.3382 33.6176 28.9732 33.609 28.606C33.6223 28.2329 33.558 27.8611 33.4203 27.5141C33.2826 27.1671 33.0745 26.8525 32.809 26.59C32.5408 26.3294 32.2228 26.1257 31.874 25.991C31.5251 25.8562 31.1527 25.7933 30.779 25.806H27.394V31.38H30.782ZM52.146 34.768H50.578C50.1113 34.768 49.654 34.432 49.206 33.76C48.9741 33.446 48.8206 33.0813 48.758 32.696C48.7872 32.4486 48.8782 32.2125 49.0225 32.0095C49.1669 31.8064 49.36 31.6429 49.584 31.534C50.118 31.1749 50.7475 30.9847 51.391 30.988H54.891C55.581 30.988 55.926 31.3053 55.926 31.94V36.84C55.9593 37.5662 55.804 38.2887 55.4752 38.937C55.1465 39.5854 54.6555 40.1377 54.05 40.54C53.2629 41.0821 52.3934 41.4935 51.475 41.758C50.5014 42.0476 49.4908 42.1939 48.475 42.192C46.7025 42.214 44.9614 41.7226 43.462 40.777C42.0033 39.8722 40.8102 38.5974 40.004 37.082C39.1923 35.562 38.7736 33.8631 38.786 32.14C38.768 30.264 39.2774 28.4206 40.256 26.82C41.1856 25.2647 42.5024 23.9768 44.078 23.082C45.6124 22.2045 47.3505 21.7459 49.118 21.752C50.9672 21.7233 52.7859 22.2258 54.358 23.2C54.4986 23.2878 54.6121 23.4127 54.6863 23.5609C54.7604 23.7091 54.7921 23.8749 54.778 24.04C54.7791 24.5026 54.6837 24.9603 54.498 25.384C54.3435 25.7656 54.1151 26.1129 53.826 26.406C53.6245 26.6302 53.3429 26.766 53.042 26.784C52.8057 26.7693 52.5759 26.7009 52.37 26.584C51.8225 26.3081 51.2507 26.0832 50.662 25.912C50.1503 25.7769 49.6232 25.7097 49.094 25.712C48.2632 25.6831 47.4353 25.8234 46.6603 26.1242C45.8854 26.425 45.1797 26.8802 44.586 27.462C44.0015 28.0457 43.5433 28.7434 43.2399 29.5117C42.9364 30.28 42.7942 31.1024 42.822 31.928C42.7996 33.0843 43.0751 34.227 43.622 35.246C44.1179 36.1708 44.8595 36.9407 45.765 37.471C46.6833 38.0008 47.7279 38.2721 48.788 38.256C49.9659 38.2752 51.1271 37.9749 52.148 37.387L52.146 34.768ZM4 20C3.46957 20 2.96086 19.7893 2.58579 19.4142C2.21071 19.0391 2 18.5304 2 18V14C2.00238 11.879 2.846 9.84555 4.34578 8.34578C5.84555 6.846 7.879 6.00238 10 6H14C14.5304 6 15.0391 6.21071 15.4142 6.58579C15.7893 6.96086 16 7.46957 16 8C16 8.53043 15.7893 9.03914 15.4142 9.41421C15.0391 9.78929 14.5304 10 14 10H10C8.93913 10 7.92172 10.4214 7.17157 11.1716C6.42143 11.9217 6 12.9391 6 14V18C6 18.5304 5.78929 19.0391 5.41421 19.4142C5.03914 19.7893 4.53043 20 4 20ZM60 20C59.4696 20 58.9609 19.7893 58.5858 19.4142C58.2107 19.0391 58 18.5304 58 18V14C58 12.9391 57.5786 11.9217 56.8284 11.1716C56.0783 10.4214 55.0609 10 54 10H50C49.4696 10 48.9609 9.78929 48.5858 9.41421C48.2107 9.03914 48 8.53043 48 8C48 7.46957 48.2107 6.96086 48.5858 6.58579C48.9609 6.21071 49.4696 6 50 6H54C56.121 6.00238 58.1544 6.846 59.6542 8.34578C61.154 9.84555 61.9976 11.879 62 14V18C62 18.5304 61.7893 19.0391 61.4142 19.4142C61.0391 19.7893 60.5304 20 60 20ZM54 58H50C49.4696 58 48.9609 57.7893 48.5858 57.4142C48.2107 57.0391 48 56.5304 48 56C48 55.4696 48.2107 54.9609 48.5858 54.5858C48.9609 54.2107 49.4696 54 50 54H54C55.0609 54 56.0783 53.5786 56.8284 52.8284C57.5786 52.0783 58 51.0609 58 50V46C58 45.4696 58.2107 44.9609 58.5858 44.5858C58.9609 44.2107 59.4696 44 60 44C60.5304 44 61.0391 44.2107 61.4142 44.5858C61.7893 44.9609 62 45.4696 62 46V50C61.9976 52.121 61.154 54.1544 59.6542 55.6542C58.1544 57.154 56.121 57.9976 54 58ZM14 58H10C7.879 57.9976 5.84555 57.154 4.34578 55.6542C2.846 54.1544 2.00238 52.121 2 50V46C2 45.4696 2.21071 44.9609 2.58579 44.5858C2.96086 44.2107 3.46957 44 4 44C4.53043 44 5.03914 44.2107 5.41421 44.5858C5.78929 44.9609 6 45.4696 6 46V50C6 51.0609 6.42143 52.0783 7.17157 52.8284C7.92172 53.5786 8.93913 54 10 54H14C14.5304 54 15.0391 54.2107 15.4142 54.5858C15.7893 54.9609 16 55.4696 16 56C16 56.5304 15.7893 57.0391 15.4142 57.4142C15.0391 57.7893 14.5304 58 14 58Z"
        fill="black"/>
</svg>