<svg width="65" height="64" viewBox="0 0 65 64" fill="none" xmlns="http://www.w3.org/2000/svg">
    <path
        fill-rule="evenodd"
        clip-rule="evenodd"
        d="M32 56C45.2548 56 56 45.2548 56 32C56 18.7452 45.2548 8 32 8C18.7452 8 8 18.7452 8 32C8 45.2548 18.7452 56 32 56ZM32 60C47.464 60 60 47.464 60 32C60 16.536 47.464 4 32 4C16.536 4 4 16.536 4 32C4 47.464 16.536 60 32 60Z"
        fill="#0094FF"/>
    <path
        fill-rule="evenodd"
        clip-rule="evenodd"
        d="M20.5858 20.5858C21.3668 19.8047 22.6332 19.8047 23.4142 20.5858L43.4142 40.5858C44.1953 41.3668 44.1953 42.6332 43.4142 43.4142C42.6332 44.1953 41.3668 44.1953 40.5858 43.4142L20.5858 23.4142C19.8047 22.6332 19.8047 21.3668 20.5858 20.5858Z"
        fill="#0094FF"/>
    <path
        fill-rule="evenodd"
        clip-rule="evenodd"
        d="M43.4142 20.5858C42.6332 19.8047 41.3668 19.8047 40.5858 20.5858L20.5858 40.5858C19.8047 41.3668 19.8047 42.6332 20.5858 43.4142C21.3668 44.1953 22.6332 44.1953 23.4142 43.4142L43.4142 23.4142C44.1953 22.6332 44.1953 21.3668 43.4142 20.5858Z"
        fill="#0094FF"/>
</svg>