<svg width="64" height="64" viewBox="0 0 64 64" fill="none" xmlns="http://www.w3.org/2000/svg">
    <path
        fill-rule="evenodd"
        clip-rule="evenodd"
        d="M16 60H44C45.8913 60.0042 47.7226 59.3358 49.1666 58.1144C50.6106 56.8929 51.5734 55.1979 51.883 53.332C51.9266 53.0729 51.9187 52.8078 51.8599 52.5517C51.801 52.2956 51.6923 52.0537 51.5399 51.8397C51.3875 51.6256 51.1945 51.4437 50.9718 51.3043C50.7491 51.1648 50.5011 51.0706 50.242 51.027C49.9829 50.9834 49.7178 50.9913 49.4617 51.0502C49.2056 51.109 48.9637 51.2178 48.7496 51.3701C48.5356 51.5225 48.3537 51.7156 48.2142 51.9383C48.0748 52.1609 47.9806 52.4089 47.937 52.668C47.783 53.6003 47.3023 54.4474 46.5811 55.0578C45.8598 55.6682 44.9449 56.0022 44 56H16V53C16 52.4696 15.7893 51.9609 15.4142 51.5858C15.0391 51.2107 14.5304 51 14 51C13.4696 51 12.9609 51.2107 12.5858 51.5858C12.2107 51.9609 12 52.4696 12 53V56C12 57.0609 12.4214 58.0783 13.1716 58.8284C13.9217 59.5786 14.9391 60 16 60ZM40 5.17201L51.414 16.586C51.6936 16.8657 51.884 17.222 51.9612 17.61C52.0383 17.9979 51.9987 18.3999 51.8474 18.7653C51.696 19.1307 51.4397 19.443 51.1109 19.6628C50.7821 19.8826 50.3955 19.9999 50 20H40C38.9391 20 37.9217 19.5786 37.1716 18.8284C36.4214 18.0783 36 17.0609 36 16V8.00001H20C18.9391 8.00001 17.9217 8.42144 17.1716 9.17159C16.4214 9.92173 16 10.9391 16 12V18C16 18.5304 15.7893 19.0392 15.4142 19.4142C15.0391 19.7893 14.5304 20 14 20C13.4696 20 12.9609 19.7893 12.5858 19.4142C12.2107 19.0392 12 18.5304 12 18V12C12.0024 9.87901 12.846 7.84556 14.3458 6.34579C15.8456 4.84601 17.879 4.0024 20 4.00001H37.172C37.6975 3.99865 38.218 4.10153 38.7034 4.3027C39.1888 4.50388 39.6295 4.79935 40 5.17201ZM45.172 16L40 10.828V16H45.172ZM22.008 43.712C21.4107 44.216 20.608 44.6266 19.6 44.944C18.6107 45.2613 17.6213 45.42 16.632 45.42C14.8027 45.42 13.1413 44.9533 11.648 44.02C10.1733 43.0866 9.02533 41.864 8.204 40.352C7.40133 38.8213 7 37.1693 7 35.396C7 33.4546 7.476 31.6813 8.428 30.076C9.39867 28.4706 10.6587 27.22 12.208 26.324C13.7573 25.428 15.4187 24.98 17.192 24.98C19.1333 24.98 20.8787 25.4653 22.428 26.436C22.708 26.604 22.848 26.884 22.848 27.276C22.848 27.9666 22.6613 28.6106 22.288 29.208C21.9147 29.7866 21.5133 30.076 21.084 30.076C20.8973 30.076 20.6733 30.0106 20.412 29.88C19.2733 29.3013 18.172 29.012 17.108 29.012C15.932 29.012 14.8773 29.292 13.944 29.852C13.0293 30.412 12.32 31.168 11.816 32.12C11.3307 33.0533 11.088 34.0893 11.088 35.228C11.088 36.4226 11.3493 37.496 11.872 38.448C12.4133 39.3813 13.1227 40.1093 14 40.632C14.8773 41.136 15.848 41.388 16.912 41.388C18.144 41.388 19.3573 41.1173 20.552 40.576C21.1867 40.296 21.7 40.156 22.092 40.156C22.764 40.156 23.1 40.4826 23.1 41.136C23.1 41.6213 22.9973 42.1066 22.792 42.592C22.5867 43.0586 22.3253 43.432 22.008 43.712ZM37.6828 42.592C37.0481 43.488 36.1987 44.188 35.1348 44.692C34.0894 45.1773 32.9414 45.42 31.6908 45.42C30.7388 45.42 29.7868 45.2613 28.8348 44.944C27.9014 44.608 27.0708 44.1786 26.3428 43.656C25.6147 43.1146 25.0641 42.5173 24.6908 41.864C24.4667 41.4906 24.3547 41.192 24.3547 40.968C24.3547 40.5573 24.6161 40.184 25.1388 39.848C25.6801 39.4933 26.2681 39.316 26.9028 39.316C27.2574 39.316 27.5281 39.4186 27.7148 39.624C28.3494 40.3333 28.9748 40.8466 29.5908 41.164C30.2254 41.4626 30.9254 41.612 31.6908 41.612C32.6054 41.612 33.3334 41.4253 33.8748 41.052C34.4347 40.6786 34.7148 40.1746 34.7148 39.54C34.7148 38.8866 34.4347 38.336 33.8748 37.888C33.3148 37.44 32.2974 36.9453 30.8228 36.404C28.7507 35.6386 27.2761 34.808 26.3988 33.912C25.5214 33.016 25.0828 31.8773 25.0828 30.496C25.0828 29.4506 25.4001 28.508 26.0347 27.668C26.6694 26.8093 27.5001 26.1466 28.5268 25.68C29.5534 25.2133 30.6734 24.98 31.8868 24.98C32.8201 24.98 33.7348 25.12 34.6308 25.4C35.5454 25.68 36.3668 26.072 37.0948 26.576C37.3748 26.7626 37.5148 27.0333 37.5148 27.388C37.5148 28.06 37.3374 28.676 36.9827 29.236C36.6281 29.7773 36.2361 30.048 35.8068 30.048C35.6201 30.048 35.3868 29.964 35.1068 29.796C33.8748 29.068 32.7547 28.704 31.7467 28.704C30.9441 28.704 30.2814 28.8626 29.7588 29.18C29.2548 29.4973 29.0028 29.908 29.0028 30.412C29.0028 30.7853 29.1054 31.1026 29.3108 31.364C29.5161 31.6066 29.9081 31.8773 30.4867 32.176C31.0841 32.456 32.0734 32.8573 33.4548 33.38C35.2467 34.052 36.5534 34.8826 37.3748 35.872C38.2148 36.8426 38.6348 38.056 38.6348 39.512C38.6348 40.6506 38.3174 41.6773 37.6828 42.592ZM46.0213 44.076C46.5253 44.804 47.0386 45.168 47.5613 45.168H48.3733C48.7466 45.168 49.0919 45 49.4093 44.664C49.7453 44.328 50.0253 43.8706 50.2493 43.292L56.0453 27.612C56.2133 27.164 56.2973 26.7066 56.2973 26.24C56.2973 25.568 55.9333 25.232 55.2053 25.232C54.5893 25.232 54.0013 25.3906 53.4413 25.708C52.8999 26.0253 52.5639 26.3893 52.4333 26.8L48.0933 39.344L43.3613 25.932C43.2306 25.4653 42.8759 25.232 42.2973 25.232C41.6066 25.232 40.9626 25.428 40.3653 25.82C39.7866 26.1933 39.4973 26.604 39.4973 27.052C39.4973 27.2013 39.5533 27.416 39.6653 27.696L45.6013 43.264C45.7319 43.6 45.8719 43.8706 46.0213 44.076Z"
        fill="black"/>
</svg>