<svg width="64" height="64" viewBox="0 0 64 64" fill="none" xmlns="http://www.w3.org/2000/svg">
    <path
        d="M58.0644 29.1719L36.2411 7.34863C35.684 6.7915 35.0227 6.34955 34.2948 6.04802C33.5669 5.7465 32.7868 5.59131 31.9989 5.59131C31.2111 5.59131 30.4309 5.7465 29.703 6.04802C28.9752 6.34955 28.3138 6.7915 27.7567 7.34863L5.9335 29.1719C5.37403 29.7312 4.99301 30.4439 4.83862 31.2198C4.68423 31.9957 4.76341 32.8 5.06614 33.5309C5.36887 34.2618 5.88156 34.8865 6.53935 35.326C7.19715 35.7655 7.97051 36.0001 8.76163 36H11.9989V54C12 55.0605 12.4218 56.0773 13.1717 56.8273C13.9216 57.5772 14.9384 57.9989 15.9989 58H47.9989C49.0595 57.9989 50.0763 57.5772 50.8262 56.8273C51.5761 56.0773 51.9979 55.0605 51.9989 54V36H55.2362C56.0273 36.0001 56.8007 35.7655 57.4585 35.326C58.1163 34.8865 58.629 34.2618 58.9317 33.5309C59.2344 32.8 59.3136 31.9957 59.1592 31.2198C59.0048 30.4439 58.6238 29.7312 58.0644 29.1719V29.1719ZM47.9989 32V54H15.9989V32H8.76163L30.5849 10.1768C30.9657 9.81291 31.4722 9.60987 31.9989 9.60987C32.5257 9.60987 33.0321 9.81291 33.413 10.1768L55.2362 32H47.9989ZM29.9989 40V46C30 47.0605 30.4218 48.0773 31.1717 48.8273C31.9216 49.5772 32.9384 49.9989 33.9989 50H39.9989C41.0595 49.9989 42.0763 49.5772 42.8262 48.8273C43.5761 48.0773 43.9979 47.0605 43.9989 46V40C43.9979 38.9395 43.5761 37.9227 42.8262 37.1727C42.0763 36.4228 41.0595 36.0011 39.9989 36H33.9989C32.9384 36.0011 31.9216 36.4228 31.1717 37.1727C30.4218 37.9227 30 38.9395 29.9989 40V40ZM33.9989 40H39.9989L40.0019 46H33.9989V40Z"
        fill="#0094FF"/>
</svg>