<svg width="64" height="64" viewBox="0 0 64 64" fill="none" xmlns="http://www.w3.org/2000/svg">
    <path
        d="M32 14C30.0222 14 28.0888 14.5865 26.4442 15.6853C24.7998 16.7841 23.518 18.3459 22.7612 20.1732C22.0044 22.0004 21.8062 24.011 22.1922 25.951C22.578 27.8908 23.5304 29.6726 24.929 31.071C26.3274 32.4696 28.1092 33.422 30.049 33.8078C31.989 34.1938 33.9996 33.9956 35.8268 33.2388C37.654 32.482 39.2158 31.2002 40.3146 29.5558C41.4136 27.9112 42 25.9778 42 24C41.9968 21.3488 40.9424 18.8071 39.0676 16.9324C37.193 15.0577 34.6512 14.0031 32 14ZM32 30C30.8134 30 29.6532 29.6482 28.6666 28.9888C27.6798 28.3296 26.9108 27.3924 26.4568 26.2962C26.0026 25.1998 25.8838 23.9934 26.1152 22.8294C26.3468 21.6656 26.9182 20.5964 27.7574 19.7574C28.5964 18.9182 29.6656 18.3468 30.8294 18.1153C31.9934 17.8838 33.1998 18.0026 34.2962 18.4567C35.3924 18.9108 36.3296 19.6799 36.9888 20.6666C37.6482 21.6532 38 22.8134 38 24C37.9982 25.5908 37.3656 27.1158 36.2408 28.2408C35.1158 29.3656 33.5908 29.9982 32 30ZM32 4C26.6974 4.0059 21.6138 6.11494 17.8644 9.86438C14.1149 13.6138 12.0059 18.6975 12 24C12 36.4892 25.6298 52.1054 29.8096 56.5956C30.09 56.896 30.4292 57.1354 30.806 57.2994C31.1828 57.4634 31.5892 57.5482 32 57.5488H32.002C32.413 57.548 32.8194 57.4628 33.1962 57.2984C33.573 57.1342 33.912 56.8944 34.1924 56.5938C38.3702 52.1054 52 36.4892 52 24C51.994 18.6975 49.885 13.6138 46.1356 9.86438C42.3862 6.11494 37.3026 4.0059 32 4ZM32 53.0664C28.0712 48.7256 16 34.5274 16 24C16 19.7565 17.6857 15.6869 20.6862 12.6863C23.6868 9.6857 27.7566 8 32 8C36.2434 8 40.3132 9.6857 43.3138 12.6863C46.3142 15.6869 48 19.7565 48 24C48 34.5274 35.9288 48.7256 32 53.0664Z"
        fill="black"/>
</svg>