<svg width="64" height="64" viewBox="0 0 64 64" fill="none" xmlns="http://www.w3.org/2000/svg">
    <path
        d="M12.3871 39.02V42.884C12.3931 43.6294 12.1788 44.3599 11.7711 44.984C11.6469 45.2442 11.4582 45.4684 11.223 45.6352C10.9878 45.8019 10.7138 45.9059 10.4271 45.937C9.94114 45.937 9.45581 45.573 8.97114 44.845C8.72426 44.5062 8.56083 44.1139 8.49414 43.7V27.988C8.52348 27.7225 8.61992 27.4687 8.7744 27.2507C8.92888 27.0328 9.13631 26.8577 9.37714 26.742C9.94573 26.3654 10.6131 26.1657 11.2951 26.168H15.8871C17.0814 26.1445 18.2604 26.4392 19.3031 27.022C20.2645 27.5639 21.055 28.3641 21.5851 29.332C22.1261 30.3382 22.4015 31.4657 22.3851 32.608C22.3888 33.4928 22.1832 34.3658 21.7851 35.156C21.3984 35.9394 20.8666 36.6425 20.2181 37.228C19.5969 37.7918 18.8813 38.242 18.1041 38.558C17.357 38.8624 16.5579 39.0193 15.7511 39.02H12.3871ZM15.7741 35.38C16.1469 35.3896 16.5178 35.3236 16.8644 35.1861C17.211 35.0487 17.5263 34.8425 17.7911 34.58C18.0555 34.3249 18.2642 34.0178 18.4039 33.6781C18.5437 33.3383 18.6115 32.9733 18.6031 32.606C18.6164 32.2329 18.5522 31.8611 18.4145 31.5142C18.2768 31.1672 18.0686 30.8525 17.8031 30.59C17.5347 30.3295 17.2165 30.1258 16.8675 29.9911C16.5185 29.8564 16.146 29.7934 15.7721 29.806H12.3871V35.38H15.7741ZM26.6941 45.768C26.2095 45.768 25.7241 45.404 25.2381 44.676C24.9852 44.3392 24.8215 43.944 24.7621 43.527V27.988C24.7915 27.7225 24.8879 27.4687 25.0424 27.2507C25.1969 27.0328 25.4043 26.8577 25.6451 26.742C26.2136 26.3652 26.8811 26.1654 27.5631 26.168H31.8461C33.5864 26.1388 35.3012 26.5885 36.8031 27.468C38.219 28.2954 39.3848 29.4902 40.1771 30.926C40.973 32.3752 41.3825 34.0048 41.3661 35.658C41.4103 37.5264 40.9817 39.3756 40.1201 41.034C39.3356 42.5181 38.1334 43.7397 36.6621 44.548C35.0942 45.3833 33.3383 45.8026 31.5621 45.766L26.6941 45.768ZM31.7941 41.96C32.5556 42.0024 33.3172 41.8777 34.0254 41.5948C34.7337 41.3118 35.3715 40.8774 35.8941 40.322C36.9375 39.0431 37.4619 37.4186 37.3631 35.771C37.4342 34.2338 36.9078 32.7288 35.8941 31.571C35.4055 31.0424 34.8084 30.6258 34.1437 30.3496C33.479 30.0735 32.7624 29.9443 32.0431 29.971H28.6541V41.96H31.7941ZM48.0861 37.815V42.884C48.0925 43.6295 47.8782 44.3601 47.4701 44.984C47.346 45.2443 47.1574 45.4686 46.9221 45.6354C46.6869 45.8022 46.4129 45.906 46.1261 45.937C45.6415 45.937 45.1561 45.573 44.6701 44.845C44.4176 44.5084 44.2539 44.1136 44.1941 43.697V27.988C44.2232 27.7225 44.3194 27.4688 44.4737 27.2508C44.6281 27.0328 44.8354 26.8577 45.0761 26.742C45.6448 26.3656 46.3122 26.1659 46.9941 26.168H56.0381C56.7295 26.168 57.0748 26.4947 57.0741 27.148C57.0745 27.6468 56.9745 28.1406 56.7801 28.6C56.6205 29.013 56.372 29.3858 56.0521 29.692C55.827 29.9256 55.522 30.0656 55.1981 30.084H48.0861V34.172H54.2741C54.9275 34.172 55.2541 34.48 55.2541 35.096C55.2615 35.7616 55.0715 36.4144 54.7081 36.972C54.5942 37.2046 54.4223 37.404 54.209 37.551C53.9957 37.6979 53.7481 37.7875 53.4901 37.811L48.0861 37.815ZM44.0001 60H16.0001C14.9393 60 13.9219 59.5786 13.1717 58.8284C12.4216 58.0783 12.0001 57.0609 12.0001 56V53C12.0001 52.4696 12.2109 51.9609 12.5859 51.5858C12.961 51.2107 13.4697 51 14.0001 51C14.5306 51 15.0393 51.2107 15.4144 51.5858C15.7894 51.9609 16.0001 52.4696 16.0001 53V56H44.0001C44.945 56.0022 45.8599 55.6682 46.5812 55.0578C47.3025 54.4474 47.7831 53.6003 47.9371 52.668C47.9807 52.4089 48.0749 52.1609 48.2144 51.9383C48.3538 51.7156 48.5357 51.5225 48.7498 51.3701C48.9638 51.2178 49.2058 51.109 49.4618 51.0502C49.7179 50.9913 49.983 50.9834 50.2421 51.027C50.5012 51.0706 50.7492 51.1648 50.9719 51.3043C51.1946 51.4437 51.3876 51.6256 51.54 51.8397C51.6924 52.0537 51.8011 52.2956 51.86 52.5517C51.9189 52.8078 51.9267 53.0729 51.8831 53.332C51.5736 55.1979 50.6108 56.8929 49.1668 58.1144C47.7227 59.3358 45.8915 60.0042 44.0001 60ZM51.4141 16.586L40.0001 5.17201C39.6297 4.79935 39.189 4.50388 38.7036 4.3027C38.2181 4.10153 37.6976 3.99865 37.1721 4.00001H20.0001C17.8791 4.0024 15.8457 4.84601 14.3459 6.34579C12.8461 7.84556 12.0025 9.87901 12.0001 12V18C12.0001 18.5304 12.2109 19.0392 12.5859 19.4142C12.961 19.7893 13.4697 20 14.0001 20C14.5306 20 15.0393 19.7893 15.4144 19.4142C15.7894 19.0392 16.0001 18.5304 16.0001 18V12C16.0001 10.9391 16.4216 9.92173 17.1717 9.17159C17.9219 8.42144 18.9393 8.00001 20.0001 8.00001H36.0001V16C36.0001 17.0609 36.4216 18.0783 37.1717 18.8284C37.9219 19.5786 38.9393 20 40.0001 20H50.0001C50.3956 19.9999 50.7822 19.8826 51.1111 19.6628C51.4399 19.443 51.6962 19.1307 51.8475 18.7653C51.9988 18.3999 52.0384 17.9979 51.9613 17.61C51.8842 17.222 51.6938 16.8657 51.4141 16.586ZM40.0001 10.828L45.1721 16H40.0001V10.828Z"
        fill="black"/>
</svg>