<svg width="64" height="64" viewBox="0 0 64 64" fill="none" xmlns="http://www.w3.org/2000/svg">
    <g>
        <path
            d="M12.5862 38.5859L30.5862 20.5859C30.7718 20.4002 30.9923 20.2528 31.2349 20.1523C31.4775 20.0517 31.7376 20 32.0002 20C32.2629 20 32.5229 20.0517 32.7655 20.1523C33.0082 20.2528 33.2286 20.4002 33.4143 20.5859L51.4143 38.5859C51.7893 38.9609 52 39.4696 52 40C52 40.5303 51.7893 41.039 51.4143 41.414C51.0392 41.7891 50.5306 41.9998 50.0002 41.9998C49.4698 41.9998 48.9612 41.7891 48.5862 41.414L32.0002 24.8281L15.4143 41.414C15.0392 41.7891 14.5306 41.9998 14.0002 41.9998C13.4698 41.9998 12.9612 41.7891 12.5862 41.414C12.2111 41.039 12.0004 40.5303 12.0004 40C12.0004 39.4696 12.2111 38.9609 12.5862 38.5859Z"
            fill="#0094FF"/>
    </g>
</svg>