<svg width="64" height="64" viewBox="0 0 64 64" fill="none" xmlns="http://www.w3.org/2000/svg">
    <path
        d="M50.8281 16L40 5.17189C39.6295 4.79923 39.1888 4.50376 38.7034 4.3026C38.2179 4.10145 37.6974 3.9986 37.1719 4.00001H20C17.879 4.00244 15.8456 4.84608 14.3458 6.34584C12.8461 7.84561 12.0024 9.87903 12 12V56C12.0011 57.0606 12.4228 58.0774 13.1727 58.8273C13.9227 59.5772 14.9395 59.999 16 60H44C46.121 59.9976 48.1544 59.154 49.6542 57.6542C51.1539 56.1544 51.9976 54.121 52 52V18.8281C52.0014 18.3027 51.8986 17.7821 51.6974 17.2967C51.4963 16.8112 51.2008 16.3705 50.8281 16ZM45.1719 16H40V10.8281L45.1719 16ZM44 56H16V12C16.0011 10.9395 16.4228 9.92267 17.1727 9.17276C17.9227 8.42284 18.9395 8.00107 20 8.00001H36V16C36.0011 17.0606 36.4228 18.0774 37.1727 18.8273C37.9227 19.5772 38.9395 19.999 40 20H48V52C47.9989 53.0606 47.5772 54.0774 46.8273 54.8273C46.0773 55.5772 45.0605 55.999 44 56ZM42 36C42 36.5304 41.7893 37.0391 41.4142 37.4142C41.0391 37.7893 40.5304 38 40 38H24C23.4696 38 22.9609 37.7893 22.5858 37.4142C22.2107 37.0392 22 36.5304 22 36C22 35.4696 22.2107 34.9609 22.5858 34.5858C22.9609 34.2107 23.4696 34 24 34H40C40.5304 34 41.0391 34.2108 41.4142 34.5858C41.7893 34.9609 42 35.4696 42 36ZM42 26C42 26.5304 41.7893 27.0391 41.4142 27.4142C41.0391 27.7893 40.5304 28 40 28H24C23.4696 28 22.9609 27.7893 22.5858 27.4142C22.2107 27.0392 22 26.5304 22 26C22 25.4696 22.2107 24.9609 22.5858 24.5858C22.9609 24.2107 23.4696 24 24 24H40C40.5304 24 41.0391 24.2108 41.4142 24.5858C41.7893 24.9609 42 25.4696 42 26ZM42 46C42 46.5304 41.7893 47.0391 41.4142 47.4142C41.0391 47.7893 40.5304 48 40 48H24C23.4696 48 22.9609 47.7893 22.5858 47.4142C22.2107 47.0392 22 46.5304 22 46C22 45.4696 22.2107 44.9609 22.5858 44.5858C22.9609 44.2107 23.4696 44 24 44H40C40.5304 44 41.0391 44.2108 41.4142 44.5858C41.7893 44.9609 42 45.4696 42 46Z"
        fill="black"/>
</svg>