<svg width="64" height="64" viewBox="0 0 64 64" fill="none" xmlns="http://www.w3.org/2000/svg">
    <path
        fill-rule="evenodd"
        clip-rule="evenodd"
        d="M12 8H52C54.2091 8 56 9.79086 56 12V26C56 28.2091 54.2091 30 52 30H12C9.79086 30 8 28.2091 8 26V12C8 9.79086 9.79086 8 12 8ZM26 26H52V12H26V26ZM22 26V12H12V26H22ZM12 34H22H26H52C54.2091 34 56 35.7909 56 38V52C56 54.2091 54.2091 56 52 56H12C9.79086 56 8 54.2091 8 52V38C8 35.7909 9.79086 34 12 34ZM12 38H22V52H12V38ZM52 52H26V38H52V52Z"
        fill="black"/>
</svg>