<svg width="64" height="64" viewBox="0 0 64 64" fill="none" xmlns="http://www.w3.org/2000/svg">
    <path
        d="M12 34C11.4696 34 10.9609 33.7893 10.5858 33.4142C10.2107 33.0391 10 32.5304 10 32C9.99957 27.5944 11.322 23.2901 13.7961 19.6447C16.2701 15.9993 19.7817 13.1808 23.8761 11.5542C27.9705 9.92761 32.459 9.56791 36.7601 10.5217C41.0613 11.4755 44.977 13.6988 48 16.9036V12C48 11.4696 48.2107 10.9609 48.5858 10.5858C48.9609 10.2107 49.4696 10 50 10C50.5304 10 51.0391 10.2107 51.4142 10.5858C51.7893 10.9609 52 11.4696 52 12V22C52 22.5304 51.7893 23.0391 51.4142 23.4142C51.0391 23.7893 50.5304 24 50 24H40C39.4696 24 38.9609 23.7893 38.5858 23.4142C38.2107 23.0391 38 22.5304 38 22C38 21.4696 38.2107 20.9609 38.5858 20.5858C38.9609 20.2107 39.4696 20 40 20H45.4133C42.9832 17.2828 39.7854 15.3676 36.243 14.5078C32.7005 13.648 28.9805 13.8841 25.5752 15.185C22.17 16.4858 19.24 18.79 17.173 21.7926C15.106 24.7952 13.9996 28.3547 14 32C14 32.5304 13.7893 33.0391 13.4142 33.4142C13.0391 33.7893 12.5304 34 12 34ZM52 30C51.4696 30 50.9609 30.2107 50.5858 30.5858C50.2107 30.9609 50 31.4696 50 32C50.0004 35.6453 48.894 39.2048 46.827 42.2074C44.76 45.21 41.83 47.5142 38.4248 48.815C35.0195 50.1159 31.2995 50.352 27.757 49.4922C24.2146 48.6324 21.0168 46.7172 18.5867 44H24C24.5304 44 25.0391 43.7893 25.4142 43.4142C25.7893 43.0391 26 42.5304 26 42C26 41.4696 25.7893 40.9609 25.4142 40.5858C25.0391 40.2107 24.5304 40 24 40H14C13.4696 40 12.9609 40.2107 12.5858 40.5858C12.2107 40.9609 12 41.4696 12 42V52C12 52.5304 12.2107 53.0391 12.5858 53.4142C12.9609 53.7893 13.4696 54 14 54C14.5304 54 15.0391 53.7893 15.4142 53.4142C15.7893 53.0391 16 52.5304 16 52V47.0964C19.023 50.3012 22.9387 52.5245 27.2399 53.4783C31.541 54.4321 36.0295 54.0724 40.1239 52.4458C44.2183 50.8192 47.7299 48.0007 50.2039 44.3553C52.678 40.7099 54.0004 36.4056 54 32C54 31.4696 53.7893 30.9609 53.4142 30.5858C53.0391 30.2107 52.5304 30 52 30Z"
        fill="black"/>
</svg>