<svg width="64" height="64" viewBox="0 0 64 64" fill="none" xmlns="http://www.w3.org/2000/svg">
    <path
        d="M28 18C28 17.2089 28.2346 16.4355 28.6741 15.7777C29.1137 15.1199 29.7384 14.6072 30.4693 14.3045C31.2002 14.0017 32.0044 13.9225 32.7804 14.0769C33.5563 14.2312 34.269 14.6122 34.8284 15.1716C35.3878 15.731 35.7688 16.4437 35.9231 17.2196C36.0775 17.9956 35.9983 18.7998 35.6955 19.5307C35.3928 20.2616 34.8801 20.8864 34.2223 21.3259C33.5645 21.7654 32.7911 22 32 22C30.9391 22 29.9217 21.5786 29.1716 20.8284C28.4214 20.0783 28 19.0609 28 18ZM32 28C31.2089 28 30.4355 28.2346 29.7777 28.6741C29.1199 29.1136 28.6072 29.7384 28.3045 30.4693C28.0017 31.2002 27.9225 32.0044 28.0769 32.7804C28.2312 33.5563 28.6122 34.269 29.1716 34.8284C29.731 35.3878 30.4437 35.7688 31.2196 35.9231C31.9956 36.0775 32.7998 35.9983 33.5307 35.6955C34.2616 35.3928 34.8864 34.8801 35.3259 34.2223C35.7654 33.5645 36 32.7911 36 32C36 30.9391 35.5786 29.9217 34.8284 29.1716C34.0783 28.4214 33.0609 28 32 28ZM32 42C31.2089 42 30.4355 42.2346 29.7777 42.6741C29.1199 43.1136 28.6072 43.7384 28.3045 44.4693C28.0017 45.2002 27.9225 46.0044 28.0769 46.7804C28.2312 47.5563 28.6122 48.269 29.1716 48.8284C29.731 49.3878 30.4437 49.7688 31.2196 49.9231C31.9956 50.0775 32.7998 49.9983 33.5307 49.6955C34.2616 49.3928 34.8864 48.8801 35.3259 48.2223C35.7654 47.5645 36 46.7911 36 46C36 44.9391 35.5786 43.9217 34.8284 43.1716C34.0783 42.4214 33.0609 42 32 42Z"
        fill="white"/>
</svg>