{
    "/src/vendor/bootstrap-floating-label/bootstrap-floating-label.css": "/src/vendor/bootstrap-floating-label/bootstrap-floating-label.css",
    "/dist/css/fonts.css": "/dist/css/fonts.css",
    "/src/vendor/fixto/fixto.min.js": "/src/vendor/fixto/fixto.min.js",
    "/src/vendor/bootstrap/bootstrap.min.css": "/src/vendor/bootstrap/bootstrap.min.css",
    "/src/vendor/bootstrap/bootstrap.min.css.map": "/src/vendor/bootstrap/bootstrap.min.css.map",
    "/src/vendor/bootstrap/bootstrap.min.js": "/src/vendor/bootstrap/bootstrap.min.js",
    "/src/vendor/bootstrap/bootstrap.min.js.map": "/src/vendor/bootstrap/bootstrap.min.js.map",
    "/src/vendor/bootstrap/bootstrap.bundle.min.js": "/src/vendor/bootstrap/bootstrap.bundle.min.js",
    "/src/vendor/bootstrap/bootstrap.bundle.min.js.map": "/src/vendor/bootstrap/bootstrap.bundle.min.js.map",
    "/src/vendor/popper.js/popper.min.js": "/src/vendor/popper.js/popper.min.js",
    "/src/vendor/popper.js/popper.min.js.map": "/src/vendor/popper.js/popper.min.js.map",
    "/src/vendor/bootstrap-confirmation2/bootstrap-confirmation.js": "/src/vendor/bootstrap-confirmation2/bootstrap-confirmation.js",
    "/src/vendor/bootstrap-confirmation2/bootstrap-confirmation.js.map": "/src/vendor/bootstrap-confirmation2/bootstrap-confirmation.js.map",
    "/src/vendor/jquery/jquery.min.js": "/src/vendor/jquery/jquery.min.js",
    "/src/vendor/jquery/jquery.min.map": "/src/vendor/jquery/jquery.min.map",
    "/src/vendor/jquery-validation/jquery.validate.min.js": "/src/vendor/jquery-validation/jquery.validate.min.js",
    "/src/vendor/jquery-validation/localization/messages_et.min.js": "/src/vendor/jquery-validation/localization/messages_et.min.js",
    "/src/vendor/jquery-validation/localization/messages_uk.min.js": "/src/vendor/jquery-validation/localization/messages_uk.min.js",
    "/src/vendor/jquery-inline-svg/jquery-inline-svg.min.js": "/src/vendor/jquery-inline-svg/jquery-inline-svg.min.js",
    "/src/vendor/dropzone/dropzone-min.js": "/src/vendor/dropzone/dropzone-min.js",
    "/src/vendor/dropzone/dropzone-min.js.map": "/src/vendor/dropzone/dropzone-min.js.map",
    "/src/vendor/dropzone/dropzone.css": "/src/vendor/dropzone/dropzone.css",
    "/src/vendor/dropzone/dropzone.css.map": "/src/vendor/dropzone/dropzone.css.map",
    "/src/vendor/gridjs/gridjs.production.min.js": "/src/vendor/gridjs/gridjs.production.min.js",
    "/src/vendor/gridjs/gridjs.production.min.js.map": "/src/vendor/gridjs/gridjs.production.min.js.map",
    "/src/vendor/gridjs-jquery/gridjs.production.min.js": "/src/vendor/gridjs-jquery/gridjs.production.min.js",
    "/src/vendor/gridjs-jquery/gridjs.production.min.js.map": "/src/vendor/gridjs-jquery/gridjs.production.min.js.map",
    "/public/index.html": "/public/index.html",
    "/dist/css/main.css": "/dist/css/main.css",
    "/dist/js/address.documents.js": "/dist/js/address.documents.js",
    "/dist/js/address.main.js": "/dist/js/address.main.js",
    "/dist/js/address.map.coords.js": "/dist/js/address.map.coords.js",
    "/dist/js/address.map.new.js": "/dist/js/address.map.new.js",
    "/dist/js/address.search.new.js": "/dist/js/address.search.new.js",
    "/dist/js/address.task.js": "/dist/js/address.task.js",
    "/dist/js/address.tasks.js": "/dist/js/address.tasks.js",
    "/dist/js/jquery.custom.js": "/dist/js/jquery.custom.js"
}
