<svg width="65" height="64" viewBox="0 0 65 64" fill="none" xmlns="http://www.w3.org/2000/svg">
    <path
        fill-rule="evenodd"
        clip-rule="evenodd"
        d="M32 60C47.464 60 60 47.464 60 32C60 16.536 47.464 4 32 4C16.536 4 4 16.536 4 32C4.01731 47.4568 16.5432 59.9827 32 60ZM32 8.30769C45.0849 8.30769 55.6923 18.9151 55.6923 32C55.6923 45.0849 45.0849 55.6923 32 55.6923C18.9151 55.6923 8.30769 45.0849 8.30769 32C8.32247 18.9212 18.9212 8.32247 32 8.30769Z"
        fill="#E4175C"/>
    <path
        d="M29.3491 38.6031V20.6807C29.348 19.8662 29.4903 19.0598 29.7675 18.3096C29.9945 17.6371 30.3484 17.0302 30.804 16.5322C31.1251 16.1524 31.5593 15.9246 32.0204 15.894C32.6852 15.894 33.3496 16.471 34.0134 17.625C34.3738 18.1337 34.5955 18.7525 34.6509 19.4042V37.3267C34.6509 37.9947 34.2454 38.6329 33.4345 39.2414C32.6632 39.835 31.7547 40.1521 30.825 40.1523C29.8423 40.1524 29.3503 39.636 29.3491 38.6031Z"
        fill="#E4175C"/>
    <path
        d="M33.66 44.6959C33.9649 45.0866 34.161 45.551 34.2284 46.0419C34.2284 46.5397 33.8893 47.0083 33.2109 47.4476C32.5638 47.8771 31.8043 48.1062 31.0275 48.1061C30.1902 48.1061 29.7716 47.7271 29.7716 46.9693C29.7703 46.3788 29.8874 45.7941 30.116 45.2496C30.3064 44.7579 30.6022 44.3138 30.9826 43.9487C31.2626 43.6591 31.6427 43.4875 32.045 43.4692C32.5635 43.4692 33.1019 43.8781 33.66 44.6959Z"
        fill="#E4175C"/>
</svg>