<svg width="64" height="64" viewBox="0 0 64 64" fill="none" xmlns="http://www.w3.org/2000/svg">
    <path
        fill-rule="evenodd"
        clip-rule="evenodd"
        d="M13.9737 14.1447C11.7718 14.1447 9.98685 15.9297 9.98685 18.1315V50.0263C9.98685 52.2282 11.7718 54.0131 13.9737 54.0131H45.8685C48.0703 54.0131 49.8553 52.2282 49.8553 50.0263V36.5153C49.8553 35.4144 50.7478 34.5219 51.8487 34.5219C52.9497 34.5219 53.8422 35.4144 53.8422 36.5153V50.0263C53.8422 54.43 50.2722 58 45.8685 58H13.9737C9.56994 58 6 54.43 6 50.0263V18.1315C6 13.7278 9.56994 10.1578 13.9737 10.1578H27.4847C28.5856 10.1578 29.4781 11.0503 29.4781 12.1513C29.4781 13.2522 28.5856 14.1447 27.4847 14.1447H13.9737Z"
        fill="black"/>
    <path
        fill-rule="evenodd"
        clip-rule="evenodd"
        d="M44.0912 7.16772C45.6482 5.61076 48.1725 5.61076 49.7295 7.16773L56.8331 14.2714C58.3901 15.8284 58.3901 18.3527 56.8331 19.9096L39.5163 37.2264C38.9801 37.7626 38.3022 38.1347 37.562 38.2992L28.4287 40.3289C25.5801 40.9619 23.0389 38.4207 23.672 35.5721L25.7016 26.4388C25.8661 25.6986 26.2383 25.0207 26.7744 24.4846L44.0912 7.16772ZM46.9104 9.98685L29.5935 27.3037L27.5639 36.437L36.6972 34.4073L54.014 17.0905L46.9104 9.98685Z"
        fill="black"/>
</svg>