<svg width="64" height="64" viewBox="0 0 64 64" fill="none" xmlns="http://www.w3.org/2000/svg">
    <g>
        <path
            d="M12.5862 22.5859C12.7718 22.4002 12.9923 22.2528 13.2349 22.1523C13.4775 22.0517 13.7376 22 14.0002 22C14.2629 22 14.5229 22.0517 14.7655 22.1523C15.0082 22.2528 15.2286 22.4002 15.4143 22.5859L32.0002 39.1719L48.5862 22.5859C48.9612 22.2109 49.4698 22.0002 50.0002 22.0002C50.5306 22.0002 51.0392 22.2109 51.4143 22.5859C51.7893 22.961 52 23.4696 52 24C52 24.5304 51.7893 25.039 51.4143 25.4141L33.4143 43.4141C33.2286 43.5998 33.0082 43.7472 32.7655 43.8477C32.5229 43.9483 32.2629 44 32.0002 44C31.7376 44 31.4775 43.9483 31.2349 43.8477C30.9923 43.7472 30.7718 43.5998 30.5862 43.4141L12.5862 25.4141C12.4004 25.2284 12.253 25.008 12.1525 24.7653C12.052 24.5227 12.0002 24.2626 12.0002 24C12.0002 23.7374 12.052 23.4773 12.1525 23.2347C12.253 22.992 12.4004 22.7716 12.5862 22.5859Z"
            fill="black"/>
    </g>
</svg>