<svg width="64" height="64" viewBox="0 0 64 64" fill="none" xmlns="http://www.w3.org/2000/svg">
    <g>
        <path
            d="M45.9998 32C46 32.2804 45.9411 32.5576 45.827 32.8137C45.7129 33.0698 45.5462 33.299 45.3377 33.4864L25.3377 51.4864C24.9435 51.8412 24.4245 52.0249 23.8948 51.9971C23.3652 51.9692 22.8683 51.7321 22.5135 51.3379C22.1586 50.9437 21.9749 50.4247 22.0028 49.8951C22.0306 49.3654 22.2677 48.8685 22.6619 48.5137L41.0105 32L22.6619 15.4864C22.4667 15.3107 22.308 15.0982 22.1949 14.8612C22.0818 14.6242 22.0165 14.3672 22.0028 14.105C21.989 13.8427 22.027 13.5803 22.1146 13.3328C22.2022 13.0852 22.3378 12.8573 22.5135 12.6621C22.6891 12.4669 22.9016 12.3083 23.1386 12.1952C23.3756 12.0821 23.6326 12.0168 23.8948 12.003C24.1571 11.9892 24.4195 12.0272 24.667 12.1148C24.9146 12.2025 25.1425 12.338 25.3377 12.5137L45.3377 30.5137C45.5462 30.7011 45.7129 30.9303 45.827 31.1864C45.9411 31.4424 46 31.7197 45.9998 32Z"
            fill="black"/>
    </g>
</svg>