{
  "extends": "../../../../tslint.json",
  "rules": {
    "directive-selector": [true, "attribute", "jsMono", "camelCase"],
    "component-selector": [true, "element", "js-mono", "kebab-case"]
  },
  "linterOptions": {
    "exclude": ["!**/*"]
  }
}
