<svg xmlns="http://www.w3.org/2000/svg" width="36" height="46" viewBox="0 0 36 46">
  <path id="Polygon_1" data-name="Polygon 1" d="M20.472,3.957a3,3,0,0,1,5.056,0L43.051,31.385A3,3,0,0,1,40.523,36H5.477a3,3,0,0,1-2.528-4.615Z" transform="translate(36) rotate(90)" fill="#1d3f5a"/>
</svg>
