com\sg\user\account\model\BalanceAccount.class
com\sg\user\account\util\TransactionType.class
com\sg\user\account\model\Transaction.class
com\sg\user\account\util\AccountType.class
com\sg\user\account\UserAccountMain.class
com\sg\user\account\model\User.class
com\sg\user\account\model\Wallet.class
com\sg\user\account\model\Account.class
com\sg\user\account\util\TransactionStatus.class
