{
  "transform": {
    "^.+\\.(t|j)sx?$": "ts-jest"
  },
  "collectCoverage": true,
  "collectCoverageFrom": [
    "./src/*.ts"
  ],
  "testRegex": "(/tests/.*|(\\.|/)(test|spec))\\.(jsx?|tsx?)$",
  "moduleFileExtensions": ["ts", "tsx", "js", "jsx", "json", "node"]
}
