module questions

go 1.14

require (
	github.com/gin-gonic/gin v1.6.3
	github.com/go-playground/validator/v10 v10.3.0 // indirect
	github.com/golang/protobuf v1.4.2 // indirect
	github.com/gorilla/sessions v1.2.1
	github.com/jinzhu/gorm v1.9.16 // indirect
	github.com/json-iterator/go v1.1.10 // indirect
	github.com/modern-go/concurrent v0.0.0-20180306012644-bacd9c7ef1dd // indirect
	github.com/modern-go/reflect2 v1.0.1 // indirect
	github.com/okta/okta-jwt-verifier-golang v1.0.0
	golang.org/x/sys v0.0.0-20200821140526-fda516888d29 // indirect
	google.golang.org/protobuf v1.25.0 // indirect
	gopkg.in/yaml.v2 v2.3.0 // indirect
	gorm.io/driver/postgres v1.0.0
	gorm.io/gorm v1.20.0
)
