<svg width="100" height="100" viewBox="0 0 100 100" fill="none" xmlns="http://www.w3.org/2000/svg">
<path d="M72.8999 78.6C70.3999 79.9 67.6999 80.9 64.7999 81.6C62.2999 82.2 59.4999 82.4 56.4999 82.4C53.3999 82.2 50.7999 81.8 48.3999 81.1C45.8999 80.4 43.4999 79.3 41.2999 77.9C40.8999 77.7 40.6999 77.2 40.5999 76.8C40.5999 76.3 40.7999 75.9 41.1999 75.6L44.1999 73.5C44.2999 73.4 44.3999 73.3 44.4999 73.2C44.7999 72.9 44.8999 72.4 44.6999 72C44.5999 71.8 44.4999 71.3 43.9999 71.1L38.8999 68.7L22.3999 61C21.6999 60.7 21.1999 61 20.9999 61.1C20.7999 61.2 20.3999 61.6 20.3999 62.3L22.4999 86C22.5999 86.7 23.0999 87 23.2999 87.1C23.4999 87.2 24.0999 87.4 24.6999 87L28.1999 84.6C28.5999 84.3 29.1999 84.3 29.6999 84.5C34.9999 87.5 40.9999 89.4 46.9999 89.8C53.5999 90.3 60.3999 89.1 66.5999 86.3C69.5999 84.9 72.3999 83.1 74.7999 81.2C76.8999 79.4 78.7999 77.4 80.3999 75.4H77.9999C76.3999 76.6 74.6999 77.7 72.8999 78.6Z" fill="#63AA78"/>
<path d="M84.8003 27.4H81.4003L82.3003 37.3C82.3003 37.9 82.2003 38.4 82.1003 38.9C82.5003 39.1 82.8003 39.6 82.8003 40.1V59.9C82.8003 60.7 82.2003 61.3 81.4003 61.3C79.8003 61.3 78.2003 61.9 77.1003 63.1C75.9003 64.3 75.3003 65.8 75.3003 67.4C75.3003 68.2 74.7003 68.8 73.9003 68.8H45.6003C46.5003 69.4 47.2003 70.2 47.5003 71.3C47.6003 71.7 47.6003 72.2 47.6003 72.6H84.9003C86.4003 72.6 87.7003 71.4 87.7003 69.8V30.2C87.5003 28.6 86.3003 27.4 84.8003 27.4Z" fill="#242424"/>
<path d="M27.0998 21.4C29.5998 20.1 32.2998 19.1 35.1998 18.4C37.7998 17.8 40.4998 17.6 43.4998 17.6C46.5998 17.8 49.1998 18.2 51.5998 18.9C54.0998 19.6 56.4998 20.7 58.6998 22.1C59.0998 22.3 59.2998 22.8 59.3998 23.2C59.3998 23.7 59.1998 24.1 58.7998 24.4L55.7998 26.5C55.5998 26.6 55.5998 26.7 55.4998 26.7C55.1998 27.1 55.0998 27.5 55.1998 27.9C55.2998 28.1 55.3998 28.6 55.8998 28.8L77.4998 38.8C77.9998 39 78.4998 39 78.8998 38.7C79.0998 38.5 79.4998 38.1 79.4998 37.4L77.3998 13.7C77.2998 13 76.7998 12.7 76.5998 12.6C76.3998 12.5 75.7997 12.3 75.1997 12.7L71.6997 15.1C71.2997 15.4 70.6997 15.4 70.1997 15.2C64.7998 12.2 58.8998 10.3 52.8998 9.9C46.2998 9.4 39.4998 10.6 33.2998 13.4C30.2998 14.9 27.4998 16.6 25.0998 18.6C22.9998 20.4 21.0998 22.4 19.4998 24.4H21.9998C23.5998 23.4 25.2998 22.3 27.0998 21.4Z" fill="#2F814D"/>
<path d="M23.6002 58.5L39.7002 66H72.6002C72.9002 64.1 73.7002 62.4 75.1002 61.1C76.4002 59.7 78.1002 58.9 80.0002 58.6V41.4C79.4002 41.7 78.8002 41.9 78.1002 41.9C77.5002 41.9 76.9002 41.8 76.3002 41.5L60.3002 34H27.4002C26.8002 37.8 23.8002 40.8 20.0002 41.4V58.6H20.1002C21.1002 58 22.4002 58 23.6002 58.5ZM44.4002 44.4C44.9002 42.4 46.6002 40.9 48.6002 40.6V38.3C48.6002 37.5 49.2002 36.9 50.0002 36.9C50.8002 36.9 51.4002 37.5 51.4002 38.3V40.8L54.8002 41.7C55.5002 41.9 56.0002 42.7 55.8002 43.4C55.6002 44.1 54.8002 44.6 54.1002 44.4L50.3002 43.4C48.9002 43 47.5002 43.9 47.2002 45.2C47.0002 45.9 47.1002 46.6 47.4002 47.1C47.7002 47.7 48.3002 48.1 49.0002 48.3L51.9002 49.1C53.3002 49.5 54.4002 50.3 55.1002 51.6C55.8002 52.8 56.0002 54.3 55.6002 55.7C55.2002 57.1 54.4002 58.2 53.1002 58.9C52.5002 59.2 52.0002 59.4 51.3002 59.5V61.7C51.3002 62.5 50.7002 63.1 49.9002 63.1C49.1002 63.1 48.5002 62.5 48.5002 61.7V59.2L45.2002 58.3C44.5002 58.1 44.0002 57.3 44.2002 56.6C44.4002 55.9 45.1002 55.4 45.9002 55.6L49.7002 56.6C50.4002 56.8 51.1002 56.7 51.6002 56.4C52.2002 56.1 52.6002 55.5 52.8002 54.9C53.0002 54.2 52.9002 53.5 52.6002 52.9C52.3002 52.3 51.7002 51.9 51.1002 51.7L48.2002 50.9C46.8002 50.5 45.7002 49.6 45.0002 48.4C44.2002 47.2 44.1002 45.8 44.4002 44.4Z" fill="#242424"/>
<path d="M17.9004 61.1C17.5004 60.9 17.2004 60.4 17.2004 59.9V40.1C17.2004 39.3 17.8004 38.7 18.6004 38.7C22.0004 38.7 24.7004 35.9 24.7004 32.6C24.7004 31.8 25.3004 31.2 26.1004 31.2H54.5004C53.6004 30.6 52.9004 29.8 52.6004 28.7C52.5004 28.3 52.5004 27.8 52.5004 27.4H15.2004C13.7004 27.4 12.4004 28.6 12.4004 30.2V69.9C12.4004 71.4 13.6004 72.7 15.2004 72.7H18.6004L17.7004 62.8C17.7004 62.1 17.8004 61.6 17.9004 61.1Z" fill="#242424"/>
</svg>
