<svg width="16" height="16" viewBox="0 0 16 16" fill="none" xmlns="http://www.w3.org/2000/svg">
<path d="M10.6923 5.30769C10.6923 4.59077 10.6923 4.23231 10.5754 3.95C10.4981 3.76322 10.3847 3.5935 10.2418 3.45056C10.0988 3.30761 9.92909 3.19424 9.74231 3.11692C9.46 3 9.10154 3 8.38462 3H6.07692C4.62615 3 3.90154 3 3.45077 3.45077C3 3.90154 3 4.62615 3 6.07692V8.38462C3 9.10154 3 9.46 3.11692 9.74231C3.19424 9.92909 3.30761 10.0988 3.45056 10.2418C3.5935 10.3847 3.76322 10.4981 3.95 10.5754C4.23231 10.6923 4.59077 10.6923 5.30769 10.6923" stroke="white"/>
<path d="M11.4615 5.30769H6.84608C5.99641 5.30769 5.30762 5.99649 5.30762 6.84616V11.4615C5.30762 12.3112 5.99641 13 6.84608 13H11.4615C12.3111 13 12.9999 12.3112 12.9999 11.4615V6.84616C12.9999 5.99649 12.3111 5.30769 11.4615 5.30769Z" stroke="white"/>
</svg>
