<svg width="16" height="17" viewBox="0 0 16 17" fill="none" xmlns="http://www.w3.org/2000/svg">
<path d="M8 13.8333L8 8.87713C8 8.66885 7.83116 8.5 7.62288 8.5L2.66667 8.5" stroke="#2F814D" stroke-width="1.5" stroke-linecap="round"/>
<path d="M13.3333 8.5H8.3771C8.16882 8.5 7.99998 8.33116 7.99998 8.12288V3.16667" stroke="#2F814D" stroke-width="1.5" stroke-linecap="round"/>
</svg>
