<svg width="24" height="24" viewBox="0 0 24 24" fill="none" xmlns="http://www.w3.org/2000/svg">
<path d="M18 15L12.4243 9.42426C12.1899 9.18995 11.81 9.18995 11.5757 9.42426L6 15" stroke="#242424" stroke-width="1.5" stroke-linecap="round"/>
</svg>
