<svg width="24" height="24" viewBox="0 0 24 24" fill="none" xmlns="http://www.w3.org/2000/svg">
<path d="M15 18L9.42426 12.4243C9.18995 12.1899 9.18995 11.8101 9.42426 11.5757L15 6" stroke="#242424" stroke-width="1.5" stroke-linecap="round"/>
</svg>
