[
  {
    "label": "Ama de casa",
    "value": "Ama de casa"
  },
  {
    "label": "Servidor público",
    "value": "Servidor público"
  },
  {
    "label": "Empleado",
    "value": "Empleado"
  },
  {
    "label": "Independiente",
    "value": "Independiente"
  },
  {
    "label": "Pensionado",
    "value": "Pensionado"
  },
  {
    "label": "Religioso",
    "value": "Religioso"
  },
  {
    "label": "Socio/ Renstista de capítal",
    "value": "Socio/ Renstista de capítal"
  },
  {
    "label": "Estudiante",
    "value": "Estudiante"
  }
]
