[
  {
    "countries": [
      { "name": "NO INFORMADO", "dane": "000" },
      { "name": "AFGANISTAN", "dane": "013" },
      { "name": "ALBANIA", "dane": "017" },
      { "name": "ALEMANIA", "dane": "023" },
      { "name": "ARMENIA", "dane": "026" },
      { "name": "ARUBA", "dane": "027" },
      { "name": "BOSNIA - HERZEGOVINA", "dane": "029" },
      { "name": "BURKINAFASO", "dane": "031" },
      { "name": "ANDORRA", "dane": "037" },
      { "name": "ANGOLA", "dane": "040" },
      { "name": "ANGUILLA", "dane": "041" },
      { "name": "ANTIGUA Y BARBUDA", "dane": "043" },
      { "name": "ANTILLAS HOLANDESAS", "dane": "047" },
      { "name": "ARABIA SAUDITA", "dane": "053" },
      { "name": "ARGELIA", "dane": "059" },
      { "name": "ARGENTINA", "dane": "063" },
      { "name": "AUSTRALIA", "dane": "069" },
      { "name": "AUSTRIA", "dane": "072" },
      { "name": "AZERBAIJAN", "dane": "074" },
      { "name": "BAHAMAS", "dane": "077" },
      { "name": "BAHREIN", "dane": "080" },
      { "name": "BANGLADESH", "dane": "081" },
      { "name": "BARBADOS", "dane": "083" },
      { "name": "BELGICA", "dane": "087" },
      { "name": "BELICE", "dane": "088" },
      { "name": "BERMUDAS", "dane": "090" },
      { "name": "BELARUS", "dane": "091" },
      { "name": "MYANMAR", "dane": "093" },
      { "name": "BOLIVIA", "dane": "097" },
      { "name": "BOTSWANA", "dane": "101" },
      { "name": "BRASIL", "dane": "105" },
      { "name": "BRUNEIDARUSSALAM", "dane": "108" },
      { "name": "BULGARIA", "dane": "111" },
      { "name": "BURUNDI", "dane": "115" },
      { "name": "BUTAN", "dane": "119" },
      { "name": "CABOVERDE", "dane": "127" },
      { "name": "CAIMAN, ISLAS", "dane": "137" },
      { "name": "CAMBOYA", "dane": "141" },
      { "name": "CAMERUN, REP UNIDA DEL", "dane": "145" },
      { "name": "CANADA", "dane": "149" },
      { "name": "SANTA SEDE", "dane": "159" },
      { "name": "COCOS (KEELING), ISLAS", "dane": "165" },
      { "name": "COLOMBIA", "dane": "169" },
      { "name": "COMORAS", "dane": "173" },
      { "name": "CONGO", "dane": "177" },
      { "name": "COOK, ISLAS", "dane": "183" },
      { "name": "COREA (NORTE), REP POP DEM DE", "dane": "187" },
      { "name": "COREA (SUR), REP DE", "dane": "190" },
      { "name": "COSTA DE MARFIL", "dane": "193" },
      { "name": "COSTA RICA", "dane": "196" },
      { "name": "CROACIA", "dane": "198" },
      { "name": "CUBA", "dane": "199" },
      { "name": "CHAD", "dane": "203" },
      { "name": "CHILE", "dane": "211" },
      { "name": "CHINA", "dane": "215" },
      { "name": "TAIWAN (FORMOSA)", "dane": "218" },
      { "name": "CHIPRE", "dane": "221" },
      { "name": "BENIN", "dane": "229" },
      { "name": "DINAMARCA", "dane": "232" },
      { "name": "DOMINICA", "dane": "235" },
      { "name": "ECUADOR", "dane": "239" },
      { "name": "EGIPTO", "dane": "240" },
      { "name": "EL SALVADOR", "dane": "242" },
      { "name": "ERITREA", "dane": "243" },
      { "name": "EMIRATOS ARABES UNIDOS", "dane": "244" },
      { "name": "ESPAÑA", "dane": "245" },
      { "name": "ESLOVAQUIA", "dane": "246" },
      { "name": "ESLOVENIA", "dane": "247" },
      { "name": "ESTADOS UNIDOS", "dane": "249" },
      { "name": "ESTONIA", "dane": "251" },
      { "name": "ETIOPIA", "dane": "253" },
      { "name": "FEROE, ISLAS", "dane": "259" },
      { "name": "FILIPINAS", "dane": "267" },
      { "name": "FINLANDIA", "dane": "271" },
      { "name": "FRANCIA", "dane": "275" },
      { "name": "GABON", "dane": "281" },
      { "name": "GAMBIA", "dane": "285" },
      { "name": "GAZA Y JERICO", "dane": "286" },
      { "name": "GEORGIA", "dane": "287" },
      { "name": "GHANA", "dane": "289" },
      { "name": "GIBRALTAR", "dane": "293" },
      { "name": "GRANADA", "dane": "297" },
      { "name": "GRECIA", "dane": "301" },
      { "name": "GROENLANDIA", "dane": "305" },
      { "name": "GUADALUPE", "dane": "309" },
      { "name": "GUAM", "dane": "313" },
      { "name": "GUATEMALA", "dane": "317" },
      { "name": "GUAYANA FRANCESA", "dane": "325" },
      { "name": "GUINEA", "dane": "329" },
      { "name": "GUINEA ECUATORIAL", "dane": "331" },
      { "name": "GUINEA BISSAU", "dane": "334" },
      { "name": "GUYANA", "dane": "337" },
      { "name": "HAITI", "dane": "341" },
      { "name": "HONDURAS", "dane": "345" },
      { "name": "HONG KONG", "dane": "351" },
      { "name": "HUNGRIA", "dane": "355" },
      { "name": "INDIA", "dane": "361" },
      { "name": "INDONESIA", "dane": "365" },
      { "name": "IRAK", "dane": "369" },
      { "name": "IRAN, REP ISLAMICA DEL", "dane": "372" },
      { "name": "IRLANDA (EIRE)", "dane": "375" },
      { "name": "ISLANDIA", "dane": "379" },
      { "name": "ISRAEL", "dane": "383" },
      { "name": "ITALIA", "dane": "386" },
      { "name": "JAMAICA", "dane": "391" },
      { "name": "JOHNSTON, ISLA", "dane": "395" },
      { "name": "JAPON", "dane": "399" },
      { "name": "JORDANIA", "dane": "403" },
      { "name": "KAZAJSTAN", "dane": "406" },
      { "name": "KENIA", "dane": "410" },
      { "name": "KIRIBATI", "dane": "411" },
      { "name": "KIRGUIZISTAN", "dane": "412" },
      { "name": "KUWAIT", "dane": "413" },
      { "name": "LAOS, REP POP DEMOCRATICA DE", "dane": "420" },
      { "name": "LESOTHO", "dane": "426" },
      { "name": "LETONIA", "dane": "429" },
      { "name": "LIBANO", "dane": "431" },
      { "name": "LIBERIA", "dane": "434" },
      { "name": "LIBIA", "dane": "438" },
      { "name": "LIECHTENSTEIN", "dane": "440" },
      { "name": "LITUANIA", "dane": "443" },
      { "name": "LUXEMBURGO", "dane": "445" },
      { "name": "MACAO", "dane": "447" },
      { "name": "MACEDONIA", "dane": "448" },
      { "name": "MADAGASCAR", "dane": "450" },
      { "name": "MALAYSIA", "dane": "455" },
      { "name": "MALAWI", "dane": "458" },
      { "name": "MALDIVAS", "dane": "461" },
      { "name": "MALI", "dane": "464" },
      { "name": "MALTA", "dane": "467" },
      { "name": "MARIANAS DE NORTE, ISLAS", "dane": "469" },
      { "name": "MARSHALL, ISLAS", "dane": "472" },
      { "name": "MARRUECOS", "dane": "474" },
      { "name": "MARTINICA", "dane": "477" },
      { "name": "MAURICIO", "dane": "485" },
      { "name": "MAURITANIA", "dane": "488" },
      { "name": "MEXICO", "dane": "493" },
      { "name": "MICRONESIA, ESTADOS FEDERA DE", "dane": "494" },
      { "name": "MIDWAY, ISLAS", "dane": "495" },
      { "name": "MOLDAVIA", "dane": "496" },
      { "name": "MONGOLIA", "dane": "497" },
      { "name": "MONACO", "dane": "498" },
      { "name": "MONTSERRAT, ISLA", "dane": "501" },
      { "name": "MOZAMBIQUE", "dane": "505" },
      { "name": "NAMIBIA", "dane": "507" },
      { "name": "NAURU", "dane": "508" },
      { "name": "NAVIDAD (CHRISTMAS), ISLA", "dane": "511" },
      { "name": "NEPAL", "dane": "517" },
      { "name": "NICARAGUA", "dane": "521" },
      { "name": "NIGER", "dane": "525" },
      { "name": "NIGERIA", "dane": "528" },
      { "name": "NIUE, ISLA", "dane": "531" },
      { "name": "NORFOLK, ISLA", "dane": "535" },
      { "name": "NORUEGA", "dane": "538" },
      { "name": "NUEVA CALEDONIA", "dane": "542" },
      { "name": "PAPUASIA NUEVA GUINEA", "dane": "545" },
      { "name": "NUEVA ZELANDA", "dane": "548" },
      { "name": "VANUATU", "dane": "551" },
      { "name": "OMAN", "dane": "556" },
      { "name": "PAISES BAJOS", "dane": "573" },
      { "name": "PAKISTAN", "dane": "576" },
      { "name": "PALAU, ISLAS", "dane": "578" },
      { "name": "PANAMA", "dane": "580" },
      { "name": "PARAGUAY", "dane": "586" },
      { "name": "PERU", "dane": "589" },
      { "name": "PITCAIRN, ISLA", "dane": "593" },
      { "name": "POLINESIA FRANCESA", "dane": "599" },
      { "name": "POLONIA", "dane": "603" },
      { "name": "PORTUGAL", "dane": "607" },
      { "name": "PUERTO RICO", "dane": "611" },
      { "name": "QATAR", "dane": "618" },
      { "name": "REINO UNIDO", "dane": "628" },
      { "name": "REPUBLICA CENTRO AFRICANA", "dane": "640" },
      { "name": "REPUBLICA CHECA", "dane": "644" },
      { "name": "REPUBLICA DOMINICANA", "dane": "647" },
      { "name": "REUNION", "dane": "660" },
      { "name": "ZIMBABWE", "dane": "665" },
      { "name": "RUMANIA", "dane": "670" },
      { "name": "RUANDA", "dane": "675" },
      { "name": "RUSIA", "dane": "676" },
      { "name": "SALOMON, ISLAS", "dane": "677" },
      { "name": "SAHARA OCCIDENTAL", "dane": "685" },
      { "name": "SAMOA", "dane": "687" },
      { "name": "SAMOA NORTEAMERICANA", "dane": "690" },
      { "name": "SAN CRISTOBAL Y NIEVES", "dane": "695" },
      { "name": "SAN MARINO", "dane": "697" },
      { "name": "SAN PEDRO Y MIQUELON", "dane": "700" },
      { "name": "SAN VICENTE Y LAS GRANADINAS", "dane": "705" },
      { "name": "SANTA ELENA", "dane": "710" },
      { "name": "SANTA LUCIA", "dane": "715" },
      { "name": "SAN TOTOME Y PRINCIPE", "dane": "720" },
      { "name": "SENEGAL", "dane": "728" },
      { "name": "SEYCHELLES", "dane": "731" },
      { "name": "SIERRA LEONA", "dane": "735" },
      { "name": "SINGAPUR", "dane": "741" },
      { "name": "SIRIA, REP ARABE DE", "dane": "744" },
      { "name": "SOMALIA", "dane": "748" },
      { "name": "SRILANKA", "dane": "750" },
      { "name": "SUDAFRICA, REPUBLICA DE", "dane": "756" },
      { "name": "SUDAN", "dane": "759" },
      { "name": "SUECIA", "dane": "764" },
      { "name": "SUIZA", "dane": "767" },
      { "name": "SURINAM", "dane": "770" },
      { "name": "SWASILANDIA", "dane": "773" },
      { "name": "TADJIKISTAN", "dane": "774" },
      { "name": "TAILANDIA", "dane": "776" },
      { "name": "TANZANIA, REP UNIDA DE", "dane": "780" },
      { "name": "DJIBOUTI", "dane": "783" },
      { "name": "TERRITORIO ANTARTICO BRIT", "dane": "786" },
      { "name": "T BRIT OCEANO INDICO", "dane": "787" },
      { "name": "TIMOR DEL ESTE", "dane": "788" },
      { "name": "TOGO", "dane": "800" },
      { "name": "TOKELAU", "dane": "805" },
      { "name": "TONGA", "dane": "810" },
      { "name": "TRINIDAD Y TOBAGO", "dane": "815" },
      { "name": "TUNICIA", "dane": "820" },
      { "name": "TURCAS Y CAICOS, ISLAS", "dane": "823" },
      { "name": "TURKMENISTAN", "dane": "825" },
      { "name": "TURQUIA", "dane": "827" },
      { "name": "TUVALU", "dane": "828" },
      { "name": "UCRANIA", "dane": "830" },
      { "name": "UGANDA", "dane": "833" },
      { "name": "URUGUAY", "dane": "845" },
      { "name": "UZBEKISTAN", "dane": "847" },
      { "name": "VENEZUELA", "dane": "850" },
      { "name": "VIETNAM", "dane": "855" },
      { "name": "VIRGENES, ISLAS (BRITANICAS)", "dane": "863" },
      { "name": "VIRGENES, ISLAS (NORTEAMER)", "dane": "866" },
      { "name": "FIDJI", "dane": "870" },
      { "name": "WAKE, ISLA", "dane": "873" },
      { "name": "WALLIS Y FUTUNA, ISLAS", "dane": "875" },
      { "name": "YEMEN", "dane": "880" },
      { "name": "YUGOSLAVIA", "dane": "885" },
      { "name": "ZAIRE", "dane": "888" },
      { "name": "ZAMBIA", "dane": "890" },
      { "name": "NO DECLARADOS", "dane": "999" }
    ]
  }
]
