[{
	"imagen": "./assets/cam/img/layout/credito_movil.png",
	"descripcion": "Crédito de consumo con aprobación en línea",
	"idProducto": "CRECAM",
	"titulo": "Crédito Móvil"
}, {
	"idProducto": "CTACAM",
	"titulo": "Cuenta Móvil",
	"imagen": "./assets/cam/img/layout/cuenta_movil.png",
	"descripcion": "Ábrala desde su celular sin costo y comience a usarla de inmediato"
}, {
	"titulo": "Tarjeta Móvil",
	"imagen": "./assets/cam/img/layout/tarjeta_movil.png",
	"descripcion": "Solicítela y recíbala en su domicilio",
	"idProducto": 2
}]