{
    "listanoteClasificacionTributaria": [
        { "value": "C", "label": "Soc. anónima tipo C" },
        { "value": "S", "label": "Soc. anónima tipo S" },
        { "value": "P", "label": "Soc. colectiva" }
      ]
}