[
  {
    "titulo": "Asignación de clave",
    "subtitulo":"Clave virtual",
    "descripcion": "Asigne su Clave Virtual para ingresar a nuestros Canales Virtuales y realizar sus consultas y transacciones."
  }
]
