[
  {
    "titulo": "Beneficio 1",
    "id": "",
    "descripcion": "Reciba el pago de su salario en su cuenta de nomina.",
    "icono": "image-cn-bnft1"
  },
  {
    "titulo": "Beneficio 2",
    "id": "",
    "descripcion": "Utilice la cuenta de forma inmediata a través de los canales virtuales.",
    "icono": "image-cn-bnft2"
  },
  {
    "id": "",
    "descripcion": "Podrá acceder a un Adelanto de Nómina y a la oferta de productos móviles que le ofrece Davivienda.",
    "icono": "image-cn-bnft3",
    "titulo": "Beneficio 3"
  }
]
