[
  {
    "msjTooltip": "Este seguro lo protege frente a la liquidación de una entidad financiera y garantiza la recuperación total o parcial de los ahorros hasta por 50 millones de pesos.",
    "piePagina": "Este producto cuenta con el seguro de depósitos ",
    "encabezado": "Abra su Cuenta Móvil Nómina y acceda a los siguientes beneficios:",
    "iconoTooltip": "icon-dv-infotooltip",
    "entidadTooltip": "FOGAFIN"
  }
]
