[{"titulo": "El Beneficio 1",
	"descripcion": "Atención médica de los afectados en un accidente de tránsito.",
	"icono": "image-soat-bnft1",
	"id": "12"
}, {
	"titulo": "El Beneficio 2",
	"descripcion": "Asesoría jurídica telefónica para atender sus inquietudes en el momento de un accidente  de tránsito.",
	"icono": "image-soat-bnft2",
	"id": "12"
}, {
	"titulo": "El Beneficio 3",
	"descripcion": "Coordinación del servicio de ambulancia al lugar del accidente de tránsito.",
	"icono": "image-soat-bnft3",
	"id": "12"
}]