{
    "openapi": "3.0.0",
    "info": {
        "title": "Code Challenge",
        "description": "O Objetivo dessa aplicação web é ajudar usuário a calcular a quantidade de tinta necessária para pintar uma sala. Essa aplicação deve considerar que a sala é composta de 4 paredes e deve permitir que o usuário escolha qual a medida de cada parede e quantas janelas e portas possuem cada parede. Com base na quantidade necessária o sistema deve apontar tamanhos de lata de tinta que o usuário deve comprar, sempre priorizando as latas maiores. Ex: se o usuário precisa de 19 litros, ele deve sugerir 1 lata de 18L + 2 latas de 0,5L.<br><br><strong>Regras de negócio</strong>\n * Nenhuma parede pode ter menos de 1 metro quadrado nem mais de 15 metros quadrados, mas podem possuir alturas e larguras diferentes\n * O total de área das portas e janelas deve ser no máximo 50% da área de parede\n * A altura de paredes com porta deve ser, no mínimo, 30 centímetros maior que a altura da porta\n * Cada janela possui as medidas: 2,00 x 1,20 mtos\n * Cada porta possui as medidas: 0,80 x 1,90\n * Cada litro de tinta é capaz de pintar 5 metros quadrados\n * Não considerar teto nem piso.<br> <br> As variações de tamanho das latas de tinta são: <br><br>0,5 L<br>2,5 L<br>3,6 L<br>18 L",
        "contact": {
            "email": "rafaellessacastro@hotmail.com"
        },
        "version": "1.0.0"
    },
    "paths": {
        "/api/pintar-sala": {
            "post": {
                "tags": [
                    "Pintar Sala"
                ],
                "summary": "Calcula a quantidade de ................",
                "operationId": "3f092d81b04ca1b2b2e57a236c30d767",
                "requestBody": {
                    "required": true,
                    "content": {
                        "application/json": {
                            "schema": {
                                "$ref": "#/components/schemas/SalaRequest"
                            }
                        }
                    }
                },
                "responses": {
                    "200": {
                        "description": "Successful operation",
                        "content": {
                            "application/json": {
                                "schema": {
                                    "$ref": "#/components/schemas/Sala200Response"
                                }
                            }
                        }
                    },
                    "400": {
                        "description": "Bad Request",
                        "content": {
                            "application/json": {
                                "schema": {
                                    "$ref": "#/components/schemas/Sala400Response"
                                }
                            }
                        }
                    },
                    "401": {
                        "description": "Unauthenticated"
                    },
                    "403": {
                        "description": "Forbidden"
                    }
                }
            }
        }
    },
    "components": {
        "schemas": {
            "ParedesRequest": {
                "properties": {
                    "nome": {
                        "type": "string"
                    },
                    "altura": {
                        "type": "number"
                    },
                    "largura": {
                        "type": "number"
                    },
                    "qtdPortas": {
                        "type": "number"
                    },
                    "qtdJanelas": {
                        "type": "number"
                    }
                },
                "type": "object"
            },
            "Sala200Response": {
                "properties": {
                    "message": {
                        "type": "string"
                    }
                },
                "type": "object"
            },
            "Sala400Response": {
                "properties": {
                    "parede": {
                        "type": "string"
                    },
                    "message": {
                        "type": "string"
                    }
                },
                "type": "object"
            },
            "SalaRequest": {
                "properties": {
                    "sala": {
                        "type": "array",
                        "items": {
                            "$ref": "#/components/schemas/ParedesRequest"
                        },
                        "example": [
                            {
                                "nome": "parede_1",
                                "altura": 2.3,
                                "largura": 4,
                                "qtdPortas": 1,
                                "qtdJanelas": 1
                            },
                            {
                                "nome": "parede_2",
                                "altura": 3,
                                "largura": 5,
                                "qtdPortas": 1,
                                "qtdJanelas": 2
                            },
                            {
                                "nome": "parede_3",
                                "altura": 2.5,
                                "largura": 2.8,
                                "qtdPortas": 1,
                                "qtdJanelas": 0
                            },
                            {
                                "nome": "parede_4",
                                "altura": 3,
                                "largura": 3,
                                "qtdPortas": 1,
                                "qtdJanelas": 1
                            }
                        ]
                    }
                },
                "type": "object"
            }
        }
    },
    "security": [
        []
    ]
}