{
    "Categorias": [
        {
            "id": "1",
            "categoria" :"manga"
        },
        {
            "id": "2",
            "categoria" :"hq"
        },
        {
            "id": "3",
            "categoria" :"livro"
        }        
    ]
}