{
    "Laboratorios": [
        {
            "id": "1",
            "valor" :"geral",
            "rotulo": "Laboratório Didático de Química Geral",
            "abrev": "LDQG"
        },
        {
            "id": "2",
            "valor" :"org",
            "rotulo": "Laboratório Didático de Química Orgânica",
            "abrev": "LDQO"
        },
        {
            "id": "3",
            "valor" :"inorg",
            "rotulo": "Laboratório Didático de Química Inorgânica",
            "abrev": "LDQI"
        },
        {
            "id": "4",
            "valor" :"quali",
            "rotulo": "Laboratório Didático de Química Analítica Qualitativa",
            "abrev": "LDQAI"
        },
        {
            "id": "5",
            "valor" :"quanti",
            "rotulo": "Laboratório Didático de Química Analítica Quantitativa",
            "abrev": "LDQAII"
        },
        {
            "id": "6",
            "valor" :"analise",
            "rotulo": "Laboratório Didático de Análise Instrumental",
            "abrev": "LDAI"
        }
    ]
}