{
    "Alerta": [
        {
            "id":"1",
            "value": "on",
            "rotulo":"Ligado"
        },
        {
            "id":"2",
            "value": "off",
            "rotulo":"Desligado"
        }
    ]
}