{
  "users": [
    {
      "email": "misterm@mail.com",
      "password": "$2a$10$4xxfQnli0Gtx1f7ev4NP2eFSDN/UOGRtpP0DI8YbeEWpvkcw/jvOa",
      "name": "Mister M",
      "isAdm": true,
      "id": 3
    },
    {
      "email": "kenzie@mail.com",
      "password": "$2a$10$VA92IpIIYUU/tF2Hx6kvTecPQtr1xW1z/DjOH4cqNjQ/PHPDtLwwa",
      "name": "KenzieDuck",
      "isAdm": false,
      "id": 4
    },
    {
      "email": "maykelADM@mail.com",
      "password": "$2a$10$L9xLv8rcKaXDo7uAcuTJqe35uUwkNqoICCa067H3ZcTOM0HVwDsUq",
      "name": "maykel ADM",
      "isAdm": true,
      "id": 5
    },
    {
      "email": "maykelColab@mail.com",
      "password": "$2a$10$gaBJDScGAyiirBa2nybfqONtC5wG6g15WfKiLoMtt9A06OyYIJdSC",
      "name": "maykelColab",
      "isAdm": false,
      "idAdm": 5,
      "id": 6
    },
    {
      "email": "vini@email.com",
      "password": "$2a$10$dw/3zdDAuiSDpxFvDR1.6eLkvJbSOgPd3t.JuVlNArzGcnbaAsL0e",
      "name": "Vini",
      "isAdm": true,
      "id": 7
    },
    {
      "email": "kenzieMaster@mail.com",
      "password": "$2a$10$zK9SdHhDAZSFG2fWDYU5XOsGincAur6Mvsrj/O4fDAUFcHpKfG98W",
      "name": "kenzieMaster",
      "isAdm": true,
      "id": 8
    },
    {
      "email": "iago@mail.com",
      "password": "$2a$10$G1p1wpIFVWbPxJj7VaEog.ULOZj1OFUm0YVI/BZBkMgQ5w3wukCay",
      "name": "kenzieMaster",
      "isAdm": true,
      "id": 9
    },
    {
      "email": "maykel@mail.com",
      "password": "$2a$10$hoTFSV4beFQHRoxFRTRB4O4Eld/V.t1KHFz7XTmIpJnG5AeYdzLyq",
      "name": "maykel",
      "isAdm": true,
      "id": 10
    },
    {
      "email": "maykel2@mail.com",
      "password": "$2a$10$UxPc3hTLryeaHQXB5Qv.ieR6HgRXkJO2y0VpE7sgKr212iDuA7aN2",
      "name": "maykel2",
      "isAdm": false,
      "id": 11
    },
    {
      "email": "kenzao@mail.com",
      "password": "$2a$10$JkNKHRCZEzDXQjpEvVLj5OSBp3oUyfd04tEFyYzrYqzRrPMiPyXgS",
      "name": "kenzieMaster",
      "confirmpassword": "123456",
      "isAdm": true,
      "id": 12
    },
    {
      "email": "rafael@gmail.com",
      "password": "$2a$10$TVKOzT9GNJmxyAmgs45iWeGanwzZM3HedWVcJt/B2F7oZGWPodZRu",
      "name": "Rafael",
      "confirmpassword": "123456",
      "isAdm": true,
      "id": 13
    }
  ],
  "habUnits": [
    {
      "id": 1,
      "type": "simpleRoom",
      "title": "120",
      "price": 150,
      "description": "Suíte completa",
      "idAdm": 1,
      "products": [
        {
          "id": 1,
          "title": "Coca gelada",
          "price": 5,
          "quantity": 1
        }
      ],
      "services": [
        {
          "id": 1,
          "title": "Lavanderia",
          "price": 5,
          "quantity": 2
        }
      ],
      "reserves": [],
      "guests": [],
      "state": "occupied",
      "dailyCharges": []
    },
    {
      "type": "simpleRoom",
      "title": "112",
      "price": 150,
      "state": "occupied",
      "idAdm": 7,
      "products": [
        {
          "id": 2,
          "title": "coca",
          "price": 23,
          "quantity": 2
        }
      ],
      "services": [],
      "reserves": [],
      "id": 6,
      "description": "eaaaeeeee",
      "dailyCharges": [],
      "guests": []
    },
    {
      "type": "suite",
      "title": "teste",
      "price": 1512,
      "description": "A expressão Lorem ipsum em design gráfico e editoração é um texto padrão em latim utilizado na produção gráfica para preencher os espaços de texto em publicações para testar e ajustar aspectos visuais antes de utilizar conteúdo real.",
      "idAdm": 10,
      "products": [],
      "services": [],
      "reserves": [],
      "state": "available",
      "id": 7
    },
    {
      "type": "suite Presidencial",
      "title": "teste",
      "price": 1512,
      "description": "A expressão Lorem ipsum em design gráfico e editoração é um texto padrão em latim utilizado na produção gráfica para preencher os espaços de texto em publicações para testar e ajustar aspectos visuais antes de utilizar conteúdo real.",
      "idAdm": 10,
      "products": [],
      "services": [],
      "reserves": [],
      "state": "maintenance",
      "id": 10
    },
    {
      "type": "Suíte com banheira",
      "title": "teste",
      "price": 1512,
      "description": "A expressão Lorem ipsum em design gráfico e editoração é um texto padrão em latim utilizado na produção gráfica para preencher os espaços de texto em publicações para testar e ajustar aspectos visuais antes de utilizar conteúdo real.",
      "idAdm": 10,
      "products": [],
      "services": [],
      "reserves": [],
      "state": "reserved",
      "id": 11
    }
  ],
  "products": [
    {
      "id": 1,
      "title": "Água sem gás",
      "price": 3.5
    },
    {
      "id": 1,
      "title": "Água com gás",
      "price": 3.5
    },
    {
      "title": "Café",
      "price": 3.5,
      "idAdm": 7,
      "id": 2
    },
    {
      "title": "Ovo fritinho",
      "price": 10,
      "idAdm": 7,
      "id": 3
    }
  ],
  "services": [
    {
      "id": 1,
      "title": "Lavanderia",
      "price": 2.5
    },
    {
      "title": "Limpeza",
      "price": 300,
      "idAdm": 7,
      "id": 2
    },
    {
      "title": "Chofer",
      "price": 200,
      "id": 3
    }
  ],
  "guests": [
    {
      "name": "Paulo Marinho de Oliveira",
      "email": "paulomarinhomascotti@gmail.com",
      "cpf": "106.676.806-40",
      "birthDate": "1212199455555",
      "phone1": "(38) 99819-5227",
      "phone2": "(38) 99819-5227",
      "phone": ["(38) 99819-5227", "(38) 99819-5227"],
      "id": 3
    },
    {
      "name": "Filipe Gutierre",
      "email": "filipe@mail.com",
      "cpf": "134.163.923-60",
      "birthDate": "15/05/1990",
      "phone": ["(41) 99854-6548"],
      "id": 4,
      "phone1": "(41) 99854-6548"
    }
  ],
  "insomnia.json": {
    "_type": "export",
    "__export_format": 4,
    "__export_date": "2021-09-08T14:43:46.656Z",
    "__export_source": "insomnia.desktop.app:v2021.4.0",
    "resources": [
      {
        "_id": "req_5600f956a17a46fc8dfdf1abae201f32",
        "parentId": "fld_d40114d761584421b73963ad9fb5e9c8",
        "modified": 1631111971293,
        "created": 1630962808302,
        "url": "https://hcloud-api.herokuapp.com/login",
        "name": "User Login",
        "description": "",
        "method": "POST",
        "body": {
          "mimeType": "application/json",
          "text": "{\n\t\"email\": \"kenzieMaster@mail.com\",\n\t\"password\": \"123456\"\n}"
        },
        "parameters": [],
        "headers": [{ "name": "Content-Type", "value": "application/json" }],
        "authentication": {
          "type": "bearer",
          "token": "eyJhbGciOiJIUzI1NiIsInR5cCI6IkpXVCJ9.eyJlbWFpbCI6ImtlbnppZU1hc3RlckBtYWlsLmNvbSIsImlhdCI6MTYzMDk2NTQ4OCwiZXhwIjoxNjMwOTY5MDg4LCJzdWIiOiI3In0.4naXa7lwr18FKqKvBQkMmw2qCkxNrdSFQa8zlPH2pWs"
        },
        "metaSortKey": -1630963629009,
        "isPrivate": false,
        "settingStoreCookies": true,
        "settingSendCookies": true,
        "settingDisableRenderRequestBody": false,
        "settingEncodeUrl": true,
        "settingRebuildPath": true,
        "settingFollowRedirects": "global",
        "_type": "request"
      },
      {
        "_id": "fld_d40114d761584421b73963ad9fb5e9c8",
        "parentId": "wrk_007dd169517946be8e56da0d0701bb72",
        "modified": 1631111985105,
        "created": 1630963155544,
        "name": "Users",
        "description": "",
        "environment": {},
        "environmentPropertyOrder": null,
        "metaSortKey": -1630964913006,
        "_type": "request_group"
      },
      {
        "_id": "wrk_007dd169517946be8e56da0d0701bb72",
        "parentId": null,
        "modified": 1630958241300,
        "created": 1630958241300,
        "name": "HCloud",
        "description": "",
        "scope": "collection",
        "_type": "workspace"
      },
      {
        "_id": "req_6ba6be7e854f4af4b9fc436122662b23",
        "parentId": "fld_d40114d761584421b73963ad9fb5e9c8",
        "modified": 1631111978241,
        "created": 1630962970806,
        "url": "https://hcloud-api.herokuapp.com/register",
        "name": "User Register",
        "description": "",
        "method": "POST",
        "body": {
          "mimeType": "application/json",
          "text": "{\n      \"name\": \"kenzieMaster\",\n      \"email\": \"kenzieMaster@mail.com\",\n      \"password\": \"123456\",\n      \"isAdm\": true\n}\n    "
        },
        "parameters": [],
        "headers": [{ "name": "Content-Type", "value": "application/json" }],
        "authentication": {},
        "metaSortKey": -1630963628959,
        "isPrivate": false,
        "settingStoreCookies": true,
        "settingSendCookies": true,
        "settingDisableRenderRequestBody": false,
        "settingEncodeUrl": true,
        "settingRebuildPath": true,
        "settingFollowRedirects": "global",
        "_type": "request"
      },
      {
        "_id": "req_10e35608323a40f4875c2b2c21d71d4f",
        "parentId": "fld_d40114d761584421b73963ad9fb5e9c8",
        "modified": 1631112129671,
        "created": 1630963173625,
        "url": "https://hcloud-api.herokuapp.com/users",
        "name": "userList",
        "description": "",
        "method": "GET",
        "body": {},
        "parameters": [],
        "headers": [],
        "authentication": {
          "type": "bearer",
          "token": "eyJhbGciOiJIUzI1NiIsInR5cCI6IkpXVCJ9.eyJlbWFpbCI6ImtlbnppZU1hc3RlckBtYWlsLmNvbSIsImlhdCI6MTYzMTExMTgwOSwiZXhwIjoxNjMxMTE1NDA5LCJzdWIiOiI1In0.ErCtzkIKe8vg8hf9uZnVLzaMXHih7V-8FrBp3_isuME"
        },
        "metaSortKey": -1630963628909,
        "isPrivate": false,
        "settingStoreCookies": true,
        "settingSendCookies": true,
        "settingDisableRenderRequestBody": false,
        "settingEncodeUrl": true,
        "settingRebuildPath": true,
        "settingFollowRedirects": "global",
        "_type": "request"
      },
      {
        "_id": "req_f957a080955746ac9d5ab313a01a2f26",
        "parentId": "fld_d40114d761584421b73963ad9fb5e9c8",
        "modified": 1631112137878,
        "created": 1630963628859,
        "url": "https://hcloud-api.herokuapp.com/users/5",
        "name": "Edit user",
        "description": "",
        "method": "PATCH",
        "body": {
          "mimeType": "application/json",
          "text": "{\n\t\"name\": \"maykel ADM\",\n\t\"email\": \"maykelADM@mail.com\"\n}"
        },
        "parameters": [],
        "headers": [{ "name": "Content-Type", "value": "application/json" }],
        "authentication": {
          "type": "bearer",
          "token": "eyJhbGciOiJIUzI1NiIsInR5cCI6IkpXVCJ9.eyJlbWFpbCI6ImtlbnppZU1hc3RlckBtYWlsLmNvbSIsImlhdCI6MTYzMTExMTgwOSwiZXhwIjoxNjMxMTE1NDA5LCJzdWIiOiI1In0.ErCtzkIKe8vg8hf9uZnVLzaMXHih7V-8FrBp3_isuME"
        },
        "metaSortKey": -1630963628859,
        "isPrivate": false,
        "settingStoreCookies": true,
        "settingSendCookies": true,
        "settingDisableRenderRequestBody": false,
        "settingEncodeUrl": true,
        "settingRebuildPath": true,
        "settingFollowRedirects": "global",
        "_type": "request"
      },
      {
        "_id": "req_4b4ce856629745a6a63a42ccb44245d6",
        "parentId": "fld_d40114d761584421b73963ad9fb5e9c8",
        "modified": 1631112144493,
        "created": 1631111947738,
        "url": "https://hcloud-api.herokuapp.com/users/5",
        "name": "Delete User",
        "description": "",
        "method": "DELETE",
        "body": {},
        "parameters": [],
        "headers": [],
        "authentication": {
          "type": "bearer",
          "token": "eyJhbGciOiJIUzI1NiIsInR5cCI6IkpXVCJ9.eyJlbWFpbCI6ImtlbnppZU1hc3RlckBtYWlsLmNvbSIsImlhdCI6MTYzMTExMTgwOSwiZXhwIjoxNjMxMTE1NDA5LCJzdWIiOiI1In0.ErCtzkIKe8vg8hf9uZnVLzaMXHih7V-8FrBp3_isuME"
        },
        "metaSortKey": -1630963628809,
        "isPrivate": false,
        "settingStoreCookies": true,
        "settingSendCookies": true,
        "settingDisableRenderRequestBody": false,
        "settingEncodeUrl": true,
        "settingRebuildPath": true,
        "settingFollowRedirects": "global",
        "_type": "request"
      },
      {
        "_id": "req_86cdfda64ae24875b05a39514c11abf4",
        "parentId": "fld_b2efa9d9623a423496d2cac23da21f45",
        "modified": 1630967872682,
        "created": 1630967834875,
        "url": "https://hcloud-api.herokuapp.com/guests",
        "name": "Guests",
        "description": "",
        "method": "GET",
        "body": {},
        "parameters": [],
        "headers": [],
        "authentication": {
          "type": "bearer",
          "token": "eyJhbGciOiJIUzI1NiIsInR5cCI6IkpXVCJ9.eyJlbWFpbCI6ImtlbnppZU1hc3RlckBtYWlsLmNvbSIsImlhdCI6MTYzMDk2NzYzNywiZXhwIjoxNjMwOTcxMjM3LCJzdWIiOiI1In0.oCJ5mLfB3p91iziJUm4artQ-REdI_mBGFQx5eo7luM0"
        },
        "metaSortKey": -1630967834938,
        "isPrivate": false,
        "settingStoreCookies": true,
        "settingSendCookies": true,
        "settingDisableRenderRequestBody": false,
        "settingEncodeUrl": true,
        "settingRebuildPath": true,
        "settingFollowRedirects": "global",
        "_type": "request"
      },
      {
        "_id": "fld_b2efa9d9623a423496d2cac23da21f45",
        "parentId": "wrk_007dd169517946be8e56da0d0701bb72",
        "modified": 1630964912956,
        "created": 1630964912956,
        "name": "Guests",
        "description": "",
        "environment": {},
        "environmentPropertyOrder": null,
        "metaSortKey": -1630964912956,
        "_type": "request_group"
      },
      {
        "_id": "req_921a40ba7ae44799a21724d53fad0d49",
        "parentId": "fld_b2efa9d9623a423496d2cac23da21f45",
        "modified": 1630967913457,
        "created": 1630967879121,
        "url": "https://hcloud-api.herokuapp.com/guests",
        "name": "Guests",
        "description": "",
        "method": "POST",
        "body": {
          "mimeType": "application/json",
          "text": "{\n      \"name\": \"Kenzinho02\",\n      \"email\": \"mail@mail.com\",\n      \"cpf\": \"123.123.123-60\",\n      \"birthDate\": \"15/05/1995\",\n      \"phone\": [\"string\", \"string\"]\n }"
        },
        "parameters": [],
        "headers": [{ "name": "Content-Type", "value": "application/json" }],
        "authentication": {
          "type": "bearer",
          "token": "eyJhbGciOiJIUzI1NiIsInR5cCI6IkpXVCJ9.eyJlbWFpbCI6ImtlbnppZU1hc3RlckBtYWlsLmNvbSIsImlhdCI6MTYzMDk2NzYzNywiZXhwIjoxNjMwOTcxMjM3LCJzdWIiOiI1In0.oCJ5mLfB3p91iziJUm4artQ-REdI_mBGFQx5eo7luM0"
        },
        "metaSortKey": -1630965731973.5,
        "isPrivate": false,
        "settingStoreCookies": true,
        "settingSendCookies": true,
        "settingDisableRenderRequestBody": false,
        "settingEncodeUrl": true,
        "settingRebuildPath": true,
        "settingFollowRedirects": "global",
        "_type": "request"
      },
      {
        "_id": "req_5f08105994f14b1d911381d80b462a3f",
        "parentId": "fld_b2efa9d9623a423496d2cac23da21f45",
        "modified": 1630967962440,
        "created": 1630967882208,
        "url": "https://hcloud-api.herokuapp.com/guests/2",
        "name": "Guests",
        "description": "",
        "method": "PATCH",
        "body": {
          "mimeType": "application/json",
          "text": "{\n      \"name\": \"Kenzinho02New\",\n      \"email\": \"mail@mail.com\",\n      \"cpf\": \"123.123.123-60\",\n      \"birthDate\": \"15/05/1995\",\n      \"phone\": [\"string\", \"string\"]\n }"
        },
        "parameters": [],
        "headers": [{ "name": "Content-Type", "value": "application/json" }],
        "authentication": {
          "type": "bearer",
          "token": "eyJhbGciOiJIUzI1NiIsInR5cCI6IkpXVCJ9.eyJlbWFpbCI6ImtlbnppZU1hc3RlckBtYWlsLmNvbSIsImlhdCI6MTYzMDk2NzYzNywiZXhwIjoxNjMwOTcxMjM3LCJzdWIiOiI1In0.oCJ5mLfB3p91iziJUm4artQ-REdI_mBGFQx5eo7luM0"
        },
        "metaSortKey": -1630964680491.25,
        "isPrivate": false,
        "settingStoreCookies": true,
        "settingSendCookies": true,
        "settingDisableRenderRequestBody": false,
        "settingEncodeUrl": true,
        "settingRebuildPath": true,
        "settingFollowRedirects": "global",
        "_type": "request"
      },
      {
        "_id": "req_3d58b4630ba648ed9a32d5c9431fe0eb",
        "parentId": "fld_b2efa9d9623a423496d2cac23da21f45",
        "modified": 1631112022961,
        "created": 1631111857662,
        "url": "https://hcloud-api.herokuapp.com/guests/6",
        "name": "Guests",
        "description": "",
        "method": "DELETE",
        "body": {},
        "parameters": [],
        "headers": [],
        "authentication": { "type": "bearer", "token": "" },
        "metaSortKey": -1630964680441.25,
        "isPrivate": false,
        "settingStoreCookies": true,
        "settingSendCookies": true,
        "settingDisableRenderRequestBody": false,
        "settingEncodeUrl": true,
        "settingRebuildPath": true,
        "settingFollowRedirects": "global",
        "_type": "request"
      },
      {
        "_id": "req_05cf5dfc05454ad6af58c7022f620749",
        "parentId": "fld_562496fe323a4a959d2724b55a8890bf",
        "modified": 1630968022115,
        "created": 1630967988713,
        "url": "https://hcloud-api.herokuapp.com/products",
        "name": "Products",
        "description": "",
        "method": "GET",
        "body": {},
        "parameters": [],
        "headers": [],
        "authentication": {
          "type": "bearer",
          "token": "eyJhbGciOiJIUzI1NiIsInR5cCI6IkpXVCJ9.eyJlbWFpbCI6ImtlbnppZU1hc3RlckBtYWlsLmNvbSIsImlhdCI6MTYzMDk2NzYzNywiZXhwIjoxNjMwOTcxMjM3LCJzdWIiOiI1In0.oCJ5mLfB3p91iziJUm4artQ-REdI_mBGFQx5eo7luM0"
        },
        "metaSortKey": -1630967985234,
        "isPrivate": false,
        "settingStoreCookies": true,
        "settingSendCookies": true,
        "settingDisableRenderRequestBody": false,
        "settingEncodeUrl": true,
        "settingRebuildPath": true,
        "settingFollowRedirects": "global",
        "_type": "request"
      },
      {
        "_id": "fld_562496fe323a4a959d2724b55a8890bf",
        "parentId": "wrk_007dd169517946be8e56da0d0701bb72",
        "modified": 1630964908117,
        "created": 1630964908117,
        "name": "Products",
        "description": "",
        "environment": {},
        "environmentPropertyOrder": null,
        "metaSortKey": -1630964908117,
        "_type": "request_group"
      },
      {
        "_id": "req_b3850a63e32d48dda8631528d61042f8",
        "parentId": "fld_562496fe323a4a959d2724b55a8890bf",
        "modified": 1630968061327,
        "created": 1630968029629,
        "url": "https://hcloud-api.herokuapp.com/products",
        "name": "Products",
        "description": "",
        "method": "POST",
        "body": {
          "mimeType": "application/json",
          "text": " {\n      \"title\": \"Água com gás\",\n      \"price\": 3.5\n }"
        },
        "parameters": [],
        "headers": [{ "name": "Content-Type", "value": "application/json" }],
        "authentication": {
          "type": "bearer",
          "token": "eyJhbGciOiJIUzI1NiIsInR5cCI6IkpXVCJ9.eyJlbWFpbCI6ImtlbnppZU1hc3RlckBtYWlsLmNvbSIsImlhdCI6MTYzMDk2NzYzNywiZXhwIjoxNjMwOTcxMjM3LCJzdWIiOiI1In0.oCJ5mLfB3p91iziJUm4artQ-REdI_mBGFQx5eo7luM0"
        },
        "metaSortKey": -1630967910086,
        "isPrivate": false,
        "settingStoreCookies": true,
        "settingSendCookies": true,
        "settingDisableRenderRequestBody": false,
        "settingEncodeUrl": true,
        "settingRebuildPath": true,
        "settingFollowRedirects": "global",
        "_type": "request"
      },
      {
        "_id": "req_b19b7224d376444885aa5e3ff32f3276",
        "parentId": "fld_562496fe323a4a959d2724b55a8890bf",
        "modified": 1630968086338,
        "created": 1630968030678,
        "url": "https://hcloud-api.herokuapp.com/products/1",
        "name": "Products",
        "description": "",
        "method": "PATCH",
        "body": {
          "mimeType": "application/json",
          "text": " {\n      \"title\": \"Água sem gás new\",\n      \"price\": 3.5\n    }"
        },
        "parameters": [],
        "headers": [{ "name": "Content-Type", "value": "application/json" }],
        "authentication": {
          "type": "bearer",
          "token": "eyJhbGciOiJIUzI1NiIsInR5cCI6IkpXVCJ9.eyJlbWFpbCI6ImtlbnppZU1hc3RlckBtYWlsLmNvbSIsImlhdCI6MTYzMDk2NzYzNywiZXhwIjoxNjMwOTcxMjM3LCJzdWIiOiI1In0.oCJ5mLfB3p91iziJUm4artQ-REdI_mBGFQx5eo7luM0"
        },
        "metaSortKey": -1630967872512,
        "isPrivate": false,
        "settingStoreCookies": true,
        "settingSendCookies": true,
        "settingDisableRenderRequestBody": false,
        "settingEncodeUrl": true,
        "settingRebuildPath": true,
        "settingFollowRedirects": "global",
        "_type": "request"
      },
      {
        "_id": "req_8d2e5ba1befd40e5927f9de61ac9f73f",
        "parentId": "fld_562496fe323a4a959d2724b55a8890bf",
        "modified": 1631112031999,
        "created": 1631111900116,
        "url": "https://hcloud-api.herokuapp.com/products/2",
        "name": "Products",
        "description": "",
        "method": "DELETE",
        "body": {},
        "parameters": [],
        "headers": [],
        "authentication": { "type": "bearer", "token": "" },
        "metaSortKey": -1630967872462,
        "isPrivate": false,
        "settingStoreCookies": true,
        "settingSendCookies": true,
        "settingDisableRenderRequestBody": false,
        "settingEncodeUrl": true,
        "settingRebuildPath": true,
        "settingFollowRedirects": "global",
        "_type": "request"
      },
      {
        "_id": "req_b8f6d2d27f5c42828532b53432d62e25",
        "parentId": "fld_86874587269f47ce91c96e6ece538d33",
        "modified": 1630968203210,
        "created": 1630968107870,
        "url": "https://hcloud-api.herokuapp.com/services",
        "name": "Services",
        "description": "",
        "method": "GET",
        "body": {},
        "parameters": [],
        "headers": [],
        "authentication": {
          "type": "bearer",
          "token": "eyJhbGciOiJIUzI1NiIsInR5cCI6IkpXVCJ9.eyJlbWFpbCI6ImtlbnppZU1hc3RlckBtYWlsLmNvbSIsImlhdCI6MTYzMDk2NzYzNywiZXhwIjoxNjMwOTcxMjM3LCJzdWIiOiI1In0.oCJ5mLfB3p91iziJUm4artQ-REdI_mBGFQx5eo7luM0"
        },
        "metaSortKey": -1630968118548,
        "isPrivate": false,
        "settingStoreCookies": true,
        "settingSendCookies": true,
        "settingDisableRenderRequestBody": false,
        "settingEncodeUrl": true,
        "settingRebuildPath": true,
        "settingFollowRedirects": "global",
        "_type": "request"
      },
      {
        "_id": "fld_86874587269f47ce91c96e6ece538d33",
        "parentId": "wrk_007dd169517946be8e56da0d0701bb72",
        "modified": 1630964898186,
        "created": 1630964898186,
        "name": "Services",
        "description": "",
        "environment": {},
        "environmentPropertyOrder": null,
        "metaSortKey": -1630964898186,
        "_type": "request_group"
      },
      {
        "_id": "req_4decbca5c9f147b2b79d7c615d64fc3e",
        "parentId": "fld_86874587269f47ce91c96e6ece538d33",
        "modified": 1630968393388,
        "created": 1630968127644,
        "url": "https://hcloud-api.herokuapp.com/services",
        "name": "Services",
        "description": "",
        "method": "POST",
        "body": {
          "mimeType": "application/json",
          "text": " {\n      \"title\": \"testinho\",\n      \"price\": 555\n    }"
        },
        "parameters": [],
        "headers": [{ "name": "Content-Type", "value": "application/json" }],
        "authentication": {
          "type": "bearer",
          "token": "eyJhbGciOiJIUzI1NiIsInR5cCI6IkpXVCJ9.eyJlbWFpbCI6ImtlbnppZU1hc3RlckBtYWlsLmNvbSIsImlhdCI6MTYzMDk2NzYzNywiZXhwIjoxNjMwOTcxMjM3LCJzdWIiOiI1In0.oCJ5mLfB3p91iziJUm4artQ-REdI_mBGFQx5eo7luM0"
        },
        "metaSortKey": -1630968051891,
        "isPrivate": false,
        "settingStoreCookies": true,
        "settingSendCookies": true,
        "settingDisableRenderRequestBody": false,
        "settingEncodeUrl": true,
        "settingRebuildPath": true,
        "settingFollowRedirects": "global",
        "_type": "request"
      },
      {
        "_id": "req_69b8b58ae6374b13b993e003f5c42c53",
        "parentId": "fld_86874587269f47ce91c96e6ece538d33",
        "modified": 1630968186520,
        "created": 1630968172336,
        "url": "https://hcloud-api.herokuapp.com/services/1",
        "name": "Services",
        "description": "",
        "method": "PATCH",
        "body": {
          "mimeType": "application/json",
          "text": " {\n      \"title\": \"Lavanderia\",\n      \"price\": 2.5\n    }"
        },
        "parameters": [],
        "headers": [{ "name": "Content-Type", "value": "application/json" }],
        "authentication": {
          "type": "bearer",
          "token": "eyJhbGciOiJIUzI1NiIsInR5cCI6IkpXVCJ9.eyJlbWFpbCI6ImtlbnppZU1hc3RlckBtYWlsLmNvbSIsImlhdCI6MTYzMDk2NzYzNywiZXhwIjoxNjMwOTcxMjM3LCJzdWIiOiI1In0.oCJ5mLfB3p91iziJUm4artQ-REdI_mBGFQx5eo7luM0"
        },
        "metaSortKey": -1630968018562.5,
        "isPrivate": false,
        "settingStoreCookies": true,
        "settingSendCookies": true,
        "settingDisableRenderRequestBody": false,
        "settingEncodeUrl": true,
        "settingRebuildPath": true,
        "settingFollowRedirects": "global",
        "_type": "request"
      },
      {
        "_id": "req_0490f0202bac40c98c84467766406786",
        "parentId": "fld_86874587269f47ce91c96e6ece538d33",
        "modified": 1631112041533,
        "created": 1631111907290,
        "url": "https://hcloud-api.herokuapp.com/services/2",
        "name": "Services",
        "description": "",
        "method": "DELETE",
        "body": {},
        "parameters": [],
        "headers": [],
        "authentication": { "type": "bearer", "token": "" },
        "metaSortKey": -1630968018512.5,
        "isPrivate": false,
        "settingStoreCookies": true,
        "settingSendCookies": true,
        "settingDisableRenderRequestBody": false,
        "settingEncodeUrl": true,
        "settingRebuildPath": true,
        "settingFollowRedirects": "global",
        "_type": "request"
      },
      {
        "_id": "req_d51842db008849a5a0bbe94704133c00",
        "parentId": "fld_03c83370b8bf47d5b47ac80494717a61",
        "modified": 1631112076900,
        "created": 1630968274741,
        "url": "https://hcloud-api.herokuapp.com/habUnits",
        "name": "habUnits",
        "description": "",
        "method": "GET",
        "body": {},
        "parameters": [],
        "headers": [],
        "authentication": {
          "type": "bearer",
          "token": "eyJhbGciOiJIUzI1NiIsInR5cCI6IkpXVCJ9.eyJlbWFpbCI6ImtlbnppZU1hc3RlckBtYWlsLmNvbSIsImlhdCI6MTYzMTExMTgwOSwiZXhwIjoxNjMxMTE1NDA5LCJzdWIiOiI1In0.ErCtzkIKe8vg8hf9uZnVLzaMXHih7V-8FrBp3_isuME"
        },
        "metaSortKey": -1630968085219.5,
        "isPrivate": false,
        "settingStoreCookies": true,
        "settingSendCookies": true,
        "settingDisableRenderRequestBody": false,
        "settingEncodeUrl": true,
        "settingRebuildPath": true,
        "settingFollowRedirects": "global",
        "_type": "request"
      },
      {
        "_id": "fld_03c83370b8bf47d5b47ac80494717a61",
        "parentId": "wrk_007dd169517946be8e56da0d0701bb72",
        "modified": 1630964885251,
        "created": 1630964885251,
        "name": "unitHabit",
        "description": "",
        "environment": {},
        "environmentPropertyOrder": null,
        "metaSortKey": -1630964885251,
        "_type": "request_group"
      },
      {
        "_id": "req_24d4df0a367c425c82d274cdcdb5c067",
        "parentId": "fld_03c83370b8bf47d5b47ac80494717a61",
        "modified": 1631112072192,
        "created": 1630968289969,
        "url": "https://hcloud-api.herokuapp.com/habUnits",
        "name": "habUnits",
        "description": "",
        "method": "POST",
        "body": {
          "mimeType": "application/json",
          "text": "{\n      \"type\": \"Suíte\",\n      \"title\": \"110\",\n      \"price\": 150,\n      \"description\": \"Suíte completa\",\n      \"idAdm\": 1,\n      \"products\": [],\n      \"services\": [],\n      \"reserves\": []\n    }"
        },
        "parameters": [],
        "headers": [{ "name": "Content-Type", "value": "application/json" }],
        "authentication": {
          "type": "bearer",
          "token": "eyJhbGciOiJIUzI1NiIsInR5cCI6IkpXVCJ9.eyJlbWFpbCI6ImtlbnppZU1hc3RlckBtYWlsLmNvbSIsImlhdCI6MTYzMDk2NzYzNywiZXhwIjoxNjMwOTcxMjM3LCJzdWIiOiI1In0.oCJ5mLfB3p91iziJUm4artQ-REdI_mBGFQx5eo7luM0"
        },
        "metaSortKey": -1630968068555.25,
        "isPrivate": false,
        "settingStoreCookies": true,
        "settingSendCookies": true,
        "settingDisableRenderRequestBody": false,
        "settingEncodeUrl": true,
        "settingRebuildPath": true,
        "settingFollowRedirects": "global",
        "_type": "request"
      },
      {
        "_id": "req_619a77dcf218441ba98d1e97bd7129a6",
        "parentId": "fld_03c83370b8bf47d5b47ac80494717a61",
        "modified": 1631112065356,
        "created": 1630968347948,
        "url": "https://hcloud-api.herokuapp.com/habUnits/1",
        "name": "habUnits",
        "description": "",
        "method": "PATCH",
        "body": {
          "mimeType": "application/json",
          "text": "{\n      \"type\": \"Suíte\",\n      \"title\": \"110\",\n      \"price\": 150,\n      \"description\": \"Suíte completa\",\n      \"idAdm\": 1,\n      \"products\": [],\n      \"services\": [],\n      \"reserves\": []\n    }"
        },
        "parameters": [],
        "headers": [{ "name": "Content-Type", "value": "application/json" }],
        "authentication": {
          "type": "bearer",
          "token": "eyJhbGciOiJIUzI1NiIsInR5cCI6IkpXVCJ9.eyJlbWFpbCI6ImtlbnppZU1hc3RlckBtYWlsLmNvbSIsImlhdCI6MTYzMDk2NzYzNywiZXhwIjoxNjMwOTcxMjM3LCJzdWIiOiI1In0.oCJ5mLfB3p91iziJUm4artQ-REdI_mBGFQx5eo7luM0"
        },
        "metaSortKey": -1630968060223.125,
        "isPrivate": false,
        "settingStoreCookies": true,
        "settingSendCookies": true,
        "settingDisableRenderRequestBody": false,
        "settingEncodeUrl": true,
        "settingRebuildPath": true,
        "settingFollowRedirects": "global",
        "_type": "request"
      },
      {
        "_id": "req_20191c1f248b427d97c758d1f3a0705b",
        "parentId": "fld_03c83370b8bf47d5b47ac80494717a61",
        "modified": 1631112053888,
        "created": 1631111919583,
        "url": "https://hcloud-api.herokuapp.com/habUnits/2",
        "name": "habUnits",
        "description": "",
        "method": "DELETE",
        "body": {},
        "parameters": [],
        "headers": [],
        "authentication": { "type": "bearer", "token": "" },
        "metaSortKey": -1630968060173.125,
        "isPrivate": false,
        "settingStoreCookies": true,
        "settingSendCookies": true,
        "settingDisableRenderRequestBody": false,
        "settingEncodeUrl": true,
        "settingRebuildPath": true,
        "settingFollowRedirects": "global",
        "_type": "request"
      },
      {
        "_id": "env_4b981a3f45cbdccb424b06516959d859eceec165",
        "parentId": "wrk_007dd169517946be8e56da0d0701bb72",
        "modified": 1630958241783,
        "created": 1630958241783,
        "name": "Base Environment",
        "data": {},
        "dataPropertyOrder": null,
        "color": null,
        "isPrivate": false,
        "metaSortKey": 1630958241783,
        "_type": "environment"
      },
      {
        "_id": "jar_4b981a3f45cbdccb424b06516959d859eceec165",
        "parentId": "wrk_007dd169517946be8e56da0d0701bb72",
        "modified": 1630958241884,
        "created": 1630958241884,
        "name": "Default Jar",
        "cookies": [],
        "_type": "cookie_jar"
      },
      {
        "_id": "spc_b0dc7340e05441fe878a68d6bc53fa8e",
        "parentId": "wrk_007dd169517946be8e56da0d0701bb72",
        "modified": 1630958241314,
        "created": 1630958241314,
        "fileName": "HCloud",
        "contents": "",
        "contentType": "yaml",
        "_type": "api_spec"
      }
    ]
  }
}
