{
  "org.apache.sling.commons.log.names": [
    "br.com.vilt.aem.htl"
  ],
  "org.apache.sling.commons.log.level": "INFO",
  "org.apache.sling.commons.log.file": "logs/error.log",
  "org.apache.sling.commons.log.additiv": "false"
}
