{
    "$schema": "http://json-schema.org/draft-04/schema#",
    "$ref": "#/definitions/ConfigurationFile",
    "definitions": {
        "ConfigurationFile": {
            "properties": {
                "gitops": {
                    "$ref": "#/definitions/gitlab.agent.agentcfg.GitopsCF",
                    "additionalProperties": false
                },
                "observability": {
                    "$ref": "#/definitions/gitlab.agent.agentcfg.ObservabilityCF",
                    "additionalProperties": false
                },
                "ci_access": {
                    "$ref": "#/definitions/gitlab.agent.agentcfg.CiAccessCF",
                    "additionalProperties": false
                },
                "container_scanning": {
                    "$ref": "#/definitions/gitlab.agent.agentcfg.ContainerScanningCF",
                    "additionalProperties": false
                },
                "user_access": {
                    "$ref": "#/definitions/gitlab.agent.agentcfg.UserAccessCF",
                    "additionalProperties": false
                },
                "remote_development": {
                    "$ref": "#/definitions/gitlab.agent.agentcfg.RemoteDevelopmentCF",
                    "additionalProperties": false
                },
                "flux": {
                    "$ref": "#/definitions/gitlab.agent.agentcfg.FluxCF",
                    "additionalProperties": false
                }
            },
            "additionalProperties": false,
            "type": "object"
        },
        "gitlab.agent.agentcfg.CiAccessAsAgentCF": {
            "additionalProperties": false,
            "type": "object"
        },
        "gitlab.agent.agentcfg.CiAccessAsCF": {
            "properties": {
                "agent": {
                    "$ref": "#/definitions/gitlab.agent.agentcfg.CiAccessAsAgentCF",
                    "additionalProperties": false
                },
                "impersonate": {
                    "$ref": "#/definitions/gitlab.agent.agentcfg.CiAccessAsImpersonateCF",
                    "additionalProperties": false
                },
                "ci_job": {
                    "$ref": "#/definitions/gitlab.agent.agentcfg.CiAccessAsCiJobCF",
                    "additionalProperties": false
                }
            },
            "additionalProperties": false,
            "type": "object",
            "oneOf": [
                {
                    "required": [
                        "agent"
                    ]
                },
                {
                    "required": [
                        "impersonate"
                    ]
                },
                {
                    "required": [
                        "ci_job"
                    ]
                }
            ]
        },
        "gitlab.agent.agentcfg.CiAccessAsCiJobCF": {
            "additionalProperties": false,
            "type": "object"
        },
        "gitlab.agent.agentcfg.CiAccessAsImpersonateCF": {
            "properties": {
                "username": {
                    "type": "string"
                },
                "groups": {
                    "items": {
                        "type": "string"
                    },
                    "type": "array"
                },
                "uid": {
                    "type": "string"
                },
                "extra": {
                    "items": {
                        "$ref": "#/definitions/gitlab.agent.agentcfg.ExtraKeyValCF"
                    },
                    "additionalProperties": false,
                    "type": "array"
                }
            },
            "additionalProperties": false,
            "type": "object"
        },
        "gitlab.agent.agentcfg.CiAccessCF": {
            "properties": {
                "projects": {
                    "items": {
                        "$ref": "#/definitions/gitlab.agent.agentcfg.CiAccessProjectCF"
                    },
                    "additionalProperties": false,
                    "type": "array"
                },
                "groups": {
                    "items": {
                        "$ref": "#/definitions/gitlab.agent.agentcfg.CiAccessGroupCF"
                    },
                    "additionalProperties": false,
                    "type": "array"
                }
            },
            "additionalProperties": false,
            "type": "object"
        },
        "gitlab.agent.agentcfg.CiAccessGroupCF": {
            "properties": {
                "id": {
                    "type": "string"
                },
                "default_namespace": {
                    "type": "string"
                },
                "access_as": {
                    "$ref": "#/definitions/gitlab.agent.agentcfg.CiAccessAsCF",
                    "additionalProperties": false
                },
                "environments": {
                    "items": {
                        "type": "string"
                    },
                    "type": "array"
                }
            },
            "additionalProperties": false,
            "type": "object"
        },
        "gitlab.agent.agentcfg.CiAccessProjectCF": {
            "properties": {
                "id": {
                    "type": "string"
                },
                "default_namespace": {
                    "type": "string"
                },
                "access_as": {
                    "$ref": "#/definitions/gitlab.agent.agentcfg.CiAccessAsCF",
                    "additionalProperties": false
                },
                "environments": {
                    "items": {
                        "type": "string"
                    },
                    "type": "array"
                }
            },
            "additionalProperties": false,
            "type": "object"
        },
        "gitlab.agent.agentcfg.ContainerScanningCF": {
            "properties": {
                "vulnerability_report": {
                    "$ref": "#/definitions/gitlab.agent.agentcfg.VulnerabilityReport",
                    "additionalProperties": false
                },
                "cadence": {
                    "type": "string"
                },
                "resource_requirements": {
                    "$ref": "#/definitions/gitlab.agent.agentcfg.ResourceRequirements",
                    "additionalProperties": false
                }
            },
            "additionalProperties": false,
            "type": "object"
        },
        "gitlab.agent.agentcfg.ContainerScanningFilter": {
            "properties": {
                "namespaces": {
                    "items": {
                        "type": "string"
                    },
                    "type": "array"
                },
                "resources": {
                    "items": {
                        "type": "string"
                    },
                    "type": "array"
                },
                "containers": {
                    "items": {
                        "type": "string"
                    },
                    "type": "array"
                },
                "kinds": {
                    "items": {
                        "type": "string"
                    },
                    "type": "array"
                }
            },
            "additionalProperties": false,
            "type": "object"
        },
        "gitlab.agent.agentcfg.ExtraKeyValCF": {
            "properties": {
                "key": {
                    "type": "string"
                },
                "val": {
                    "items": {
                        "type": "string"
                    },
                    "minItems": 1,
                    "type": "array"
                }
            },
            "additionalProperties": false,
            "type": "object"
        },
        "gitlab.agent.agentcfg.FluxCF": {
            "properties": {
                "webhook_receiver_url": {
                    "type": "string"
                },
                "enabled": {
                    "type": "boolean"
                }
            },
            "additionalProperties": false,
            "type": "object",
            "oneOf": [
                {
                    "required": [
                        "enabled"
                    ]
                }
            ]
        },
        "gitlab.agent.agentcfg.GitLabWorkspacesProxy": {
            "properties": {
                "namespace": {
                    "type": "string"
                }
            },
            "additionalProperties": false,
            "type": "object"
        },
        "gitlab.agent.agentcfg.GitRefCF": {
            "properties": {
                "tag": {
                    "type": "string"
                },
                "branch": {
                    "type": "string"
                },
                "commit": {
                    "type": "string"
                }
            },
            "additionalProperties": false,
            "type": "object",
            "oneOf": [
                {
                    "required": [
                        "tag"
                    ]
                },
                {
                    "required": [
                        "branch"
                    ]
                },
                {
                    "required": [
                        "commit"
                    ]
                }
            ]
        },
        "gitlab.agent.agentcfg.GitopsCF": {
            "properties": {
                "manifest_projects": {
                    "items": {
                        "$ref": "#/definitions/gitlab.agent.agentcfg.ManifestProjectCF"
                    },
                    "additionalProperties": false,
                    "type": "array"
                }
            },
            "additionalProperties": false,
            "type": "object"
        },
        "gitlab.agent.agentcfg.GoogleProfilerCF": {
            "properties": {
                "enabled": {
                    "type": "boolean"
                },
                "project_id": {
                    "type": "string"
                },
                "credentials_file": {
                    "type": "string"
                },
                "debug_logging": {
                    "type": "boolean"
                }
            },
            "additionalProperties": false,
            "type": "object"
        },
        "gitlab.agent.agentcfg.LoggingCF": {
            "properties": {
                "level": {
                    "enum": [
                        "info",
                        "debug",
                        "warn",
                        "error"
                    ],
                    "type": "string"
                },
                "grpc_level": {
                    "enum": [
                        "info",
                        "debug",
                        "warn",
                        "error"
                    ],
                    "type": "string"
                }
            },
            "additionalProperties": false,
            "type": "object",
            "oneOf": [
                {
                    "required": [
                        "grpc_level"
                    ]
                }
            ]
        },
        "gitlab.agent.agentcfg.ManifestProjectCF": {
            "properties": {
                "id": {
                    "type": "string"
                },
                "default_namespace": {
                    "type": "string"
                },
                "paths": {
                    "items": {
                        "$ref": "#/definitions/gitlab.agent.agentcfg.PathCF"
                    },
                    "additionalProperties": false,
                    "type": "array"
                },
                "reconcile_timeout": {
                    "pattern": "^([0-9]+\\.?[0-9]*|\\.[0-9]+)s$",
                    "type": "string",
                    "format": "regex"
                },
                "dry_run_strategy": {
                    "type": "string"
                },
                "prune": {
                    "type": "boolean"
                },
                "prune_timeout": {
                    "pattern": "^([0-9]+\\.?[0-9]*|\\.[0-9]+)s$",
                    "type": "string",
                    "format": "regex"
                },
                "prune_propagation_policy": {
                    "type": "string"
                },
                "inventory_policy": {
                    "type": "string"
                },
                "ref": {
                    "$ref": "#/definitions/gitlab.agent.agentcfg.GitRefCF",
                    "additionalProperties": false
                }
            },
            "additionalProperties": false,
            "type": "object",
            "oneOf": [
                {
                    "required": [
                        "id"
                    ]
                },
                {
                    "required": [
                        "prune"
                    ]
                }
            ]
        },
        "gitlab.agent.agentcfg.ObservabilityCF": {
            "properties": {
                "logging": {
                    "$ref": "#/definitions/gitlab.agent.agentcfg.LoggingCF",
                    "additionalProperties": false
                },
                "google_profiler": {
                    "$ref": "#/definitions/gitlab.agent.agentcfg.GoogleProfilerCF",
                    "additionalProperties": false
                }
            },
            "additionalProperties": false,
            "type": "object"
        },
        "gitlab.agent.agentcfg.PathCF": {
            "properties": {
                "glob": {
                    "type": "string"
                }
            },
            "additionalProperties": false,
            "type": "object"
        },
        "gitlab.agent.agentcfg.RemoteDevelopmentCF": {
            "properties": {
                "enabled": {
                    "type": "boolean"
                },
                "dns_zone": {
                    "type": "string"
                },
                "partial_sync_interval": {
                    "pattern": "^([0-9]+\\.?[0-9]*|\\.[0-9]+)s$",
                    "type": "string",
                    "format": "regex"
                },
                "full_sync_interval": {
                    "pattern": "^([0-9]+\\.?[0-9]*|\\.[0-9]+)s$",
                    "type": "string",
                    "format": "regex"
                },
                "gitlab_workspaces_proxy": {
                    "$ref": "#/definitions/gitlab.agent.agentcfg.GitLabWorkspacesProxy",
                    "additionalProperties": false
                },
                "network_policy": {
                    "$ref": "#/definitions/gitlab.agent.agentcfg.WorkspaceNetworkPolicy",
                    "additionalProperties": false
                },
                "default_resources_per_workspace_container": {
                    "$ref": "#/definitions/gitlab.agent.agentcfg.ResourceRequirements",
                    "additionalProperties": false
                },
                "max_resources_per_workspace": {
                    "$ref": "#/definitions/gitlab.agent.agentcfg.ResourceRequirements",
                    "additionalProperties": false
                },
                "workspaces_quota": {
                    "type": "integer"
                },
                "workspaces_per_user_quota": {
                    "type": "integer"
                }
            },
            "additionalProperties": false,
            "type": "object",
            "oneOf": [
                {
                    "required": [
                        "workspaces_quota"
                    ]
                },
                {
                    "required": [
                        "workspaces_per_user_quota"
                    ]
                }
            ]
        },
        "gitlab.agent.agentcfg.Resource": {
            "properties": {
                "cpu": {
                    "type": "string"
                },
                "memory": {
                    "type": "string"
                }
            },
            "additionalProperties": false,
            "type": "object"
        },
        "gitlab.agent.agentcfg.ResourceRequirements": {
            "properties": {
                "limits": {
                    "$ref": "#/definitions/gitlab.agent.agentcfg.Resource",
                    "additionalProperties": false
                },
                "requests": {
                    "$ref": "#/definitions/gitlab.agent.agentcfg.Resource",
                    "additionalProperties": false
                }
            },
            "additionalProperties": false,
            "type": "object"
        },
        "gitlab.agent.agentcfg.UserAccessAsAgentCF": {
            "additionalProperties": false,
            "type": "object"
        },
        "gitlab.agent.agentcfg.UserAccessAsCF": {
            "properties": {
                "agent": {
                    "$ref": "#/definitions/gitlab.agent.agentcfg.UserAccessAsAgentCF",
                    "additionalProperties": false
                },
                "user": {
                    "$ref": "#/definitions/gitlab.agent.agentcfg.UserAccessAsUserCF",
                    "additionalProperties": false
                }
            },
            "additionalProperties": false,
            "type": "object",
            "oneOf": [
                {
                    "required": [
                        "agent"
                    ]
                },
                {
                    "required": [
                        "user"
                    ]
                }
            ]
        },
        "gitlab.agent.agentcfg.UserAccessAsUserCF": {
            "additionalProperties": false,
            "type": "object"
        },
        "gitlab.agent.agentcfg.UserAccessCF": {
            "properties": {
                "access_as": {
                    "$ref": "#/definitions/gitlab.agent.agentcfg.UserAccessAsCF",
                    "additionalProperties": false
                },
                "projects": {
                    "items": {
                        "$ref": "#/definitions/gitlab.agent.agentcfg.UserAccessProjectCF"
                    },
                    "additionalProperties": false,
                    "type": "array"
                },
                "groups": {
                    "items": {
                        "$ref": "#/definitions/gitlab.agent.agentcfg.UserAccessGroupCF"
                    },
                    "additionalProperties": false,
                    "type": "array"
                }
            },
            "additionalProperties": false,
            "type": "object"
        },
        "gitlab.agent.agentcfg.UserAccessGroupCF": {
            "properties": {
                "id": {
                    "type": "string"
                }
            },
            "additionalProperties": false,
            "type": "object"
        },
        "gitlab.agent.agentcfg.UserAccessProjectCF": {
            "properties": {
                "id": {
                    "type": "string"
                }
            },
            "additionalProperties": false,
            "type": "object"
        },
        "gitlab.agent.agentcfg.VulnerabilityReport": {
            "properties": {
                "namespaces": {
                    "items": {
                        "type": "string"
                    },
                    "type": "array"
                },
                "filters": {
                    "items": {
                        "$ref": "#/definitions/gitlab.agent.agentcfg.ContainerScanningFilter"
                    },
                    "additionalProperties": false,
                    "type": "array"
                }
            },
            "additionalProperties": false,
            "type": "object"
        },
        "gitlab.agent.agentcfg.WorkspaceNetworkPolicy": {
            "properties": {
                "enabled": {
                    "type": "boolean"
                },
                "egress": {
                    "items": {
                        "$ref": "#/definitions/gitlab.agent.agentcfg.WorkspaceNetworkPolicyEgress"
                    },
                    "additionalProperties": false,
                    "type": "array"
                }
            },
            "additionalProperties": false,
            "type": "object",
            "oneOf": [
                {
                    "required": [
                        "enabled"
                    ]
                }
            ]
        },
        "gitlab.agent.agentcfg.WorkspaceNetworkPolicyEgress": {
            "properties": {
                "allow": {
                    "type": "string"
                },
                "except": {
                    "items": {
                        "type": "string"
                    },
                    "type": "array"
                }
            },
            "additionalProperties": false,
            "type": "object"
        }
    }
}