Ion = Hydrogen    . Mass = 1.0079
Tgt = Cr (Solid). Density = 7.2 g/cm3
Stopping Units =  eV/(1E15 atoms/cm2)
Energy(keV)  S(Elec)    S(Nuc)
1.000E+00   4.212E+00  4.749E-01 
1.012E+00   4.236E+00  4.745E-01 
1.023E+00   4.261E+00  4.742E-01 
1.035E+00   4.286E+00  4.738E-01 
1.047E+00   4.310E+00  4.734E-01 
1.059E+00   4.335E+00  4.731E-01 
1.072E+00   4.360E+00  4.727E-01 
1.084E+00   4.386E+00  4.723E-01 
1.097E+00   4.411E+00  4.718E-01 
1.109E+00   4.436E+00  4.714E-01 
1.122E+00   4.462E+00  4.710E-01 
1.135E+00   4.488E+00  4.705E-01 
1.148E+00   4.514E+00  4.700E-01 
1.162E+00   4.540E+00  4.695E-01 
1.175E+00   4.566E+00  4.691E-01 
1.189E+00   4.593E+00  4.686E-01 
1.203E+00   4.619E+00  4.680E-01 
1.217E+00   4.646E+00  4.675E-01 
1.231E+00   4.673E+00  4.670E-01 
1.245E+00   4.700E+00  4.664E-01 
1.259E+00   4.727E+00  4.659E-01 
1.274E+00   4.754E+00  4.653E-01 
1.289E+00   4.782E+00  4.647E-01 
1.304E+00   4.809E+00  4.641E-01 
1.319E+00   4.837E+00  4.635E-01 
1.334E+00   4.865E+00  4.629E-01 
1.350E+00   4.893E+00  4.623E-01 
1.365E+00   4.922E+00  4.617E-01 
1.381E+00   4.950E+00  4.610E-01 
1.397E+00   4.979E+00  4.604E-01 
1.413E+00   5.007E+00  4.597E-01 
1.430E+00   5.036E+00  4.590E-01 
1.446E+00   5.066E+00  4.583E-01 
1.463E+00   5.095E+00  4.576E-01 
1.480E+00   5.124E+00  4.569E-01 
1.497E+00   5.154E+00  4.562E-01 
1.515E+00   5.184E+00  4.554E-01 
1.532E+00   5.214E+00  4.547E-01 
1.550E+00   5.244E+00  4.539E-01 
1.568E+00   5.274E+00  4.532E-01 
1.586E+00   5.305E+00  4.524E-01 
1.605E+00   5.335E+00  4.516E-01 
1.623E+00   5.366E+00  4.508E-01 
1.642E+00   5.397E+00  4.500E-01 
1.661E+00   5.428E+00  4.492E-01 
1.680E+00   5.460E+00  4.483E-01 
1.700E+00   5.491E+00  4.475E-01 
1.719E+00   5.523E+00  4.466E-01 
1.739E+00   5.555E+00  4.458E-01 
1.760E+00   5.587E+00  4.449E-01 
1.780E+00   5.620E+00  4.440E-01 
1.801E+00   5.652E+00  4.431E-01 
1.822E+00   5.685E+00  4.422E-01 
1.843E+00   5.718E+00  4.413E-01 
1.864E+00   5.751E+00  4.404E-01 
1.886E+00   5.784E+00  4.395E-01 
1.908E+00   5.817E+00  4.385E-01 
1.930E+00   5.851E+00  4.376E-01 
1.952E+00   5.885E+00  4.366E-01 
1.975E+00   5.919E+00  4.356E-01 
1.998E+00   5.953E+00  4.347E-01 
2.021E+00   5.987E+00  4.337E-01 
2.044E+00   6.018E+00  4.327E-01 
2.068E+00   6.050E+00  4.317E-01 
2.092E+00   6.082E+00  4.306E-01 
2.116E+00   6.114E+00  4.296E-01 
2.141E+00   6.146E+00  4.286E-01 
2.166E+00   6.179E+00  4.275E-01 
2.191E+00   6.211E+00  4.265E-01 
2.216E+00   6.244E+00  4.254E-01 
2.242E+00   6.277E+00  4.243E-01 
2.268E+00   6.311E+00  4.233E-01 
2.294E+00   6.344E+00  4.222E-01 
2.321E+00   6.378E+00  4.211E-01 
2.348E+00   6.412E+00  4.200E-01 
2.375E+00   6.446E+00  4.189E-01 
2.402E+00   6.480E+00  4.177E-01 
2.430E+00   6.515E+00  4.166E-01 
2.458E+00   6.550E+00  4.155E-01 
2.487E+00   6.585E+00  4.143E-01 
2.516E+00   6.620E+00  4.132E-01 
2.545E+00   6.656E+00  4.120E-01 
2.574E+00   6.692E+00  4.108E-01 
2.604E+00   6.728E+00  4.096E-01 
2.635E+00   6.764E+00  4.084E-01 
2.665E+00   6.800E+00  4.073E-01 
2.696E+00   6.837E+00  4.061E-01 
2.727E+00   6.874E+00  4.048E-01 
2.759E+00   6.911E+00  4.036E-01 
2.791E+00   6.949E+00  4.024E-01 
2.823E+00   6.986E+00  4.012E-01 
2.856E+00   7.024E+00  3.999E-01 
2.889E+00   7.062E+00  3.987E-01 
2.923E+00   7.101E+00  3.974E-01 
2.957E+00   7.139E+00  3.962E-01 
2.991E+00   7.178E+00  3.949E-01 
3.026E+00   7.217E+00  3.936E-01 
3.061E+00   7.257E+00  3.924E-01 
3.096E+00   7.296E+00  3.911E-01 
3.132E+00   7.336E+00  3.898E-01 
3.168E+00   7.376E+00  3.885E-01 
3.205E+00   7.416E+00  3.872E-01 
3.242E+00   7.457E+00  3.859E-01 
3.280E+00   7.497E+00  3.846E-01 
3.318E+00   7.538E+00  3.832E-01 
3.356E+00   7.580E+00  3.819E-01 
3.395E+00   7.621E+00  3.806E-01 
3.435E+00   7.663E+00  3.792E-01 
3.475E+00   7.705E+00  3.779E-01 
3.515E+00   7.747E+00  3.765E-01 
3.556E+00   7.790E+00  3.752E-01 
3.597E+00   7.832E+00  3.738E-01 
3.639E+00   7.875E+00  3.725E-01 
3.681E+00   7.918E+00  3.711E-01 
3.724E+00   7.962E+00  3.697E-01 
3.767E+00   8.005E+00  3.683E-01 
3.810E+00   8.049E+00  3.670E-01 
3.855E+00   8.093E+00  3.656E-01 
3.899E+00   8.138E+00  3.642E-01 
3.945E+00   8.182E+00  3.628E-01 
3.990E+00   8.227E+00  3.614E-01 
4.037E+00   8.272E+00  3.600E-01 
4.083E+00   8.317E+00  3.586E-01 
4.131E+00   8.362E+00  3.572E-01 
4.179E+00   8.408E+00  3.558E-01 
4.227E+00   8.454E+00  3.543E-01 
4.276E+00   8.500E+00  3.529E-01 
4.326E+00   8.546E+00  3.515E-01 
4.376E+00   8.593E+00  3.501E-01 
4.427E+00   8.640E+00  3.486E-01 
4.478E+00   8.686E+00  3.472E-01 
4.530E+00   8.734E+00  3.458E-01 
4.583E+00   8.781E+00  3.443E-01 
4.636E+00   8.828E+00  3.429E-01 
4.690E+00   8.876E+00  3.414E-01 
4.744E+00   8.924E+00  3.400E-01 
4.799E+00   8.972E+00  3.385E-01 
4.855E+00   9.020E+00  3.371E-01 
4.911E+00   9.068E+00  3.356E-01 
4.968E+00   9.117E+00  3.342E-01 
5.026E+00   9.166E+00  3.327E-01 
5.084E+00   9.214E+00  3.312E-01 
5.143E+00   9.263E+00  3.298E-01 
5.202E+00   9.312E+00  3.283E-01 
5.263E+00   9.362E+00  3.268E-01 
5.324E+00   9.411E+00  3.254E-01 
5.386E+00   9.461E+00  3.239E-01 
5.448E+00   9.510E+00  3.224E-01 
5.511E+00   9.560E+00  3.210E-01 
5.575E+00   9.610E+00  3.195E-01 
5.640E+00   9.660E+00  3.180E-01 
5.705E+00   9.710E+00  3.165E-01 
5.771E+00   9.760E+00  3.151E-01 
5.838E+00   9.810E+00  3.136E-01 
5.906E+00   9.860E+00  3.121E-01 
5.975E+00   9.910E+00  3.106E-01 
6.044E+00   9.961E+00  3.091E-01 
6.114E+00   1.001E+01  3.077E-01 
6.185E+00   1.006E+01  3.062E-01 
6.257E+00   1.011E+01  3.047E-01 
6.329E+00   1.016E+01  3.032E-01 
6.403E+00   1.021E+01  3.017E-01 
6.477E+00   1.026E+01  3.003E-01 
6.552E+00   1.031E+01  2.988E-01 
6.628E+00   1.037E+01  2.973E-01 
6.705E+00   1.042E+01  2.958E-01 
6.783E+00   1.047E+01  2.943E-01 
6.861E+00   1.052E+01  2.929E-01 
6.941E+00   1.057E+01  2.914E-01 
7.021E+00   1.062E+01  2.899E-01 
7.103E+00   1.067E+01  2.884E-01 
7.185E+00   1.072E+01  2.870E-01 
7.269E+00   1.077E+01  2.855E-01 
7.353E+00   1.082E+01  2.840E-01 
7.438E+00   1.087E+01  2.825E-01 
7.524E+00   1.092E+01  2.811E-01 
7.612E+00   1.097E+01  2.796E-01 
7.700E+00   1.102E+01  2.781E-01 
7.789E+00   1.107E+01  2.767E-01 
7.880E+00   1.112E+01  2.752E-01 
7.971E+00   1.117E+01  2.737E-01 
8.064E+00   1.122E+01  2.723E-01 
8.157E+00   1.127E+01  2.708E-01 
8.252E+00   1.132E+01  2.694E-01 
8.347E+00   1.137E+01  2.679E-01 
8.444E+00   1.143E+01  2.664E-01 
8.542E+00   1.148E+01  2.650E-01 
8.641E+00   1.153E+01  2.635E-01 
8.741E+00   1.158E+01  2.621E-01 
8.843E+00   1.163E+01  2.606E-01 
8.945E+00   1.168E+01  2.592E-01 
9.049E+00   1.173E+01  2.578E-01 
9.154E+00   1.178E+01  2.563E-01 
9.260E+00   1.183E+01  2.549E-01 
9.368E+00   1.188E+01  2.535E-01 
9.476E+00   1.193E+01  2.520E-01 
9.586E+00   1.198E+01  2.506E-01 
9.698E+00   1.203E+01  2.492E-01 
9.810E+00   1.209E+01  2.477E-01 
9.924E+00   1.214E+01  2.463E-01 
1.004E+01   1.219E+01  2.449E-01 
1.016E+01   1.224E+01  2.435E-01 
1.027E+01   1.230E+01  2.421E-01 
1.039E+01   1.235E+01  2.407E-01 
1.051E+01   1.240E+01  2.393E-01 
1.063E+01   1.246E+01  2.379E-01 
1.076E+01   1.251E+01  2.365E-01 
1.088E+01   1.256E+01  2.351E-01 
1.101E+01   1.262E+01  2.337E-01 
1.114E+01   1.267E+01  2.323E-01 
1.127E+01   1.273E+01  2.309E-01 
1.140E+01   1.279E+01  2.295E-01 
1.153E+01   1.284E+01  2.282E-01 
1.166E+01   1.290E+01  2.268E-01 
1.180E+01   1.296E+01  2.254E-01 
1.193E+01   1.302E+01  2.241E-01 
1.207E+01   1.307E+01  2.227E-01 
1.221E+01   1.313E+01  2.214E-01 
1.235E+01   1.319E+01  2.200E-01 
1.250E+01   1.326E+01  2.186E-01 
1.264E+01   1.332E+01  2.173E-01 
1.279E+01   1.338E+01  2.160E-01 
1.294E+01   1.344E+01  2.146E-01 
1.309E+01   1.351E+01  2.133E-01 
1.324E+01   1.357E+01  2.120E-01 
1.339E+01   1.364E+01  2.106E-01 
1.355E+01   1.370E+01  2.093E-01 
1.371E+01   1.377E+01  2.080E-01 
1.387E+01   1.384E+01  2.067E-01 
1.403E+01   1.391E+01  2.054E-01 
1.419E+01   1.398E+01  2.041E-01 
1.435E+01   1.405E+01  2.028E-01 
1.452E+01   1.412E+01  2.015E-01 
1.469E+01   1.419E+01  2.002E-01 
1.486E+01   1.427E+01  1.989E-01 
1.503E+01   1.434E+01  1.977E-01 
1.521E+01   1.442E+01  1.964E-01 
1.538E+01   1.450E+01  1.951E-01 
1.556E+01   1.457E+01  1.938E-01 
1.574E+01   1.465E+01  1.926E-01 
1.592E+01   1.473E+01  1.913E-01 
1.611E+01   1.481E+01  1.901E-01 
1.629E+01   1.489E+01  1.888E-01 
1.648E+01   1.498E+01  1.876E-01 
1.667E+01   1.506E+01  1.864E-01 
1.687E+01   1.514E+01  1.851E-01 
1.706E+01   1.523E+01  1.839E-01 
1.726E+01   1.532E+01  1.827E-01 
1.746E+01   1.541E+01  1.815E-01 
1.766E+01   1.549E+01  1.803E-01 
1.787E+01   1.558E+01  1.790E-01 
1.808E+01   1.567E+01  1.778E-01 
1.829E+01   1.577E+01  1.766E-01 
1.850E+01   1.586E+01  1.755E-01 
1.871E+01   1.595E+01  1.743E-01 
1.893E+01   1.605E+01  1.731E-01 
1.915E+01   1.614E+01  1.719E-01 
1.937E+01   1.624E+01  1.707E-01 
1.960E+01   1.634E+01  1.696E-01 
1.982E+01   1.644E+01  1.684E-01 
2.005E+01   1.654E+01  1.673E-01 
2.029E+01   1.664E+01  1.661E-01 
2.052E+01   1.674E+01  1.650E-01 
2.076E+01   1.684E+01  1.638E-01 
2.100E+01   1.695E+01  1.627E-01 
2.124E+01   1.705E+01  1.616E-01 
2.149E+01   1.716E+01  1.605E-01 
2.174E+01   1.727E+01  1.593E-01 
2.199E+01   1.737E+01  1.582E-01 
2.225E+01   1.748E+01  1.571E-01 
2.250E+01   1.759E+01  1.560E-01 
2.277E+01   1.770E+01  1.549E-01 
2.303E+01   1.781E+01  1.538E-01 
2.330E+01   1.792E+01  1.527E-01 
2.357E+01   1.804E+01  1.517E-01 
2.384E+01   1.815E+01  1.506E-01 
2.412E+01   1.826E+01  1.495E-01 
2.440E+01   1.838E+01  1.484E-01 
2.468E+01   1.849E+01  1.474E-01 
2.497E+01   1.861E+01  1.463E-01 
2.526E+01   1.873E+01  1.453E-01 
2.555E+01   1.884E+01  1.442E-01 
2.584E+01   1.896E+01  1.432E-01 
2.614E+01   1.908E+01  1.422E-01 
2.645E+01   1.920E+01  1.412E-01 
2.675E+01   1.932E+01  1.401E-01 
2.707E+01   1.944E+01  1.391E-01 
2.738E+01   1.956E+01  1.381E-01 
2.770E+01   1.969E+01  1.371E-01 
2.802E+01   1.981E+01  1.361E-01 
2.834E+01   1.993E+01  1.351E-01 
2.867E+01   2.006E+01  1.341E-01 
2.900E+01   2.018E+01  1.331E-01 
2.934E+01   2.030E+01  1.322E-01 
2.968E+01   2.043E+01  1.312E-01 
3.003E+01   2.055E+01  1.302E-01 
3.037E+01   2.068E+01  1.293E-01 
3.073E+01   2.081E+01  1.283E-01 
3.108E+01   2.093E+01  1.273E-01 
3.144E+01   2.106E+01  1.264E-01 
3.181E+01   2.119E+01  1.255E-01 
3.218E+01   2.131E+01  1.245E-01 
3.255E+01   2.144E+01  1.236E-01 
3.293E+01   2.157E+01  1.227E-01 
3.331E+01   2.170E+01  1.217E-01 
3.370E+01   2.182E+01  1.208E-01 
3.409E+01   2.195E+01  1.199E-01 
3.448E+01   2.208E+01  1.190E-01 
3.488E+01   2.221E+01  1.181E-01 
3.529E+01   2.234E+01  1.172E-01 
3.570E+01   2.246E+01  1.163E-01 
3.611E+01   2.259E+01  1.155E-01 
3.653E+01   2.272E+01  1.146E-01 
3.695E+01   2.285E+01  1.137E-01 
3.738E+01   2.297E+01  1.128E-01 
3.781E+01   2.310E+01  1.120E-01 
3.825E+01   2.323E+01  1.111E-01 
3.870E+01   2.335E+01  1.103E-01 
3.915E+01   2.348E+01  1.094E-01 
3.960E+01   2.361E+01  1.086E-01 
4.006E+01   2.373E+01  1.078E-01 
4.052E+01   2.386E+01  1.069E-01 
4.099E+01   2.398E+01  1.061E-01 
4.147E+01   2.411E+01  1.053E-01 
4.195E+01   2.423E+01  1.045E-01 
4.244E+01   2.435E+01  1.036E-01 
4.293E+01   2.448E+01  1.028E-01 
4.343E+01   2.460E+01  1.020E-01 
4.393E+01   2.472E+01  1.012E-01 
4.444E+01   2.484E+01  1.005E-01 
4.496E+01   2.496E+01  9.967E-02 
4.548E+01   2.508E+01  9.889E-02 
4.600E+01   2.520E+01  9.812E-02 
4.654E+01   2.531E+01  9.735E-02 
4.708E+01   2.543E+01  9.658E-02 
4.762E+01   2.555E+01  9.582E-02 
4.818E+01   2.566E+01  9.507E-02 
4.873E+01   2.577E+01  9.432E-02 
4.930E+01   2.589E+01  9.357E-02 
4.987E+01   2.600E+01  9.283E-02 
5.045E+01   2.611E+01  9.209E-02 
5.104E+01   2.622E+01  9.136E-02 
5.163E+01   2.632E+01  9.064E-02 
5.223E+01   2.643E+01  8.991E-02 
5.283E+01   2.654E+01  8.920E-02 
5.344E+01   2.664E+01  8.849E-02 
5.406E+01   2.674E+01  8.778E-02 
5.469E+01   2.684E+01  8.708E-02 
5.533E+01   2.694E+01  8.638E-02 
5.597E+01   2.704E+01  8.568E-02 
5.662E+01   2.714E+01  8.500E-02 
5.727E+01   2.723E+01  8.431E-02 
5.794E+01   2.733E+01  8.363E-02 
5.861E+01   2.742E+01  8.296E-02 
5.929E+01   2.751E+01  8.229E-02 
5.998E+01   2.760E+01  8.162E-02 
6.067E+01   2.769E+01  8.096E-02 
6.138E+01   2.777E+01  8.031E-02 
6.209E+01   2.786E+01  7.965E-02 
6.281E+01   2.794E+01  7.901E-02 
6.354E+01   2.802E+01  7.836E-02 
6.427E+01   2.810E+01  7.772E-02 
6.502E+01   2.817E+01  7.709E-02 
6.577E+01   2.825E+01  7.646E-02 
6.654E+01   2.832E+01  7.584E-02 
6.731E+01   2.839E+01  7.521E-02 
6.809E+01   2.846E+01  7.460E-02 
6.888E+01   2.853E+01  7.399E-02 
6.968E+01   2.859E+01  7.096E-02 
7.049E+01   2.865E+01  7.039E-02 
7.130E+01   2.871E+01  6.981E-02 
7.213E+01   2.877E+01  6.925E-02 
7.297E+01   2.883E+01  6.868E-02 
7.381E+01   2.888E+01  6.812E-02 
7.467E+01   2.894E+01  6.756E-02 
7.554E+01   2.899E+01  6.701E-02 
7.641E+01   2.903E+01  6.646E-02 
7.730E+01   2.908E+01  6.592E-02 
7.820E+01   2.912E+01  6.537E-02 
7.910E+01   2.916E+01  6.484E-02 
8.002E+01   2.920E+01  6.430E-02 
8.095E+01   2.924E+01  6.377E-02 
8.189E+01   2.928E+01  6.325E-02 
8.284E+01   2.931E+01  6.272E-02 
8.380E+01   2.934E+01  6.220E-02 
8.477E+01   2.937E+01  6.169E-02 
8.575E+01   2.939E+01  6.118E-02 
8.675E+01   2.942E+01  6.067E-02 
8.775E+01   2.944E+01  6.016E-02 
8.877E+01   2.946E+01  5.966E-02 
8.980E+01   2.947E+01  5.916E-02 
9.084E+01   2.949E+01  5.867E-02 
9.190E+01   2.950E+01  5.818E-02 
9.296E+01   2.951E+01  5.769E-02 
9.404E+01   2.952E+01  5.721E-02 
9.513E+01   2.952E+01  5.673E-02 
9.624E+01   2.953E+01  5.625E-02 
9.735E+01   2.953E+01  5.578E-02 
9.848E+01   2.953E+01  5.531E-02 
9.962E+01   2.952E+01  5.484E-02 
1.008E+02   2.952E+01  5.438E-02 
1.019E+02   2.951E+01  5.392E-02 
1.031E+02   2.950E+01  5.347E-02 
1.043E+02   2.949E+01  5.301E-02 
1.055E+02   2.947E+01  5.256E-02 
1.068E+02   2.946E+01  5.212E-02 
1.080E+02   2.944E+01  5.168E-02 
1.093E+02   2.942E+01  5.124E-02 
1.105E+02   2.939E+01  5.080E-02 
1.118E+02   2.937E+01  5.037E-02 
1.131E+02   2.934E+01  4.994E-02 
1.144E+02   2.931E+01  4.951E-02 
1.157E+02   2.928E+01  4.909E-02 
1.171E+02   2.925E+01  4.867E-02 
1.184E+02   2.921E+01  4.825E-02 
1.198E+02   2.918E+01  4.784E-02 
1.212E+02   2.914E+01  4.743E-02 
1.226E+02   2.910E+01  4.702E-02 
1.240E+02   2.905E+01  4.662E-02 
1.255E+02   2.901E+01  4.622E-02 
1.269E+02   2.896E+01  4.582E-02 
1.284E+02   2.891E+01  4.542E-02 
1.299E+02   2.886E+01  4.503E-02 
1.314E+02   2.881E+01  4.464E-02 
1.329E+02   2.876E+01  4.426E-02 
1.345E+02   2.870E+01  4.387E-02 
1.360E+02   2.865E+01  4.349E-02 
1.376E+02   2.859E+01  4.312E-02 
1.392E+02   2.853E+01  4.274E-02 
1.408E+02   2.846E+01  4.237E-02 
1.424E+02   2.840E+01  4.200E-02 
1.441E+02   2.834E+01  4.164E-02 
1.458E+02   2.827E+01  4.128E-02 
1.475E+02   2.820E+01  4.092E-02 
1.492E+02   2.813E+01  4.056E-02 
1.509E+02   2.806E+01  4.020E-02 
1.526E+02   2.799E+01  3.985E-02 
1.544E+02   2.791E+01  3.951E-02 
1.562E+02   2.784E+01  3.916E-02 
1.580E+02   2.776E+01  3.882E-02 
1.598E+02   2.768E+01  3.848E-02 
1.617E+02   2.760E+01  3.814E-02 
1.636E+02   2.752E+01  3.780E-02 
1.655E+02   2.744E+01  3.747E-02 
1.674E+02   2.736E+01  3.714E-02 
1.693E+02   2.727E+01  3.681E-02 
1.713E+02   2.719E+01  3.649E-02 
1.733E+02   2.710E+01  3.617E-02 
1.753E+02   2.701E+01  3.585E-02 
1.773E+02   2.692E+01  3.553E-02 
1.794E+02   2.683E+01  3.522E-02 
1.815E+02   2.674E+01  3.491E-02 
1.836E+02   2.665E+01  3.460E-02 
1.857E+02   2.656E+01  3.429E-02 
1.879E+02   2.647E+01  3.399E-02 
1.900E+02   2.637E+01  3.369E-02 
1.922E+02   2.628E+01  3.339E-02 
1.945E+02   2.618E+01  3.309E-02 
1.967E+02   2.608E+01  3.280E-02 
1.990E+02   2.598E+01  3.250E-02 
2.013E+02   2.589E+01  3.221E-02 
2.036E+02   2.579E+01  3.193E-02 
2.060E+02   2.569E+01  3.164E-02 
2.084E+02   2.559E+01  3.136E-02 
2.108E+02   2.548E+01  3.108E-02 
2.133E+02   2.538E+01  3.080E-02 
2.157E+02   2.528E+01  3.053E-02 
2.182E+02   2.518E+01  3.025E-02 
2.208E+02   2.507E+01  2.998E-02 
2.233E+02   2.497E+01  2.971E-02 
2.259E+02   2.486E+01  2.945E-02 
2.285E+02   2.476E+01  2.918E-02 
2.312E+02   2.465E+01  2.892E-02 
2.339E+02   2.454E+01  2.866E-02 
2.366E+02   2.444E+01  2.840E-02 
2.393E+02   2.433E+01  2.815E-02 
2.421E+02   2.422E+01  2.789E-02 
2.449E+02   2.411E+01  2.764E-02 
2.478E+02   2.401E+01  2.739E-02 
2.506E+02   2.390E+01  2.715E-02 
2.535E+02   2.379E+01  2.690E-02 
2.565E+02   2.368E+01  2.666E-02 
2.595E+02   2.357E+01  2.642E-02 
2.625E+02   2.346E+01  2.618E-02 
2.655E+02   2.335E+01  2.594E-02 
2.686E+02   2.324E+01  2.570E-02 
2.717E+02   2.313E+01  2.547E-02 
2.749E+02   2.302E+01  2.524E-02 
2.780E+02   2.290E+01  2.501E-02 
2.813E+02   2.279E+01  2.478E-02 
2.845E+02   2.268E+01  2.456E-02 
2.878E+02   2.257E+01  2.434E-02 
2.912E+02   2.246E+01  2.411E-02 
2.945E+02   2.235E+01  2.389E-02 
2.980E+02   2.224E+01  2.368E-02 
3.014E+02   2.212E+01  2.346E-02 
3.049E+02   2.201E+01  2.325E-02 
3.085E+02   2.190E+01  2.303E-02 
3.120E+02   2.179E+01  2.282E-02 
3.156E+02   2.168E+01  2.262E-02 
3.193E+02   2.157E+01  2.241E-02 
3.230E+02   2.145E+01  2.220E-02 
3.268E+02   2.134E+01  2.200E-02 
3.306E+02   2.123E+01  2.180E-02 
3.344E+02   2.112E+01  2.160E-02 
3.383E+02   2.101E+01  2.140E-02 
3.422E+02   2.090E+01  2.120E-02 
3.462E+02   2.078E+01  2.101E-02 
3.502E+02   2.067E+01  2.082E-02 
3.542E+02   2.056E+01  2.062E-02 
3.583E+02   2.045E+01  2.043E-02 
3.625E+02   2.034E+01  2.025E-02 
3.667E+02   2.023E+01  2.006E-02 
3.710E+02   2.012E+01  1.988E-02 
3.753E+02   2.001E+01  1.969E-02 
3.796E+02   1.990E+01  1.951E-02 
3.840E+02   1.979E+01  1.933E-02 
3.885E+02   1.968E+01  1.915E-02 
3.930E+02   1.957E+01  1.897E-02 
3.975E+02   1.946E+01  1.880E-02 
4.021E+02   1.935E+01  1.863E-02 
4.068E+02   1.924E+01  1.845E-02 
4.115E+02   1.913E+01  1.828E-02 
4.163E+02   1.902E+01  1.811E-02 
4.211E+02   1.891E+01  1.794E-02 
4.260E+02   1.881E+01  1.778E-02 
4.310E+02   1.870E+01  1.761E-02 
4.360E+02   1.859E+01  1.745E-02 
4.410E+02   1.848E+01  1.729E-02 
4.461E+02   1.838E+01  1.713E-02 
4.513E+02   1.827E+01  1.697E-02 
4.565E+02   1.816E+01  1.681E-02 
4.618E+02   1.806E+01  1.665E-02 
4.672E+02   1.795E+01  1.650E-02 
4.726E+02   1.785E+01  1.634E-02 
4.781E+02   1.774E+01  1.619E-02 
4.836E+02   1.764E+01  1.604E-02 
4.892E+02   1.753E+01  1.589E-02 
4.949E+02   1.743E+01  1.574E-02 
5.007E+02   1.733E+01  1.560E-02 
5.065E+02   1.722E+01  1.545E-02 
5.123E+02   1.712E+01  1.531E-02 
5.183E+02   1.702E+01  1.516E-02 
5.243E+02   1.691E+01  1.502E-02 
5.304E+02   1.681E+01  1.488E-02 
5.365E+02   1.671E+01  1.474E-02 
5.428E+02   1.661E+01  1.460E-02 
5.490E+02   1.651E+01  1.447E-02 
5.554E+02   1.641E+01  1.433E-02 
5.619E+02   1.631E+01  1.420E-02 
5.684E+02   1.621E+01  1.406E-02 
5.750E+02   1.611E+01  1.393E-02 
5.816E+02   1.601E+01  1.380E-02 
5.884E+02   1.591E+01  1.367E-02 
5.952E+02   1.581E+01  1.354E-02 
6.021E+02   1.572E+01  1.341E-02 
6.091E+02   1.562E+01  1.329E-02 
6.162E+02   1.552E+01  1.316E-02 
6.233E+02   1.543E+01  1.304E-02 
6.305E+02   1.533E+01  1.291E-02 
6.378E+02   1.523E+01  1.279E-02 
6.452E+02   1.514E+01  1.267E-02 
6.527E+02   1.504E+01  1.255E-02 
6.603E+02   1.495E+01  1.243E-02 
6.680E+02   1.486E+01  1.232E-02 
6.757E+02   1.476E+01  1.220E-02 
6.835E+02   1.467E+01  1.208E-02 
6.915E+02   1.458E+01  1.197E-02 
6.995E+02   1.448E+01  1.186E-02 
7.076E+02   1.439E+01  1.174E-02 
7.158E+02   1.430E+01  1.163E-02 
7.241E+02   1.421E+01  1.152E-02 
7.325E+02   1.412E+01  1.141E-02 
7.410E+02   1.403E+01  1.131E-02 
7.496E+02   1.394E+01  1.120E-02 
7.583E+02   1.385E+01  1.109E-02 
7.671E+02   1.376E+01  1.099E-02 
7.760E+02   1.367E+01  1.088E-02 
7.850E+02   1.358E+01  1.078E-02 
7.941E+02   1.350E+01  1.068E-02 
8.033E+02   1.341E+01  1.057E-02 
8.126E+02   1.332E+01  1.047E-02 
8.221E+02   1.324E+01  1.037E-02 
8.316E+02   1.315E+01  1.028E-02 
8.412E+02   1.307E+01  1.018E-02 
8.510E+02   1.298E+01  1.008E-02 
8.609E+02   1.290E+01  9.985E-03 
8.709E+02   1.281E+01  9.889E-03 
8.810E+02   1.273E+01  9.795E-03 
8.912E+02   1.264E+01  9.701E-03 
9.015E+02   1.256E+01  9.609E-03 
9.120E+02   1.248E+01  9.517E-03 
9.225E+02   1.240E+01  9.426E-03 
9.332E+02   1.232E+01  9.336E-03 
9.441E+02   1.223E+01  9.247E-03 
9.550E+02   1.215E+01  9.158E-03 
9.661E+02   1.207E+01  9.070E-03 
9.773E+02   1.199E+01  8.984E-03 
9.886E+02   1.191E+01  8.897E-03 
1.000E+03   1.183E+01  8.812E-03 
1.012E+03   1.176E+01  8.728E-03 
1.023E+03   1.169E+01  8.644E-03 
1.035E+03   1.162E+01  8.561E-03 
1.047E+03   1.154E+01  8.479E-03 
1.059E+03   1.147E+01  8.397E-03 
1.072E+03   1.139E+01  8.317E-03 
1.084E+03   1.132E+01  8.237E-03 
1.097E+03   1.124E+01  8.158E-03 
1.109E+03   1.117E+01  8.079E-03 
1.122E+03   1.109E+01  8.002E-03 
1.135E+03   1.101E+01  7.925E-03 
1.149E+03   1.093E+01  7.848E-03 
1.162E+03   1.085E+01  7.773E-03 
1.175E+03   1.077E+01  7.698E-03 
1.189E+03   1.068E+01  7.624E-03 
1.203E+03   1.060E+01  7.550E-03 
1.217E+03   1.052E+01  7.477E-03 
1.231E+03   1.045E+01  7.405E-03 
1.245E+03   1.038E+01  7.334E-03 
1.260E+03   1.031E+01  7.263E-03 
1.274E+03   1.024E+01  7.193E-03 
1.289E+03   1.017E+01  7.123E-03 
1.304E+03   1.009E+01  7.055E-03 
1.319E+03   1.002E+01  6.986E-03 
1.334E+03   9.955E+00  6.919E-03 
1.350E+03   9.886E+00  6.852E-03 
1.365E+03   9.817E+00  6.786E-03 
1.381E+03   9.749E+00  6.720E-03 
1.397E+03   9.680E+00  6.655E-03 
1.414E+03   9.613E+00  6.590E-03 
1.430E+03   9.545E+00  6.527E-03 
1.446E+03   9.478E+00  6.463E-03 
1.463E+03   9.411E+00  6.401E-03 
1.480E+03   9.345E+00  6.339E-03 
1.497E+03   9.279E+00  6.277E-03 
1.515E+03   9.213E+00  6.216E-03 
1.532E+03   9.147E+00  6.156E-03 
1.550E+03   9.082E+00  6.096E-03 
1.568E+03   9.018E+00  6.037E-03 
1.586E+03   8.953E+00  5.978E-03 
1.605E+03   8.889E+00  5.920E-03 
1.623E+03   8.825E+00  5.862E-03 
1.642E+03   8.762E+00  5.805E-03 
1.661E+03   8.699E+00  5.749E-03 
1.680E+03   8.636E+00  5.693E-03 
1.700E+03   8.574E+00  5.638E-03 
1.720E+03   8.512E+00  5.583E-03 
1.740E+03   8.451E+00  5.528E-03 
1.760E+03   8.389E+00  5.474E-03 
1.780E+03   8.328E+00  5.421E-03 
1.801E+03   8.268E+00  5.368E-03 
1.822E+03   8.208E+00  5.316E-03 
1.843E+03   8.148E+00  5.264E-03 
1.864E+03   8.088E+00  5.213E-03 
1.886E+03   8.029E+00  5.162E-03 
1.908E+03   7.970E+00  5.111E-03 
1.930E+03   7.912E+00  5.061E-03 
1.952E+03   7.854E+00  5.012E-03 
1.975E+03   7.796E+00  4.963E-03 
1.998E+03   7.738E+00  4.914E-03 
2.021E+03   7.681E+00  4.866E-03 
2.044E+03   7.624E+00  4.819E-03 
2.068E+03   7.568E+00  4.772E-03 
2.092E+03   7.512E+00  4.725E-03 
2.116E+03   7.456E+00  4.679E-03 
2.141E+03   7.401E+00  4.633E-03 
2.166E+03   7.346E+00  4.587E-03 
2.191E+03   7.291E+00  4.542E-03 
2.216E+03   7.236E+00  4.498E-03 
2.242E+03   7.182E+00  4.454E-03 
2.268E+03   7.128E+00  4.410E-03 
2.294E+03   7.075E+00  4.367E-03 
2.321E+03   7.022E+00  4.324E-03 
2.348E+03   6.969E+00  4.282E-03 
2.375E+03   6.916E+00  4.240E-03 
2.403E+03   6.864E+00  4.198E-03 
2.431E+03   6.812E+00  4.157E-03 
2.459E+03   6.761E+00  4.116E-03 
2.487E+03   6.710E+00  4.075E-03 
2.516E+03   6.659E+00  4.035E-03 
2.545E+03   6.608E+00  3.996E-03 
2.575E+03   6.558E+00  3.956E-03 
2.605E+03   6.508E+00  3.917E-03 
2.635E+03   6.458E+00  3.879E-03 
2.665E+03   6.409E+00  3.841E-03 
2.696E+03   6.360E+00  3.803E-03 
2.728E+03   6.311E+00  3.765E-03 
2.759E+03   6.263E+00  3.728E-03 
2.791E+03   6.215E+00  3.691E-03 
2.824E+03   6.167E+00  3.655E-03 
2.856E+03   6.120E+00  3.619E-03 
2.889E+03   6.073E+00  3.583E-03 
2.923E+03   6.026E+00  3.548E-03 
2.957E+03   5.979E+00  3.513E-03 
2.991E+03   5.933E+00  3.478E-03 
3.026E+03   5.887E+00  3.444E-03 
3.061E+03   5.841E+00  3.410E-03 
3.097E+03   5.796E+00  3.376E-03 
3.132E+03   5.751E+00  3.343E-03 
3.169E+03   5.706E+00  3.310E-03 
3.206E+03   5.662E+00  3.277E-03 
3.243E+03   5.618E+00  3.245E-03 
3.280E+03   5.574E+00  3.213E-03 
3.318E+03   5.530E+00  3.181E-03 
3.357E+03   5.487E+00  3.149E-03 
3.396E+03   5.444E+00  3.118E-03 
3.435E+03   5.401E+00  3.087E-03 
3.475E+03   5.359E+00  3.057E-03 
3.515E+03   5.317E+00  3.026E-03 
3.556E+03   5.275E+00  2.996E-03 
3.597E+03   5.233E+00  2.967E-03 
3.639E+03   5.192E+00  2.937E-03 
3.681E+03   5.151E+00  2.908E-03 
3.724E+03   5.110E+00  2.879E-03 
3.767E+03   5.070E+00  2.851E-03 
3.811E+03   5.030E+00  2.822E-03 
3.855E+03   4.990E+00  2.794E-03 
3.900E+03   4.950E+00  2.767E-03 
3.945E+03   4.911E+00  2.739E-03 
3.991E+03   4.871E+00  2.712E-03 
4.037E+03   4.833E+00  2.685E-03 
4.084E+03   4.794E+00  2.658E-03 
4.131E+03   4.756E+00  2.632E-03 
4.179E+03   4.718E+00  2.606E-03 
4.228E+03   4.680E+00  2.580E-03 
4.277E+03   4.642E+00  2.554E-03 
4.326E+03   4.605E+00  2.529E-03 
4.376E+03   4.568E+00  2.504E-03 
4.427E+03   4.531E+00  2.479E-03 
4.479E+03   4.495E+00  2.454E-03 
4.531E+03   4.459E+00  2.430E-03 
4.583E+03   4.423E+00  2.405E-03 
4.636E+03   4.387E+00  2.381E-03 
4.690E+03   4.352E+00  2.358E-03 
4.744E+03   4.316E+00  2.334E-03 
4.799E+03   4.281E+00  2.311E-03 
4.855E+03   4.247E+00  2.288E-03 
4.911E+03   4.212E+00  2.265E-03 
4.968E+03   4.178E+00  2.242E-03 
5.026E+03   4.144E+00  2.220E-03 
5.084E+03   4.110E+00  2.198E-03 
5.143E+03   4.077E+00  2.176E-03 
5.203E+03   4.043E+00  2.154E-03 
5.263E+03   4.010E+00  2.133E-03 
5.324E+03   3.978E+00  2.111E-03 
5.386E+03   3.945E+00  2.090E-03 
5.449E+03   3.913E+00  2.069E-03 
5.512E+03   3.881E+00  2.049E-03 
5.576E+03   3.849E+00  2.028E-03 
5.640E+03   3.817E+00  2.008E-03 
5.706E+03   3.786E+00  1.988E-03 
5.772E+03   3.755E+00  1.968E-03 
5.839E+03   3.724E+00  1.948E-03 
5.907E+03   3.693E+00  1.929E-03 
5.975E+03   3.662E+00  1.909E-03 
6.045E+03   3.632E+00  1.890E-03 
6.115E+03   3.602E+00  1.871E-03 
6.186E+03   3.572E+00  1.853E-03 
6.257E+03   3.543E+00  1.834E-03 
6.330E+03   3.513E+00  1.816E-03 
6.403E+03   3.484E+00  1.797E-03 
6.478E+03   3.455E+00  1.779E-03 
6.553E+03   3.427E+00  1.762E-03 
6.629E+03   3.398E+00  1.744E-03 
6.706E+03   3.370E+00  1.726E-03 
6.783E+03   3.342E+00  1.709E-03 
6.862E+03   3.314E+00  1.692E-03 
6.942E+03   3.286E+00  1.675E-03 
7.022E+03   3.259E+00  1.658E-03 
7.104E+03   3.231E+00  1.641E-03 
7.186E+03   3.204E+00  1.625E-03 
7.269E+03   3.177E+00  1.609E-03 
7.354E+03   3.151E+00  1.592E-03 
7.439E+03   3.124E+00  1.576E-03 
7.525E+03   3.098E+00  1.561E-03 
7.613E+03   3.072E+00  1.545E-03 
7.701E+03   3.046E+00  1.529E-03 
7.790E+03   3.021E+00  1.514E-03 
7.881E+03   2.995E+00  1.499E-03 
7.972E+03   2.970E+00  1.484E-03 
8.064E+03   2.945E+00  1.469E-03 
8.158E+03   2.920E+00  1.454E-03 
8.253E+03   2.895E+00  1.439E-03 
8.348E+03   2.871E+00  1.425E-03 
8.445E+03   2.846E+00  1.410E-03 
8.543E+03   2.822E+00  1.396E-03 
8.642E+03   2.798E+00  1.382E-03 
8.742E+03   2.775E+00  1.368E-03 
8.844E+03   2.751E+00  1.354E-03 
8.946E+03   2.728E+00  1.341E-03 
9.050E+03   2.705E+00  1.327E-03 
9.155E+03   2.682E+00  1.314E-03 
9.261E+03   2.659E+00  1.301E-03 
9.369E+03   2.636E+00  1.287E-03 
9.477E+03   2.614E+00  1.274E-03 
9.587E+03   2.591E+00  1.262E-03 
9.699E+03   2.569E+00  1.249E-03 
9.811E+03   2.547E+00  1.236E-03 
9.925E+03   2.525E+00  1.224E-03 
1.004E+04   2.504E+00  1.211E-03 
1.016E+04   2.482E+00  1.199E-03 
1.027E+04   2.461E+00  1.187E-03 
1.039E+04   2.440E+00  1.175E-03 
1.051E+04   2.419E+00  1.163E-03 
1.064E+04   2.398E+00  1.151E-03 
1.076E+04   2.378E+00  1.140E-03 
1.088E+04   2.357E+00  1.128E-03 
1.101E+04   2.337E+00  1.117E-03 
1.114E+04   2.317E+00  1.106E-03 
1.127E+04   2.297E+00  1.094E-03 
1.140E+04   2.277E+00  1.083E-03 
1.153E+04   2.257E+00  1.072E-03 
1.166E+04   2.238E+00  1.061E-03 
1.180E+04   2.219E+00  1.051E-03 
1.194E+04   2.200E+00  1.040E-03 
1.207E+04   2.180E+00  1.029E-03 
1.221E+04   2.162E+00  1.019E-03 
1.236E+04   2.143E+00  1.009E-03 
1.250E+04   2.124E+00  9.985E-04 
1.264E+04   2.106E+00  9.884E-04 
1.279E+04   2.088E+00  9.784E-04 
1.294E+04   2.070E+00  9.684E-04 
1.309E+04   2.052E+00  9.586E-04 
1.324E+04   2.034E+00  9.489E-04 
1.340E+04   2.016E+00  9.393E-04 
1.355E+04   1.999E+00  9.297E-04 
1.371E+04   1.981E+00  9.203E-04 
1.387E+04   1.964E+00  9.109E-04 
1.403E+04   1.947E+00  9.017E-04 
1.419E+04   1.930E+00  8.925E-04 
1.435E+04   1.913E+00  8.835E-04 
1.452E+04   1.897E+00  8.745E-04 
1.469E+04   1.880E+00  8.656E-04 
1.486E+04   1.864E+00  8.568E-04 
1.503E+04   1.847E+00  8.481E-04 
1.521E+04   1.831E+00  8.395E-04 
1.538E+04   1.815E+00  8.309E-04 
1.556E+04   1.799E+00  8.225E-04 
1.574E+04   1.784E+00  8.141E-04 
1.592E+04   1.768E+00  8.058E-04 
1.611E+04   1.753E+00  7.976E-04 
1.630E+04   1.737E+00  7.895E-04 
1.649E+04   1.722E+00  7.815E-04 
1.668E+04   1.707E+00  7.735E-04 
1.687E+04   1.692E+00  7.656E-04 
1.707E+04   1.677E+00  7.578E-04 
1.726E+04   1.662E+00  7.501E-04 
1.746E+04   1.648E+00  7.425E-04 
1.767E+04   1.633E+00  7.349E-04 
1.787E+04   1.619E+00  7.274E-04 
1.808E+04   1.605E+00  7.200E-04 
1.829E+04   1.591E+00  7.127E-04 
1.850E+04   1.577E+00  7.054E-04 
1.871E+04   1.563E+00  6.982E-04 
1.893E+04   1.549E+00  6.911E-04 
1.915E+04   1.536E+00  6.840E-04 
1.937E+04   1.522E+00  6.771E-04 
1.960E+04   1.509E+00  6.702E-04 
1.983E+04   1.495E+00  6.633E-04 
2.006E+04   1.482E+00  6.565E-04 
2.029E+04   1.469E+00  6.498E-04 
2.052E+04   1.456E+00  6.432E-04 
2.076E+04   1.443E+00  6.366E-04 
2.100E+04   1.431E+00  6.301E-04 
2.125E+04   1.418E+00  6.237E-04 
2.149E+04   1.405E+00  6.173E-04 
2.174E+04   1.393E+00  6.110E-04 
2.199E+04   1.381E+00  6.048E-04 
2.225E+04   1.369E+00  5.986E-04 
2.251E+04   1.357E+00  5.925E-04 
2.277E+04   1.345E+00  5.864E-04 
2.303E+04   1.333E+00  5.804E-04 
2.330E+04   1.321E+00  5.745E-04 
2.357E+04   1.309E+00  5.686E-04 
2.384E+04   1.298E+00  5.628E-04 
2.412E+04   1.286E+00  5.570E-04 
2.440E+04   1.275E+00  5.513E-04 
2.468E+04   1.264E+00  5.457E-04 
2.497E+04   1.252E+00  5.401E-04 
2.526E+04   1.241E+00  5.346E-04 
2.555E+04   1.230E+00  5.291E-04 
2.585E+04   1.219E+00  5.237E-04 
2.615E+04   1.209E+00  5.183E-04 
2.645E+04   1.198E+00  5.130E-04 
2.676E+04   1.187E+00  5.077E-04 
2.707E+04   1.177E+00  5.025E-04 
2.738E+04   1.166E+00  4.974E-04 
2.770E+04   1.156E+00  4.923E-04 
2.802E+04   1.146E+00  4.872E-04 
2.835E+04   1.136E+00  4.823E-04 
2.867E+04   1.126E+00  4.773E-04 
2.901E+04   1.116E+00  4.724E-04 
2.934E+04   1.106E+00  4.676E-04 
2.968E+04   1.096E+00  4.628E-04 
3.003E+04   1.086E+00  4.580E-04 
3.038E+04   1.077E+00  4.533E-04 
3.073E+04   1.067E+00  4.487E-04 
3.109E+04   1.058E+00  4.441E-04 
3.145E+04   1.048E+00  4.395E-04 
3.181E+04   1.039E+00  4.350E-04 
3.218E+04   1.030E+00  4.305E-04 
3.255E+04   1.021E+00  4.261E-04 
3.293E+04   1.012E+00  4.217E-04 
3.331E+04   1.003E+00  4.174E-04 
3.370E+04   9.940E-01  4.131E-04 
3.409E+04   9.852E-01  4.089E-04 
3.449E+04   9.765E-01  4.047E-04 
3.489E+04   9.679E-01  4.005E-04 
3.529E+04   9.593E-01  3.964E-04 
3.570E+04   9.509E-01  3.923E-04 
3.611E+04   9.424E-01  3.883E-04 
3.653E+04   9.341E-01  3.843E-04 
3.696E+04   9.259E-01  3.803E-04 
3.738E+04   9.177E-01  3.764E-04 
3.782E+04   9.096E-01  3.725E-04 
3.826E+04   9.015E-01  3.687E-04 
3.870E+04   8.936E-01  3.649E-04 
3.915E+04   8.857E-01  3.611E-04 
3.960E+04   8.779E-01  3.574E-04 
4.006E+04   8.701E-01  3.538E-04 
4.053E+04   8.625E-01  3.501E-04 
4.100E+04   8.549E-01  3.465E-04 
4.147E+04   8.473E-01  3.429E-04 
4.195E+04   8.399E-01  3.394E-04 
4.244E+04   8.325E-01  3.359E-04 
4.293E+04   8.251E-01  3.324E-04 
4.343E+04   8.179E-01  3.290E-04 
4.394E+04   8.107E-01  3.256E-04 
4.444E+04   8.035E-01  3.223E-04 
4.496E+04   7.965E-01  3.189E-04 
4.548E+04   7.895E-01  3.157E-04 
4.601E+04   7.825E-01  3.124E-04 
4.654E+04   7.756E-01  3.092E-04 
4.708E+04   7.688E-01  3.060E-04 
4.763E+04   7.621E-01  3.028E-04 
4.818E+04   7.554E-01  2.997E-04 
4.874E+04   7.488E-01  2.966E-04 
4.931E+04   7.422E-01  2.936E-04 
4.988E+04   7.357E-01  2.905E-04 
5.046E+04   7.293E-01  2.875E-04 
5.104E+04   7.229E-01  2.846E-04 
5.163E+04   7.165E-01  2.816E-04 
5.223E+04   7.103E-01  2.787E-04 
5.284E+04   7.041E-01  2.758E-04 
5.345E+04   6.979E-01  2.730E-04 
5.407E+04   6.918E-01  2.702E-04 
5.470E+04   6.858E-01  2.674E-04 
5.533E+04   6.798E-01  2.646E-04 
5.597E+04   6.739E-01  2.619E-04 
5.662E+04   6.680E-01  2.592E-04 
5.728E+04   6.622E-01  2.565E-04 
5.794E+04   6.564E-01  2.538E-04 
5.862E+04   6.507E-01  2.512E-04 
5.930E+04   6.451E-01  2.486E-04 
5.998E+04   6.395E-01  2.460E-04 
6.068E+04   6.339E-01  2.435E-04 
6.138E+04   6.284E-01  2.410E-04 
6.210E+04   6.230E-01  2.385E-04 
6.282E+04   6.176E-01  2.360E-04 
6.354E+04   6.122E-01  2.336E-04 
6.428E+04   6.069E-01  2.312E-04 
6.503E+04   6.017E-01  2.288E-04 
6.578E+04   5.965E-01  2.264E-04 
6.654E+04   5.914E-01  2.240E-04 
6.732E+04   5.863E-01  2.217E-04 
6.810E+04   5.812E-01  2.194E-04 
6.889E+04   5.762E-01  2.172E-04 
6.969E+04   5.713E-01  2.149E-04 
7.049E+04   5.663E-01  2.127E-04 
7.131E+04   5.615E-01  2.105E-04 
7.214E+04   5.567E-01  2.083E-04 
7.298E+04   5.519E-01  2.061E-04 
7.382E+04   5.472E-01  2.040E-04 
7.468E+04   5.425E-01  2.019E-04 
7.555E+04   5.379E-01  1.998E-04 
7.642E+04   5.333E-01  1.977E-04 
7.731E+04   5.287E-01  1.957E-04 
7.820E+04   5.242E-01  1.936E-04 
7.911E+04   5.198E-01  1.916E-04 
8.003E+04   5.154E-01  1.896E-04 
8.096E+04   5.110E-01  1.877E-04 
8.190E+04   5.066E-01  1.857E-04 
8.285E+04   5.024E-01  1.838E-04 
8.381E+04   4.981E-01  1.819E-04 
8.478E+04   4.939E-01  1.800E-04 
8.576E+04   4.897E-01  1.781E-04 
8.676E+04   4.856E-01  1.763E-04 
8.776E+04   4.815E-01  1.745E-04 
8.878E+04   4.775E-01  1.726E-04 
8.981E+04   4.735E-01  1.709E-04 
9.085E+04   4.695E-01  1.691E-04 
9.191E+04   4.656E-01  1.673E-04 
9.297E+04   4.617E-01  1.656E-04 
9.405E+04   4.578E-01  1.639E-04 
9.514E+04   4.540E-01  1.622E-04 
9.625E+04   4.502E-01  1.605E-04 
9.736E+04   4.465E-01  1.588E-04 
9.849E+04   4.427E-01  1.572E-04 
9.963E+04   4.391E-01  1.555E-04 
1.008E+05   4.354E-01  1.539E-04 
