Ion = Hydrogen    . Mass = 1.0079
Tgt = Bi (Solid). Density = 9.8 g/cm3
Stopping Units =  eV/(1E15 atoms/cm2)
Energy(keV)  S(Elec)    S(Nuc)
1.000E+00   9.595E+00  2.502E-01 
1.012E+00   9.650E+00  2.506E-01 
1.023E+00   9.706E+00  2.509E-01 
1.035E+00   9.762E+00  2.513E-01 
1.047E+00   9.819E+00  2.517E-01 
1.059E+00   9.876E+00  2.520E-01 
1.072E+00   9.933E+00  2.524E-01 
1.084E+00   9.990E+00  2.527E-01 
1.097E+00   1.005E+01  2.531E-01 
1.109E+00   1.011E+01  2.534E-01 
1.122E+00   1.016E+01  2.537E-01 
1.135E+00   1.022E+01  2.541E-01 
1.148E+00   1.028E+01  2.544E-01 
1.162E+00   1.034E+01  2.547E-01 
1.175E+00   1.040E+01  2.551E-01 
1.189E+00   1.046E+01  2.554E-01 
1.203E+00   1.052E+01  2.557E-01 
1.217E+00   1.058E+01  2.560E-01 
1.231E+00   1.064E+01  2.563E-01 
1.245E+00   1.071E+01  2.567E-01 
1.259E+00   1.077E+01  2.570E-01 
1.274E+00   1.083E+01  2.573E-01 
1.289E+00   1.089E+01  2.576E-01 
1.304E+00   1.096E+01  2.579E-01 
1.319E+00   1.102E+01  2.582E-01 
1.334E+00   1.108E+01  2.584E-01 
1.350E+00   1.115E+01  2.587E-01 
1.365E+00   1.121E+01  2.590E-01 
1.381E+00   1.128E+01  2.593E-01 
1.397E+00   1.134E+01  2.596E-01 
1.413E+00   1.141E+01  2.598E-01 
1.430E+00   1.147E+01  2.601E-01 
1.446E+00   1.154E+01  2.604E-01 
1.463E+00   1.161E+01  2.606E-01 
1.480E+00   1.167E+01  2.609E-01 
1.497E+00   1.174E+01  2.611E-01 
1.515E+00   1.181E+01  2.614E-01 
1.532E+00   1.188E+01  2.616E-01 
1.550E+00   1.195E+01  2.619E-01 
1.568E+00   1.201E+01  2.621E-01 
1.586E+00   1.208E+01  2.623E-01 
1.605E+00   1.215E+01  2.626E-01 
1.623E+00   1.222E+01  2.628E-01 
1.642E+00   1.229E+01  2.630E-01 
1.661E+00   1.237E+01  2.633E-01 
1.680E+00   1.244E+01  2.635E-01 
1.700E+00   1.251E+01  2.637E-01 
1.719E+00   1.258E+01  2.639E-01 
1.739E+00   1.265E+01  2.641E-01 
1.760E+00   1.273E+01  2.643E-01 
1.780E+00   1.280E+01  2.645E-01 
1.801E+00   1.288E+01  2.647E-01 
1.822E+00   1.295E+01  2.649E-01 
1.843E+00   1.302E+01  2.650E-01 
1.864E+00   1.310E+01  2.652E-01 
1.886E+00   1.318E+01  2.654E-01 
1.908E+00   1.325E+01  2.656E-01 
1.930E+00   1.333E+01  2.657E-01 
1.952E+00   1.341E+01  2.659E-01 
1.975E+00   1.348E+01  2.661E-01 
1.998E+00   1.356E+01  2.662E-01 
2.021E+00   1.364E+01  2.664E-01 
2.044E+00   1.372E+01  2.665E-01 
2.068E+00   1.379E+01  2.667E-01 
2.092E+00   1.387E+01  2.668E-01 
2.116E+00   1.395E+01  2.669E-01 
2.141E+00   1.403E+01  2.671E-01 
2.166E+00   1.411E+01  2.672E-01 
2.191E+00   1.418E+01  2.673E-01 
2.216E+00   1.426E+01  2.674E-01 
2.242E+00   1.434E+01  2.675E-01 
2.268E+00   1.442E+01  2.676E-01 
2.294E+00   1.451E+01  2.677E-01 
2.321E+00   1.459E+01  2.678E-01 
2.348E+00   1.467E+01  2.679E-01 
2.375E+00   1.475E+01  2.680E-01 
2.402E+00   1.483E+01  2.681E-01 
2.430E+00   1.492E+01  2.682E-01 
2.458E+00   1.500E+01  2.683E-01 
2.487E+00   1.509E+01  2.683E-01 
2.516E+00   1.517E+01  2.684E-01 
2.545E+00   1.526E+01  2.685E-01 
2.574E+00   1.534E+01  2.685E-01 
2.604E+00   1.543E+01  2.686E-01 
2.635E+00   1.551E+01  2.686E-01 
2.665E+00   1.560E+01  2.687E-01 
2.696E+00   1.569E+01  2.687E-01 
2.727E+00   1.578E+01  2.688E-01 
2.759E+00   1.586E+01  2.688E-01 
2.791E+00   1.595E+01  2.688E-01 
2.823E+00   1.604E+01  2.688E-01 
2.856E+00   1.613E+01  2.688E-01 
2.889E+00   1.622E+01  2.689E-01 
2.923E+00   1.631E+01  2.689E-01 
2.957E+00   1.641E+01  2.689E-01 
2.991E+00   1.650E+01  2.689E-01 
3.026E+00   1.659E+01  2.688E-01 
3.061E+00   1.668E+01  2.688E-01 
3.096E+00   1.678E+01  2.688E-01 
3.132E+00   1.687E+01  2.688E-01 
3.168E+00   1.697E+01  2.688E-01 
3.205E+00   1.706E+01  2.687E-01 
3.242E+00   1.716E+01  2.687E-01 
3.280E+00   1.725E+01  2.687E-01 
3.318E+00   1.735E+01  2.686E-01 
3.356E+00   1.744E+01  2.686E-01 
3.395E+00   1.754E+01  2.685E-01 
3.435E+00   1.764E+01  2.684E-01 
3.475E+00   1.774E+01  2.684E-01 
3.515E+00   1.784E+01  2.683E-01 
3.556E+00   1.794E+01  2.682E-01 
3.597E+00   1.804E+01  2.681E-01 
3.639E+00   1.814E+01  2.680E-01 
3.681E+00   1.824E+01  2.679E-01 
3.724E+00   1.834E+01  2.678E-01 
3.767E+00   1.844E+01  2.677E-01 
3.810E+00   1.855E+01  2.676E-01 
3.855E+00   1.865E+01  2.675E-01 
3.899E+00   1.875E+01  2.674E-01 
3.945E+00   1.886E+01  2.673E-01 
3.990E+00   1.896E+01  2.671E-01 
4.037E+00   1.907E+01  2.670E-01 
4.083E+00   1.918E+01  2.669E-01 
4.131E+00   1.928E+01  2.667E-01 
4.179E+00   1.939E+01  2.666E-01 
4.227E+00   1.950E+01  2.664E-01 
4.276E+00   1.961E+01  2.663E-01 
4.326E+00   1.971E+01  2.661E-01 
4.376E+00   1.982E+01  2.659E-01 
4.427E+00   1.993E+01  2.657E-01 
4.478E+00   2.004E+01  2.656E-01 
4.530E+00   2.015E+01  2.654E-01 
4.583E+00   2.027E+01  2.652E-01 
4.636E+00   2.038E+01  2.650E-01 
4.690E+00   2.049E+01  2.648E-01 
4.744E+00   2.060E+01  2.646E-01 
4.799E+00   2.072E+01  2.644E-01 
4.855E+00   2.083E+01  2.641E-01 
4.911E+00   2.095E+01  2.639E-01 
4.968E+00   2.106E+01  2.637E-01 
5.026E+00   2.118E+01  2.634E-01 
5.084E+00   2.130E+01  2.632E-01 
5.143E+00   2.141E+01  2.630E-01 
5.202E+00   2.153E+01  2.627E-01 
5.263E+00   2.165E+01  2.625E-01 
5.324E+00   2.177E+01  2.622E-01 
5.386E+00   2.189E+01  2.619E-01 
5.448E+00   2.201E+01  2.617E-01 
5.511E+00   2.213E+01  2.614E-01 
5.575E+00   2.225E+01  2.611E-01 
5.640E+00   2.237E+01  2.608E-01 
5.705E+00   2.249E+01  2.605E-01 
5.771E+00   2.262E+01  2.602E-01 
5.838E+00   2.274E+01  2.599E-01 
5.906E+00   2.287E+01  2.596E-01 
5.975E+00   2.299E+01  2.593E-01 
6.044E+00   2.311E+01  2.590E-01 
6.114E+00   2.324E+01  2.586E-01 
6.185E+00   2.337E+01  2.583E-01 
6.257E+00   2.349E+01  2.580E-01 
6.329E+00   2.362E+01  2.576E-01 
6.403E+00   2.375E+01  2.573E-01 
6.477E+00   2.388E+01  2.569E-01 
6.552E+00   2.401E+01  2.566E-01 
6.628E+00   2.414E+01  2.562E-01 
6.705E+00   2.427E+01  2.558E-01 
6.783E+00   2.440E+01  2.555E-01 
6.861E+00   2.453E+01  2.551E-01 
6.941E+00   2.466E+01  2.547E-01 
7.021E+00   2.479E+01  2.543E-01 
7.103E+00   2.493E+01  2.539E-01 
7.185E+00   2.506E+01  2.535E-01 
7.269E+00   2.519E+01  2.531E-01 
7.353E+00   2.533E+01  2.527E-01 
7.438E+00   2.546E+01  2.523E-01 
7.524E+00   2.560E+01  2.519E-01 
7.612E+00   2.574E+01  2.514E-01 
7.700E+00   2.587E+01  2.510E-01 
7.789E+00   2.601E+01  2.506E-01 
7.880E+00   2.615E+01  2.501E-01 
7.971E+00   2.629E+01  2.497E-01 
8.064E+00   2.642E+01  2.492E-01 
8.157E+00   2.656E+01  2.488E-01 
8.252E+00   2.670E+01  2.483E-01 
8.347E+00   2.684E+01  2.478E-01 
8.444E+00   2.698E+01  2.474E-01 
8.542E+00   2.713E+01  2.469E-01 
8.641E+00   2.727E+01  2.464E-01 
8.741E+00   2.741E+01  2.459E-01 
8.843E+00   2.755E+01  2.454E-01 
8.945E+00   2.769E+01  2.449E-01 
9.049E+00   2.784E+01  2.444E-01 
9.154E+00   2.798E+01  2.439E-01 
9.260E+00   2.813E+01  2.434E-01 
9.368E+00   2.827E+01  2.429E-01 
9.476E+00   2.842E+01  2.424E-01 
9.586E+00   2.856E+01  2.419E-01 
9.698E+00   2.871E+01  2.413E-01 
9.810E+00   2.886E+01  2.408E-01 
9.924E+00   2.900E+01  2.403E-01 
1.004E+01   2.915E+01  2.397E-01 
1.016E+01   2.930E+01  2.392E-01 
1.027E+01   2.945E+01  2.386E-01 
1.039E+01   2.959E+01  2.380E-01 
1.051E+01   2.974E+01  2.375E-01 
1.063E+01   2.989E+01  2.369E-01 
1.076E+01   3.004E+01  2.363E-01 
1.088E+01   3.019E+01  2.358E-01 
1.101E+01   3.034E+01  2.352E-01 
1.114E+01   3.049E+01  2.346E-01 
1.127E+01   3.064E+01  2.340E-01 
1.140E+01   3.079E+01  2.334E-01 
1.153E+01   3.095E+01  2.328E-01 
1.166E+01   3.110E+01  2.322E-01 
1.180E+01   3.125E+01  2.316E-01 
1.193E+01   3.140E+01  2.310E-01 
1.207E+01   3.155E+01  2.304E-01 
1.221E+01   3.171E+01  2.298E-01 
1.235E+01   3.186E+01  2.292E-01 
1.250E+01   3.201E+01  2.285E-01 
1.264E+01   3.217E+01  2.279E-01 
1.279E+01   3.232E+01  2.273E-01 
1.294E+01   3.247E+01  2.266E-01 
1.309E+01   3.263E+01  2.260E-01 
1.324E+01   3.278E+01  2.253E-01 
1.339E+01   3.293E+01  2.247E-01 
1.355E+01   3.309E+01  2.240E-01 
1.371E+01   3.324E+01  2.234E-01 
1.387E+01   3.340E+01  2.227E-01 
1.403E+01   3.355E+01  2.221E-01 
1.419E+01   3.371E+01  2.214E-01 
1.435E+01   3.386E+01  2.207E-01 
1.452E+01   3.402E+01  2.200E-01 
1.469E+01   3.417E+01  2.194E-01 
1.486E+01   3.433E+01  2.187E-01 
1.503E+01   3.448E+01  2.180E-01 
1.521E+01   3.464E+01  2.173E-01 
1.538E+01   3.479E+01  2.166E-01 
1.556E+01   3.494E+01  2.159E-01 
1.574E+01   3.510E+01  2.152E-01 
1.592E+01   3.525E+01  2.145E-01 
1.611E+01   3.541E+01  2.138E-01 
1.629E+01   3.556E+01  2.131E-01 
1.648E+01   3.572E+01  2.124E-01 
1.667E+01   3.587E+01  2.117E-01 
1.687E+01   3.603E+01  2.110E-01 
1.706E+01   3.618E+01  2.102E-01 
1.726E+01   3.633E+01  2.095E-01 
1.746E+01   3.649E+01  2.088E-01 
1.766E+01   3.664E+01  2.081E-01 
1.787E+01   3.679E+01  2.073E-01 
1.808E+01   3.695E+01  2.066E-01 
1.829E+01   3.710E+01  2.059E-01 
1.850E+01   3.725E+01  2.051E-01 
1.871E+01   3.740E+01  2.044E-01 
1.893E+01   3.756E+01  2.036E-01 
1.915E+01   3.771E+01  2.029E-01 
1.937E+01   3.786E+01  2.022E-01 
1.960E+01   3.801E+01  2.014E-01 
1.982E+01   3.816E+01  2.006E-01 
2.005E+01   3.831E+01  1.999E-01 
2.029E+01   3.846E+01  1.991E-01 
2.052E+01   3.861E+01  1.984E-01 
2.076E+01   3.876E+01  1.976E-01 
2.100E+01   3.891E+01  1.969E-01 
2.124E+01   3.906E+01  1.961E-01 
2.149E+01   3.921E+01  1.953E-01 
2.174E+01   3.936E+01  1.946E-01 
2.199E+01   3.951E+01  1.938E-01 
2.225E+01   3.965E+01  1.930E-01 
2.250E+01   3.980E+01  1.922E-01 
2.277E+01   3.995E+01  1.915E-01 
2.303E+01   4.009E+01  1.907E-01 
2.330E+01   4.024E+01  1.899E-01 
2.357E+01   4.039E+01  1.891E-01 
2.384E+01   4.053E+01  1.883E-01 
2.412E+01   4.067E+01  1.876E-01 
2.440E+01   4.082E+01  1.868E-01 
2.468E+01   4.096E+01  1.860E-01 
2.497E+01   4.110E+01  1.852E-01 
2.526E+01   4.125E+01  1.844E-01 
2.555E+01   4.139E+01  1.836E-01 
2.584E+01   4.153E+01  1.828E-01 
2.614E+01   4.167E+01  1.820E-01 
2.645E+01   4.181E+01  1.813E-01 
2.675E+01   4.195E+01  1.805E-01 
2.707E+01   4.209E+01  1.797E-01 
2.738E+01   4.223E+01  1.789E-01 
2.770E+01   4.237E+01  1.781E-01 
2.802E+01   4.251E+01  1.773E-01 
2.834E+01   4.264E+01  1.765E-01 
2.867E+01   4.278E+01  1.757E-01 
2.900E+01   4.292E+01  1.749E-01 
2.934E+01   4.305E+01  1.741E-01 
2.968E+01   4.319E+01  1.733E-01 
3.003E+01   4.332E+01  1.725E-01 
3.037E+01   4.345E+01  1.717E-01 
3.073E+01   4.359E+01  1.709E-01 
3.108E+01   4.372E+01  1.701E-01 
3.144E+01   4.385E+01  1.693E-01 
3.181E+01   4.398E+01  1.685E-01 
3.218E+01   4.411E+01  1.677E-01 
3.255E+01   4.424E+01  1.669E-01 
3.293E+01   4.437E+01  1.661E-01 
3.331E+01   4.450E+01  1.653E-01 
3.370E+01   4.463E+01  1.645E-01 
3.409E+01   4.476E+01  1.637E-01 
3.448E+01   4.488E+01  1.629E-01 
3.488E+01   4.501E+01  1.621E-01 
3.529E+01   4.514E+01  1.613E-01 
3.570E+01   4.526E+01  1.605E-01 
3.611E+01   4.538E+01  1.597E-01 
3.653E+01   4.551E+01  1.589E-01 
3.695E+01   4.563E+01  1.581E-01 
3.738E+01   4.575E+01  1.573E-01 
3.781E+01   4.587E+01  1.565E-01 
3.825E+01   4.599E+01  1.557E-01 
3.870E+01   4.611E+01  1.549E-01 
3.915E+01   4.623E+01  1.541E-01 
3.960E+01   4.635E+01  1.533E-01 
4.006E+01   4.647E+01  1.525E-01 
4.052E+01   4.658E+01  1.517E-01 
4.099E+01   4.670E+01  1.509E-01 
4.147E+01   4.681E+01  1.501E-01 
4.195E+01   4.693E+01  1.493E-01 
4.244E+01   4.704E+01  1.485E-01 
4.293E+01   4.715E+01  1.477E-01 
4.343E+01   4.726E+01  1.470E-01 
4.393E+01   4.737E+01  1.462E-01 
4.444E+01   4.748E+01  1.454E-01 
4.496E+01   4.759E+01  1.446E-01 
4.548E+01   4.770E+01  1.438E-01 
4.600E+01   4.780E+01  1.430E-01 
4.654E+01   4.791E+01  1.422E-01 
4.708E+01   4.801E+01  1.415E-01 
4.762E+01   4.812E+01  1.407E-01 
4.818E+01   4.822E+01  1.399E-01 
4.873E+01   4.832E+01  1.391E-01 
4.930E+01   4.842E+01  1.383E-01 
4.987E+01   4.852E+01  1.376E-01 
5.045E+01   4.862E+01  1.368E-01 
5.104E+01   4.871E+01  1.360E-01 
5.163E+01   4.881E+01  1.353E-01 
5.223E+01   4.891E+01  1.345E-01 
5.283E+01   4.900E+01  1.337E-01 
5.344E+01   4.909E+01  1.330E-01 
5.406E+01   4.918E+01  1.322E-01 
5.469E+01   4.927E+01  1.314E-01 
5.533E+01   4.936E+01  1.307E-01 
5.597E+01   4.945E+01  1.299E-01 
5.662E+01   4.954E+01  1.292E-01 
5.727E+01   4.962E+01  1.284E-01 
5.794E+01   4.970E+01  1.277E-01 
5.861E+01   4.979E+01  1.269E-01 
5.929E+01   4.987E+01  1.262E-01 
5.998E+01   4.995E+01  1.254E-01 
6.067E+01   5.002E+01  1.247E-01 
6.138E+01   5.010E+01  1.239E-01 
6.209E+01   5.018E+01  1.232E-01 
6.281E+01   5.025E+01  1.224E-01 
6.354E+01   5.032E+01  1.217E-01 
6.427E+01   5.039E+01  1.210E-01 
6.502E+01   5.046E+01  1.202E-01 
6.577E+01   5.053E+01  1.195E-01 
6.654E+01   5.060E+01  1.188E-01 
6.731E+01   5.066E+01  1.180E-01 
6.809E+01   5.072E+01  1.173E-01 
6.888E+01   5.079E+01  1.166E-01 
6.968E+01   5.084E+01  1.159E-01 
7.049E+01   5.090E+01  1.152E-01 
7.130E+01   5.096E+01  1.144E-01 
7.213E+01   5.101E+01  1.137E-01 
7.297E+01   5.107E+01  1.130E-01 
7.381E+01   5.112E+01  1.123E-01 
7.467E+01   5.117E+01  1.116E-01 
7.554E+01   5.121E+01  1.109E-01 
7.641E+01   5.126E+01  1.102E-01 
7.730E+01   5.130E+01  1.095E-01 
7.820E+01   5.135E+01  1.088E-01 
7.910E+01   5.139E+01  1.081E-01 
8.002E+01   5.143E+01  1.074E-01 
8.095E+01   5.146E+01  1.067E-01 
8.189E+01   5.150E+01  1.060E-01 
8.284E+01   5.153E+01  1.054E-01 
8.380E+01   5.156E+01  1.047E-01 
8.477E+01   5.159E+01  1.040E-01 
8.575E+01   5.162E+01  1.033E-01 
8.675E+01   5.164E+01  1.026E-01 
8.775E+01   5.166E+01  1.020E-01 
8.877E+01   5.168E+01  1.013E-01 
8.980E+01   5.170E+01  1.006E-01 
9.084E+01   5.172E+01  9.998E-02 
9.190E+01   5.173E+01  9.932E-02 
9.296E+01   5.174E+01  9.866E-02 
9.404E+01   5.176E+01  9.801E-02 
9.513E+01   5.176E+01  9.735E-02 
9.624E+01   5.177E+01  9.670E-02 
9.735E+01   5.177E+01  9.606E-02 
9.848E+01   5.177E+01  9.541E-02 
9.962E+01   5.177E+01  9.477E-02 
1.008E+02   5.177E+01  9.413E-02 
1.019E+02   5.177E+01  9.350E-02 
1.031E+02   5.176E+01  9.286E-02 
1.043E+02   5.175E+01  9.223E-02 
1.055E+02   5.174E+01  9.161E-02 
1.068E+02   5.173E+01  9.098E-02 
1.080E+02   5.171E+01  9.036E-02 
1.093E+02   5.169E+01  8.974E-02 
1.105E+02   5.167E+01  8.912E-02 
1.118E+02   5.165E+01  8.851E-02 
1.131E+02   5.162E+01  8.790E-02 
1.144E+02   5.160E+01  8.729E-02 
1.157E+02   5.157E+01  8.669E-02 
1.171E+02   5.153E+01  8.608E-02 
1.184E+02   5.150E+01  8.548E-02 
1.198E+02   5.146E+01  8.489E-02 
1.212E+02   5.142E+01  8.429E-02 
1.226E+02   5.138E+01  8.370E-02 
1.240E+02   5.134E+01  8.311E-02 
1.255E+02   5.129E+01  8.253E-02 
1.269E+02   5.125E+01  8.195E-02 
1.284E+02   5.120E+01  8.137E-02 
1.299E+02   5.114E+01  8.079E-02 
1.314E+02   5.109E+01  8.022E-02 
1.329E+02   5.103E+01  7.965E-02 
1.345E+02   5.097E+01  7.908E-02 
1.360E+02   5.091E+01  7.851E-02 
1.376E+02   5.085E+01  7.795E-02 
1.392E+02   5.078E+01  7.739E-02 
1.408E+02   5.071E+01  7.684E-02 
1.424E+02   5.064E+01  7.628E-02 
1.441E+02   5.057E+01  7.573E-02 
1.458E+02   5.049E+01  7.519E-02 
1.475E+02   5.041E+01  7.464E-02 
1.492E+02   5.033E+01  7.410E-02 
1.509E+02   5.025E+01  7.356E-02 
1.526E+02   5.017E+01  7.302E-02 
1.544E+02   5.008E+01  7.249E-02 
1.562E+02   4.999E+01  7.196E-02 
1.580E+02   4.990E+01  7.143E-02 
1.598E+02   4.981E+01  7.091E-02 
1.617E+02   4.971E+01  7.039E-02 
1.636E+02   4.961E+01  6.987E-02 
1.655E+02   4.951E+01  6.935E-02 
1.674E+02   4.941E+01  6.884E-02 
1.693E+02   4.931E+01  6.833E-02 
1.713E+02   4.920E+01  6.782E-02 
1.733E+02   4.909E+01  6.732E-02 
1.753E+02   4.898E+01  6.682E-02 
1.773E+02   4.887E+01  6.632E-02 
1.794E+02   4.876E+01  6.582E-02 
1.815E+02   4.864E+01  6.533E-02 
1.836E+02   4.852E+01  6.484E-02 
1.857E+02   4.840E+01  6.435E-02 
1.879E+02   4.828E+01  6.387E-02 
1.900E+02   4.815E+01  6.339E-02 
1.922E+02   4.803E+01  6.291E-02 
1.945E+02   4.790E+01  6.243E-02 
1.967E+02   4.777E+01  6.196E-02 
1.990E+02   4.764E+01  6.149E-02 
2.013E+02   4.750E+01  6.102E-02 
2.036E+02   4.737E+01  6.055E-02 
2.060E+02   4.723E+01  6.009E-02 
2.084E+02   4.709E+01  5.963E-02 
2.108E+02   4.695E+01  5.918E-02 
2.133E+02   4.680E+01  5.872E-02 
2.157E+02   4.666E+01  5.827E-02 
2.182E+02   4.651E+01  5.782E-02 
2.208E+02   4.636E+01  5.738E-02 
2.233E+02   4.621E+01  5.694E-02 
2.259E+02   4.606E+01  5.650E-02 
2.285E+02   4.591E+01  5.606E-02 
2.312E+02   4.575E+01  5.562E-02 
2.339E+02   4.560E+01  5.519E-02 
2.366E+02   4.544E+01  5.476E-02 
2.393E+02   4.528E+01  5.434E-02 
2.421E+02   4.512E+01  5.391E-02 
2.449E+02   4.495E+01  5.349E-02 
2.478E+02   4.479E+01  5.307E-02 
2.506E+02   4.462E+01  5.266E-02 
2.535E+02   4.446E+01  5.225E-02 
2.565E+02   4.429E+01  5.184E-02 
2.595E+02   4.412E+01  5.143E-02 
2.625E+02   4.395E+01  5.102E-02 
2.655E+02   4.378E+01  5.062E-02 
2.686E+02   4.360E+01  5.022E-02 
2.717E+02   4.343E+01  4.982E-02 
2.749E+02   4.325E+01  4.943E-02 
2.780E+02   4.308E+01  4.904E-02 
2.813E+02   4.290E+01  4.865E-02 
2.845E+02   4.272E+01  4.826E-02 
2.878E+02   4.254E+01  4.788E-02 
2.912E+02   4.236E+01  5.057E-02 
2.945E+02   4.217E+01  5.016E-02 
2.980E+02   4.199E+01  4.975E-02 
3.014E+02   4.180E+01  4.934E-02 
3.049E+02   4.162E+01  4.894E-02 
3.085E+02   4.143E+01  4.854E-02 
3.120E+02   4.125E+01  4.815E-02 
3.156E+02   4.106E+01  4.775E-02 
3.193E+02   4.087E+01  4.736E-02 
3.230E+02   4.068E+01  4.697E-02 
3.268E+02   4.049E+01  4.659E-02 
3.306E+02   4.030E+01  4.620E-02 
3.344E+02   4.010E+01  4.582E-02 
3.383E+02   3.991E+01  4.544E-02 
3.422E+02   3.972E+01  4.507E-02 
3.462E+02   3.952E+01  4.470E-02 
3.502E+02   3.933E+01  4.432E-02 
3.542E+02   3.913E+01  4.396E-02 
3.583E+02   3.894E+01  4.359E-02 
3.625E+02   3.874E+01  4.323E-02 
3.667E+02   3.854E+01  4.287E-02 
3.710E+02   3.834E+01  4.251E-02 
3.753E+02   3.815E+01  4.216E-02 
3.796E+02   3.795E+01  4.181E-02 
3.840E+02   3.775E+01  4.146E-02 
3.885E+02   3.755E+01  4.111E-02 
3.930E+02   3.735E+01  4.077E-02 
3.975E+02   3.715E+01  4.042E-02 
4.021E+02   3.695E+01  4.008E-02 
4.068E+02   3.675E+01  3.975E-02 
4.115E+02   3.655E+01  3.941E-02 
4.163E+02   3.635E+01  3.908E-02 
4.211E+02   3.614E+01  3.875E-02 
4.260E+02   3.594E+01  3.842E-02 
4.310E+02   3.574E+01  3.810E-02 
4.360E+02   3.554E+01  3.778E-02 
4.410E+02   3.534E+01  3.745E-02 
4.461E+02   3.513E+01  3.714E-02 
4.513E+02   3.493E+01  3.682E-02 
4.565E+02   3.473E+01  3.651E-02 
4.618E+02   3.453E+01  3.620E-02 
4.672E+02   3.432E+01  3.589E-02 
4.726E+02   3.412E+01  3.558E-02 
4.781E+02   3.392E+01  3.528E-02 
4.836E+02   3.372E+01  3.498E-02 
4.892E+02   3.352E+01  3.468E-02 
4.949E+02   3.331E+01  3.438E-02 
5.007E+02   3.311E+01  3.409E-02 
5.065E+02   3.291E+01  3.380E-02 
5.123E+02   3.271E+01  3.350E-02 
5.183E+02   3.251E+01  3.322E-02 
5.243E+02   3.231E+01  3.293E-02 
5.304E+02   3.211E+01  3.265E-02 
5.365E+02   3.190E+01  3.237E-02 
5.428E+02   3.170E+01  3.209E-02 
5.490E+02   3.150E+01  3.181E-02 
5.554E+02   3.130E+01  3.153E-02 
5.619E+02   3.110E+01  3.126E-02 
5.684E+02   3.090E+01  3.099E-02 
5.750E+02   3.071E+01  3.072E-02 
5.816E+02   3.051E+01  3.046E-02 
5.884E+02   3.031E+01  3.019E-02 
5.952E+02   3.011E+01  2.993E-02 
6.021E+02   2.991E+01  2.967E-02 
6.091E+02   2.972E+01  2.941E-02 
6.162E+02   2.952E+01  2.915E-02 
6.233E+02   2.932E+01  2.890E-02 
6.305E+02   2.913E+01  2.865E-02 
6.378E+02   2.893E+01  2.840E-02 
6.452E+02   2.874E+01  2.815E-02 
6.527E+02   2.855E+01  2.790E-02 
6.603E+02   2.835E+01  2.766E-02 
6.680E+02   2.816E+01  2.741E-02 
6.757E+02   2.797E+01  2.717E-02 
6.835E+02   2.777E+01  2.694E-02 
6.915E+02   2.758E+01  2.670E-02 
6.995E+02   2.739E+01  2.646E-02 
7.076E+02   2.720E+01  2.623E-02 
7.158E+02   2.701E+01  2.600E-02 
7.241E+02   2.682E+01  2.577E-02 
7.325E+02   2.664E+01  2.554E-02 
7.410E+02   2.645E+01  2.532E-02 
7.496E+02   2.626E+01  2.509E-02 
7.583E+02   2.608E+01  2.487E-02 
7.671E+02   2.589E+01  2.465E-02 
7.760E+02   2.571E+01  2.443E-02 
7.850E+02   2.552E+01  2.422E-02 
7.941E+02   2.534E+01  2.400E-02 
8.033E+02   2.516E+01  2.379E-02 
8.126E+02   2.497E+01  2.358E-02 
8.221E+02   2.479E+01  2.337E-02 
8.316E+02   2.461E+01  2.316E-02 
8.412E+02   2.443E+01  2.295E-02 
8.510E+02   2.425E+01  2.275E-02 
8.609E+02   2.408E+01  2.255E-02 
8.709E+02   2.390E+01  2.234E-02 
8.810E+02   2.372E+01  2.214E-02 
8.912E+02   2.355E+01  2.195E-02 
9.015E+02   2.337E+01  2.175E-02 
9.120E+02   2.320E+01  2.156E-02 
9.225E+02   2.302E+01  2.136E-02 
9.332E+02   2.285E+01  2.117E-02 
9.441E+02   2.268E+01  2.098E-02 
9.550E+02   2.251E+01  2.079E-02 
9.661E+02   2.234E+01  2.061E-02 
9.773E+02   2.217E+01  2.042E-02 
9.886E+02   2.200E+01  2.024E-02 
1.000E+03   2.183E+01  2.005E-02 
1.012E+03   2.169E+01  1.987E-02 
1.023E+03   2.160E+01  1.969E-02 
1.035E+03   2.151E+01  1.952E-02 
1.047E+03   2.142E+01  1.934E-02 
1.059E+03   2.133E+01  1.917E-02 
1.072E+03   2.124E+01  1.899E-02 
1.084E+03   2.114E+01  1.882E-02 
1.097E+03   2.105E+01  1.865E-02 
1.109E+03   2.095E+01  1.848E-02 
1.122E+03   2.086E+01  1.831E-02 
1.135E+03   2.076E+01  1.815E-02 
1.149E+03   2.066E+01  1.798E-02 
1.162E+03   2.056E+01  1.782E-02 
1.175E+03   2.046E+01  1.766E-02 
1.189E+03   2.035E+01  1.750E-02 
1.203E+03   2.025E+01  1.734E-02 
1.217E+03   2.014E+01  1.718E-02 
1.231E+03   2.004E+01  1.702E-02 
1.245E+03   1.994E+01  1.687E-02 
1.260E+03   1.984E+01  1.671E-02 
1.274E+03   1.973E+01  1.656E-02 
1.289E+03   1.963E+01  1.641E-02 
1.304E+03   1.952E+01  1.626E-02 
1.319E+03   1.942E+01  1.611E-02 
1.334E+03   1.931E+01  1.597E-02 
1.350E+03   1.921E+01  1.582E-02 
1.365E+03   1.910E+01  1.567E-02 
1.381E+03   1.900E+01  1.553E-02 
1.397E+03   1.889E+01  1.539E-02 
1.414E+03   1.879E+01  1.525E-02 
1.430E+03   1.869E+01  1.511E-02 
1.446E+03   1.858E+01  1.497E-02 
1.463E+03   1.848E+01  1.483E-02 
1.480E+03   1.837E+01  1.469E-02 
1.497E+03   1.827E+01  1.456E-02 
1.515E+03   1.816E+01  1.442E-02 
1.532E+03   1.806E+01  1.429E-02 
1.550E+03   1.795E+01  1.416E-02 
1.568E+03   1.785E+01  1.403E-02 
1.586E+03   1.775E+01  1.390E-02 
1.605E+03   1.764E+01  1.377E-02 
1.623E+03   1.754E+01  1.364E-02 
1.642E+03   1.744E+01  1.352E-02 
1.661E+03   1.734E+01  1.339E-02 
1.680E+03   1.723E+01  1.327E-02 
1.700E+03   1.713E+01  1.315E-02 
1.720E+03   1.703E+01  1.303E-02 
1.740E+03   1.693E+01  1.290E-02 
1.760E+03   1.683E+01  1.278E-02 
1.780E+03   1.673E+01  1.267E-02 
1.801E+03   1.663E+01  1.255E-02 
1.822E+03   1.653E+01  1.243E-02 
1.843E+03   1.643E+01  1.232E-02 
1.864E+03   1.633E+01  1.220E-02 
1.886E+03   1.623E+01  1.209E-02 
1.908E+03   1.613E+01  1.198E-02 
1.930E+03   1.604E+01  1.186E-02 
1.952E+03   1.594E+01  1.175E-02 
1.975E+03   1.584E+01  1.164E-02 
1.998E+03   1.575E+01  1.154E-02 
2.021E+03   1.565E+01  1.143E-02 
2.044E+03   1.555E+01  1.132E-02 
2.068E+03   1.546E+01  1.122E-02 
2.092E+03   1.537E+01  1.111E-02 
2.116E+03   1.527E+01  1.101E-02 
2.141E+03   1.518E+01  1.090E-02 
2.166E+03   1.508E+01  1.080E-02 
2.191E+03   1.499E+01  1.070E-02 
2.216E+03   1.490E+01  1.060E-02 
2.242E+03   1.481E+01  1.050E-02 
2.268E+03   1.471E+01  1.040E-02 
2.294E+03   1.462E+01  1.031E-02 
2.321E+03   1.453E+01  1.021E-02 
2.348E+03   1.444E+01  1.011E-02 
2.375E+03   1.435E+01  1.002E-02 
2.403E+03   1.426E+01  9.924E-03 
2.431E+03   1.417E+01  9.831E-03 
2.459E+03   1.409E+01  9.738E-03 
2.487E+03   1.400E+01  9.647E-03 
2.516E+03   1.391E+01  9.556E-03 
2.545E+03   1.382E+01  9.466E-03 
2.575E+03   1.374E+01  9.377E-03 
2.605E+03   1.365E+01  9.288E-03 
2.635E+03   1.356E+01  9.201E-03 
2.665E+03   1.348E+01  9.114E-03 
2.696E+03   1.339E+01  9.028E-03 
2.728E+03   1.331E+01  8.943E-03 
2.759E+03   1.322E+01  8.858E-03 
2.791E+03   1.314E+01  8.775E-03 
2.824E+03   1.306E+01  8.692E-03 
2.856E+03   1.297E+01  8.609E-03 
2.889E+03   1.289E+01  8.528E-03 
2.923E+03   1.281E+01  8.447E-03 
2.957E+03   1.273E+01  8.367E-03 
2.991E+03   1.265E+01  8.288E-03 
3.026E+03   1.256E+01  8.209E-03 
3.061E+03   1.248E+01  8.131E-03 
3.097E+03   1.240E+01  8.054E-03 
3.132E+03   1.232E+01  7.978E-03 
3.169E+03   1.225E+01  7.902E-03 
3.206E+03   1.217E+01  7.827E-03 
3.243E+03   1.209E+01  7.753E-03 
3.280E+03   1.201E+01  7.679E-03 
3.318E+03   1.193E+01  7.606E-03 
3.357E+03   1.186E+01  7.534E-03 
3.396E+03   1.178E+01  7.462E-03 
3.435E+03   1.170E+01  7.391E-03 
3.475E+03   1.163E+01  7.320E-03 
3.515E+03   1.155E+01  7.251E-03 
3.556E+03   1.148E+01  7.182E-03 
3.597E+03   1.140E+01  7.113E-03 
3.639E+03   1.133E+01  7.045E-03 
3.681E+03   1.125E+01  6.978E-03 
3.724E+03   1.118E+01  6.911E-03 
3.767E+03   1.110E+01  6.845E-03 
3.811E+03   1.103E+01  6.780E-03 
3.855E+03   1.096E+01  6.715E-03 
3.900E+03   1.089E+01  6.651E-03 
3.945E+03   1.082E+01  6.587E-03 
3.991E+03   1.074E+01  6.524E-03 
4.037E+03   1.067E+01  6.462E-03 
4.084E+03   1.060E+01  6.400E-03 
4.131E+03   1.053E+01  6.339E-03 
4.179E+03   1.046E+01  6.278E-03 
4.228E+03   1.039E+01  6.218E-03 
4.277E+03   1.032E+01  6.158E-03 
4.326E+03   1.025E+01  6.099E-03 
4.376E+03   1.019E+01  6.040E-03 
4.427E+03   1.012E+01  5.982E-03 
4.479E+03   1.005E+01  5.925E-03 
4.531E+03   9.982E+00  5.868E-03 
4.583E+03   9.914E+00  5.812E-03 
4.636E+03   9.848E+00  5.756E-03 
4.690E+03   9.781E+00  5.700E-03 
4.744E+03   9.715E+00  5.645E-03 
4.799E+03   9.649E+00  5.591E-03 
4.855E+03   9.584E+00  5.537E-03 
4.911E+03   9.519E+00  5.484E-03 
4.968E+03   9.454E+00  5.431E-03 
5.026E+03   9.390E+00  5.379E-03 
5.084E+03   9.326E+00  5.327E-03 
5.143E+03   9.262E+00  5.275E-03 
5.203E+03   9.199E+00  5.225E-03 
5.263E+03   9.136E+00  5.174E-03 
5.324E+03   9.073E+00  5.124E-03 
5.386E+03   9.011E+00  5.075E-03 
5.449E+03   8.949E+00  5.026E-03 
5.512E+03   8.887E+00  4.977E-03 
5.576E+03   8.826E+00  4.929E-03 
5.640E+03   8.765E+00  4.881E-03 
5.706E+03   8.704E+00  4.834E-03 
5.772E+03   8.644E+00  4.787E-03 
5.839E+03   8.584E+00  4.741E-03 
5.907E+03   8.524E+00  4.695E-03 
5.975E+03   8.465E+00  4.649E-03 
6.045E+03   8.406E+00  4.604E-03 
6.115E+03   8.347E+00  4.560E-03 
6.186E+03   8.289E+00  4.515E-03 
6.257E+03   8.231E+00  4.472E-03 
6.330E+03   8.173E+00  4.428E-03 
6.403E+03   8.115E+00  4.385E-03 
6.478E+03   8.058E+00  4.343E-03 
6.553E+03   8.002E+00  4.300E-03 
6.629E+03   7.945E+00  4.259E-03 
6.706E+03   7.889E+00  4.217E-03 
6.783E+03   7.833E+00  4.176E-03 
6.862E+03   7.777E+00  4.136E-03 
6.942E+03   7.722E+00  4.095E-03 
7.022E+03   7.667E+00  4.056E-03 
7.104E+03   7.613E+00  4.016E-03 
7.186E+03   7.558E+00  3.977E-03 
7.269E+03   7.504E+00  3.938E-03 
7.354E+03   7.451E+00  3.900E-03 
7.439E+03   7.397E+00  3.862E-03 
7.525E+03   7.344E+00  3.824E-03 
7.613E+03   7.291E+00  3.787E-03 
7.701E+03   7.239E+00  3.750E-03 
7.790E+03   7.187E+00  3.713E-03 
7.881E+03   7.135E+00  3.677E-03 
7.972E+03   7.083E+00  3.641E-03 
8.064E+03   7.032E+00  3.606E-03 
8.158E+03   6.981E+00  3.570E-03 
8.253E+03   6.930E+00  3.535E-03 
8.348E+03   6.880E+00  3.501E-03 
8.445E+03   6.830E+00  3.467E-03 
8.543E+03   6.780E+00  3.433E-03 
8.642E+03   6.730E+00  3.399E-03 
8.742E+03   6.681E+00  3.366E-03 
8.844E+03   6.632E+00  3.333E-03 
8.946E+03   6.584E+00  3.300E-03 
9.050E+03   6.535E+00  3.268E-03 
9.155E+03   6.487E+00  3.236E-03 
9.261E+03   6.439E+00  3.204E-03 
9.369E+03   6.392E+00  3.173E-03 
9.477E+03   6.345E+00  3.142E-03 
9.587E+03   6.298E+00  3.111E-03 
9.699E+03   6.251E+00  3.080E-03 
9.811E+03   6.205E+00  3.050E-03 
9.925E+03   6.159E+00  3.020E-03 
1.004E+04   6.113E+00  2.990E-03 
1.016E+04   6.067E+00  2.961E-03 
1.027E+04   6.022E+00  2.932E-03 
1.039E+04   5.977E+00  2.903E-03 
1.051E+04   5.932E+00  2.875E-03 
1.064E+04   5.888E+00  2.846E-03 
1.076E+04   5.844E+00  2.818E-03 
1.088E+04   5.800E+00  2.791E-03 
1.101E+04   5.756E+00  2.763E-03 
1.114E+04   5.713E+00  2.736E-03 
1.127E+04   5.670E+00  2.709E-03 
1.140E+04   5.627E+00  2.682E-03 
1.153E+04   5.585E+00  2.656E-03 
1.166E+04   5.543E+00  2.630E-03 
1.180E+04   5.501E+00  2.604E-03 
1.194E+04   5.459E+00  2.578E-03 
1.207E+04   5.417E+00  2.553E-03 
1.221E+04   5.376E+00  2.527E-03 
1.236E+04   5.335E+00  2.502E-03 
1.250E+04   5.295E+00  2.478E-03 
1.264E+04   5.254E+00  2.453E-03 
1.279E+04   5.214E+00  2.429E-03 
1.294E+04   5.174E+00  2.405E-03 
1.309E+04   5.135E+00  2.381E-03 
1.324E+04   5.095E+00  2.358E-03 
1.340E+04   5.056E+00  2.334E-03 
1.355E+04   5.017E+00  2.311E-03 
1.371E+04   4.979E+00  2.288E-03 
1.387E+04   4.941E+00  2.266E-03 
1.403E+04   4.902E+00  2.243E-03 
1.419E+04   4.865E+00  2.221E-03 
1.435E+04   4.827E+00  2.199E-03 
1.452E+04   4.790E+00  2.177E-03 
1.469E+04   4.753E+00  2.156E-03 
1.486E+04   4.716E+00  2.134E-03 
1.503E+04   4.679E+00  2.113E-03 
1.521E+04   4.643E+00  2.092E-03 
1.538E+04   4.607E+00  2.072E-03 
1.556E+04   4.571E+00  2.051E-03 
1.574E+04   4.535E+00  2.031E-03 
1.592E+04   4.500E+00  2.011E-03 
1.611E+04   4.465E+00  1.991E-03 
1.630E+04   4.430E+00  1.971E-03 
1.649E+04   4.395E+00  1.951E-03 
1.668E+04   4.361E+00  1.932E-03 
1.687E+04   4.327E+00  1.913E-03 
1.707E+04   4.293E+00  1.894E-03 
1.726E+04   4.259E+00  1.875E-03 
1.746E+04   4.226E+00  1.856E-03 
1.767E+04   4.192E+00  1.838E-03 
1.787E+04   4.159E+00  1.819E-03 
1.808E+04   4.127E+00  1.801E-03 
1.829E+04   4.094E+00  1.783E-03 
1.850E+04   4.062E+00  1.766E-03 
1.871E+04   4.030E+00  1.748E-03 
1.893E+04   3.998E+00  1.731E-03 
1.915E+04   3.966E+00  1.713E-03 
1.937E+04   3.935E+00  1.696E-03 
1.960E+04   3.904E+00  1.679E-03 
1.983E+04   3.873E+00  1.663E-03 
2.006E+04   3.842E+00  1.646E-03 
2.029E+04   3.811E+00  1.630E-03 
2.052E+04   3.781E+00  1.613E-03 
2.076E+04   3.751E+00  1.597E-03 
2.100E+04   3.721E+00  1.581E-03 
2.125E+04   3.691E+00  1.566E-03 
2.149E+04   3.662E+00  1.550E-03 
2.174E+04   3.633E+00  1.534E-03 
2.199E+04   3.604E+00  1.519E-03 
2.225E+04   3.575E+00  1.504E-03 
2.251E+04   3.546E+00  1.489E-03 
2.277E+04   3.518E+00  1.474E-03 
2.303E+04   3.490E+00  1.459E-03 
2.330E+04   3.462E+00  1.445E-03 
2.357E+04   3.434E+00  1.430E-03 
2.384E+04   3.406E+00  1.416E-03 
2.412E+04   3.379E+00  1.402E-03 
2.440E+04   3.352E+00  1.388E-03 
2.468E+04   3.325E+00  1.374E-03 
2.497E+04   3.298E+00  1.360E-03 
2.526E+04   3.272E+00  1.347E-03 
2.555E+04   3.245E+00  1.333E-03 
2.585E+04   3.219E+00  1.320E-03 
2.615E+04   3.193E+00  1.306E-03 
2.645E+04   3.167E+00  1.293E-03 
2.676E+04   3.142E+00  1.280E-03 
2.707E+04   3.116E+00  1.268E-03 
2.738E+04   3.091E+00  1.255E-03 
2.770E+04   3.066E+00  1.242E-03 
2.802E+04   3.041E+00  1.230E-03 
2.835E+04   3.017E+00  1.217E-03 
2.867E+04   2.992E+00  1.205E-03 
2.901E+04   2.968E+00  1.193E-03 
2.934E+04   2.944E+00  1.181E-03 
2.968E+04   2.920E+00  1.169E-03 
3.003E+04   2.896E+00  1.158E-03 
3.038E+04   2.873E+00  1.146E-03 
3.073E+04   2.849E+00  1.134E-03 
3.109E+04   2.826E+00  1.123E-03 
3.145E+04   2.803E+00  1.112E-03 
3.181E+04   2.781E+00  1.100E-03 
3.218E+04   2.758E+00  1.089E-03 
3.255E+04   2.735E+00  1.078E-03 
3.293E+04   2.713E+00  1.068E-03 
3.331E+04   2.691E+00  1.057E-03 
3.370E+04   2.669E+00  1.046E-03 
3.409E+04   2.647E+00  1.036E-03 
3.449E+04   2.626E+00  1.025E-03 
3.489E+04   2.604E+00  1.015E-03 
3.529E+04   2.583E+00  1.005E-03 
3.570E+04   2.562E+00  9.946E-04 
3.611E+04   2.541E+00  9.846E-04 
3.653E+04   2.520E+00  9.746E-04 
3.696E+04   2.500E+00  9.648E-04 
3.738E+04   2.479E+00  9.551E-04 
3.782E+04   2.459E+00  9.454E-04 
3.826E+04   2.439E+00  9.359E-04 
3.870E+04   2.419E+00  9.265E-04 
3.915E+04   2.399E+00  9.171E-04 
3.960E+04   2.380E+00  9.078E-04 
4.006E+04   2.360E+00  8.987E-04 
4.053E+04   2.341E+00  8.896E-04 
4.100E+04   2.322E+00  8.806E-04 
4.147E+04   2.303E+00  8.717E-04 
4.195E+04   2.284E+00  8.629E-04 
4.244E+04   2.265E+00  8.542E-04 
4.293E+04   2.247E+00  8.456E-04 
4.343E+04   2.228E+00  8.370E-04 
4.394E+04   2.210E+00  8.286E-04 
4.444E+04   2.192E+00  8.202E-04 
4.496E+04   2.174E+00  8.119E-04 
4.548E+04   2.156E+00  8.037E-04 
4.601E+04   2.139E+00  7.955E-04 
4.654E+04   2.121E+00  7.875E-04 
4.708E+04   2.104E+00  7.795E-04 
4.763E+04   2.087E+00  7.716E-04 
4.818E+04   2.070E+00  7.638E-04 
4.874E+04   2.053E+00  7.561E-04 
4.931E+04   2.036E+00  7.484E-04 
4.988E+04   2.019E+00  7.408E-04 
5.046E+04   2.003E+00  7.333E-04 
5.104E+04   1.987E+00  7.259E-04 
5.163E+04   1.970E+00  7.185E-04 
5.223E+04   1.954E+00  7.113E-04 
5.284E+04   1.938E+00  7.040E-04 
5.345E+04   1.922E+00  6.969E-04 
5.407E+04   1.907E+00  6.898E-04 
5.470E+04   1.891E+00  6.828E-04 
5.533E+04   1.876E+00  6.759E-04 
5.597E+04   1.860E+00  6.690E-04 
5.662E+04   1.845E+00  6.623E-04 
5.728E+04   1.830E+00  6.555E-04 
5.794E+04   1.815E+00  6.489E-04 
5.862E+04   1.801E+00  6.423E-04 
5.930E+04   1.786E+00  6.358E-04 
5.998E+04   1.771E+00  6.293E-04 
6.068E+04   1.757E+00  6.229E-04 
6.138E+04   1.743E+00  6.166E-04 
6.210E+04   1.728E+00  6.103E-04 
6.282E+04   1.714E+00  6.041E-04 
6.354E+04   1.700E+00  5.980E-04 
6.428E+04   1.687E+00  5.919E-04 
6.503E+04   1.673E+00  5.859E-04 
6.578E+04   1.659E+00  5.799E-04 
6.654E+04   1.646E+00  5.740E-04 
6.732E+04   1.633E+00  5.682E-04 
6.810E+04   1.619E+00  5.624E-04 
6.889E+04   1.606E+00  5.567E-04 
6.969E+04   1.593E+00  5.510E-04 
7.049E+04   1.580E+00  5.454E-04 
7.131E+04   1.568E+00  5.398E-04 
7.214E+04   1.555E+00  5.343E-04 
7.298E+04   1.543E+00  5.289E-04 
7.382E+04   1.530E+00  5.235E-04 
7.468E+04   1.518E+00  5.182E-04 
7.555E+04   1.506E+00  5.129E-04 
7.642E+04   1.493E+00  5.076E-04 
7.731E+04   1.481E+00  5.025E-04 
7.820E+04   1.470E+00  4.973E-04 
7.911E+04   1.458E+00  4.923E-04 
8.003E+04   1.446E+00  4.872E-04 
8.096E+04   1.435E+00  4.823E-04 
8.190E+04   1.423E+00  4.774E-04 
8.285E+04   1.412E+00  4.725E-04 
8.381E+04   1.400E+00  4.677E-04 
8.478E+04   1.389E+00  4.629E-04 
8.576E+04   1.378E+00  4.582E-04 
8.676E+04   1.367E+00  4.535E-04 
8.776E+04   1.356E+00  4.488E-04 
8.878E+04   1.346E+00  4.443E-04 
8.981E+04   1.335E+00  4.397E-04 
9.085E+04   1.324E+00  4.352E-04 
9.191E+04   1.314E+00  4.308E-04 
9.297E+04   1.303E+00  4.264E-04 
9.405E+04   1.293E+00  4.220E-04 
9.514E+04   1.283E+00  4.177E-04 
9.625E+04   1.273E+00  4.134E-04 
9.736E+04   1.263E+00  4.092E-04 
9.849E+04   1.253E+00  4.050E-04 
9.963E+04   1.243E+00  4.009E-04 
1.008E+05   1.233E+00  3.968E-04 
