Fonte: https://physics.nist.gov/PhysRefData/XrayMassCoef/tab1.html
Z	Symbol	Element	Atomic Mass	I (eV)	Density (g/m3)
1	He 	Hydrogen 	1.0079425876	19.2	8.38E-02
2	He 	Helium	4.0025616394	41.8	1.66E-01
3	Li 	Lithium   	6.941070313	40	5.34E+02
4	Be 	Beryllium 	9.0122566691	63.7	1.85E+03
5	B 	Boron 	10.8119796735	76	2.37E+03
6	C 	Carbon 	12.0110501662	78	1.70E+03
7	N 	Nitrogen 	14.0067232271	82	1.17E+00
8	O 	Oxygen 	15.9993600256	95	1.33E+00
9	F 	Fluorine 	18.9985645529	115	1.58E+00
10	Ne 	Neon 	20.179598426	137	8.39E-01
11	Na 	Sodium 	22.9899471231	149	9.71E+02
12	Mg 	Magnesium 	24.3047819659	156	1.74E+03
13	Al 	Aluminum 	26.9815902534	166	2.70E+03
14	Si 	Silicon 	28.0853795538	173	2.33E+03
15	P 	Phosphorus 	30.9738168002	173	2.20E+03
16	S 	Sulfur 	32.0660560755	180	2.00E+03
17	Cl 	Chlorine 	35.452858126	174	3.00E+00
18	Ar 	Argon 	39.947624226	188	1.66E+00
19	K 	Potassium 	39.098672703	190	8.62E+02
20	Ca 	Calcium 	40.0777508366	191	1.55E+03
21	Sc 	Scandium 	44.9563281384	216	2.99E+03
22	Ti 	Titanium 	47.880212414	233	4.54E+03
23	V 	Vanadium 	50.9413067553	245	6.11E+03
24	Cr 	Chromium 	51.9964469095	257	7.18E+03
25	Mn 	Manganese 	54.9378103986	272	7.44E+03
26	Fe 	Iron 	55.846722227	286	7.87E+03
27	Co 	Cobalt 	58.9326639747	297	8.90E+03
28	Ni 	Nickel 	58.6903663956	311	8.90E+03
29	Cu 	Copper 	63.5463230783	322	8.96E+03
30	Zn 	Zinc 	65.3893938403	330	7.13E+03
31	Ga 	Gallium 	69.7224596284	334	5.90E+03
32	Ge 	Germanium 	72.6101064192	350	5.32E+03
33	As 	Arsenic 	74.9216727966	347	5.73E+03
34	Se 	Selenium 	78.959591268	348	4.50E+03
35	Br 	Bromine 	79.903202977	343	7.07E+00
36	Kr 	Krypton 	83.8008333527	352	3.48E+00
37	Rb 	Rubidium 	85.4681111547	363	1.53E+03
38	Sr 	Strontium 	87.6201895363	366	2.54E+03
39	Y 	Yttrium 	88.9050995053	379	4.47E+03
40	Zr 	Zirconium 	91.2242291553	393	6.51E+03
41	Nb 	Niobium 	92.9073192839	417	8.57E+03
42	Mo 	Molybdenum 	95.9407908262	424	1.02E+04
43	Tc 	Technetium 	97.9075115554	428	1.15E+04
44	Ru 	Ruthenium 	101.0704277117	441	1.24E+04
45	Rh 	Rhodium 	102.9065379954	449	1.24E+04
46	Pd 	Palladium 	106.4198958936	470	1.20E+04
47	Ag 	Silver 	107.8674378041	470	1.05E+04
48	Cd 	Cadmium 	112.4121779859	469	8.65E+03
49	In 	Indium 	114.8186334239	488	7.31E+03
50	Sn 	Tin 	118.7084520418	488	7.31E+03
51	Sb 	Antimony 	121.7503401848	487	6.69E+03
52	Te 	Tellurium 	127.6010993325	485	6.24E+03
53	I 	Iodine 	126.9035532995	491	4.93E+03
54	Xe 	Xenon 	131.2910284464	482	5.49E+00
55	Cs 	Cesium 	132.9048159872	488	1.87E+03
56	Ba 	Barium 	137.3255842468	491	3.50E+03
57	La 	Lanthanum 	138.9058121116	501	6.15E+03
58	Ce 	Cerium 	140.1135402826	523	6.66E+03
59	Pr 	Praseodymium 	140.9089823506	535	6.71E+03
60	Nd 	Neodymium 	144.2411712383	546	6.90E+03
61	Pm 	Promethium 	144.913764432	560	7.22E+03
62	Sm 	Samarium 	150.3613522821	574	7.46E+03
63	Eu 	Europium 	151.9646863015	580	5.24E+03
64	Gd 	Gadolinium 	157.2520209342	591	7.90E+03
65	Tb 	Terbium 	158.924205379	614	8.23E+03
66	Dy 	Dysprosium 	162.5015388403	628	8.55E+03
67	Ho 	Holmium 	164.9311966128	650	8.80E+03
68	Er 	Erbium 	167.2610994958	658	9.07E+03
69	Tm 	Thulium 	168.9354617569	674	9.32E+03
70	Yb 	Ytterbium 	173.0403183942	684	6.73E+03
71	Lu 	Lutetium 	174.9673476429	694	9.84E+03
72	Hf 	Hafnium 	178.4917447568	705	1.33E+04
73	Ta 	Tantalum 	180.9483677466	718	1.67E+04
74	W 	Tungsten 	183.850931677	727	1.93E+04
75	Re 	Rhenium 	186.205869209	736	2.10E+04
76	Os 	Osmium 	190.1997096952	746	2.26E+04
77	Ir 	Iridium 	192.2212791452	757	2.24E+04
78	Pt 	Platinum 	195.0780312125	790	2.15E+04
79	Au 	Gold 	196.9681858981	790	1.93E+04
80	Hg 	Mercury 	200.5917456497	800	1.36E+04
81	Tl 	Thallium 	204.38545583	810	1.17E+04
82	Pb 	Lead 	207.2015161087	823	1.14E+04
83	Bi 	Bismuth 	208.9785230506	823	9.75E+03
84	Po 	Polonium 	208.9812165692	830	9.32E+03
85	At 	Astatine 	209.9854245411	825	1.00E+04
86	Rn 	Radon 	222.0156959934	794	9.07E+00
87	Fr 	Francium 	223.0197385286	827	1.00E+04
88	Ra 	Radium 	226.0235269944	826	5.00E+03
89	Ac 	Actinium 	227.0292332024	841	1.01E+04
90	Th 	Thorium 	232.0365070771	847	1.17E+04
91	Pa 	Protactinium 	231.034832944	878	1.54E+04
92	U 	Uranium 	238.02747665	890	1.90E+04
