Ion = Hydrogen    . Mass = 1.0079
Tgt = Ca (Solid). Density = 1.54 g/cm3
Stopping Units =  eV/(1E15 atoms/cm2)
Energy(keV)  S(Elec)    S(Nuc)
1.000E+00   5.810E+00  5.154E-01 
1.012E+00   5.843E+00  5.148E-01 
1.023E+00   5.877E+00  5.141E-01 
1.035E+00   5.911E+00  5.134E-01 
1.047E+00   5.945E+00  5.127E-01 
1.059E+00   5.980E+00  5.120E-01 
1.072E+00   6.014E+00  5.113E-01 
1.084E+00   6.049E+00  5.106E-01 
1.097E+00   6.084E+00  5.098E-01 
1.109E+00   6.119E+00  5.091E-01 
1.122E+00   6.155E+00  5.083E-01 
1.135E+00   6.190E+00  5.075E-01 
1.148E+00   6.226E+00  5.068E-01 
1.162E+00   6.262E+00  5.060E-01 
1.175E+00   6.298E+00  5.051E-01 
1.189E+00   6.335E+00  5.043E-01 
1.203E+00   6.371E+00  5.035E-01 
1.217E+00   6.408E+00  5.026E-01 
1.231E+00   6.445E+00  5.018E-01 
1.245E+00   6.482E+00  5.009E-01 
1.259E+00   6.520E+00  5.000E-01 
1.274E+00   6.558E+00  4.992E-01 
1.289E+00   6.596E+00  4.983E-01 
1.304E+00   6.634E+00  4.973E-01 
1.319E+00   6.672E+00  4.964E-01 
1.334E+00   6.711E+00  4.955E-01 
1.350E+00   6.749E+00  4.946E-01 
1.365E+00   6.788E+00  4.936E-01 
1.381E+00   6.828E+00  4.926E-01 
1.397E+00   6.867E+00  4.917E-01 
1.413E+00   6.907E+00  4.907E-01 
1.430E+00   6.947E+00  4.897E-01 
1.446E+00   6.987E+00  4.887E-01 
1.463E+00   7.027E+00  4.876E-01 
1.480E+00   7.068E+00  4.866E-01 
1.497E+00   7.109E+00  4.856E-01 
1.515E+00   7.150E+00  4.845E-01 
1.532E+00   7.191E+00  4.835E-01 
1.550E+00   7.233E+00  4.824E-01 
1.568E+00   7.275E+00  4.813E-01 
1.586E+00   7.317E+00  4.802E-01 
1.605E+00   7.359E+00  4.791E-01 
1.623E+00   7.402E+00  4.780E-01 
1.642E+00   7.445E+00  4.769E-01 
1.661E+00   7.488E+00  4.758E-01 
1.680E+00   7.531E+00  4.746E-01 
1.700E+00   7.574E+00  4.735E-01 
1.719E+00   7.618E+00  4.723E-01 
1.739E+00   7.662E+00  4.711E-01 
1.760E+00   7.707E+00  4.700E-01 
1.780E+00   7.751E+00  4.688E-01 
1.801E+00   7.796E+00  4.676E-01 
1.822E+00   7.841E+00  4.664E-01 
1.843E+00   7.886E+00  4.652E-01 
1.864E+00   7.932E+00  4.639E-01 
1.886E+00   7.978E+00  4.627E-01 
1.908E+00   8.024E+00  4.615E-01 
1.930E+00   8.070E+00  4.602E-01 
1.952E+00   8.117E+00  4.590E-01 
1.975E+00   8.164E+00  4.577E-01 
1.998E+00   8.211E+00  4.564E-01 
2.021E+00   8.258E+00  4.551E-01 
2.044E+00   8.302E+00  4.538E-01 
2.068E+00   8.347E+00  4.525E-01 
2.092E+00   8.392E+00  4.512E-01 
2.116E+00   8.437E+00  4.499E-01 
2.141E+00   8.482E+00  4.486E-01 
2.166E+00   8.528E+00  4.473E-01 
2.191E+00   8.573E+00  4.459E-01 
2.216E+00   8.619E+00  4.446E-01 
2.242E+00   8.666E+00  4.432E-01 
2.268E+00   8.712E+00  4.418E-01 
2.294E+00   8.759E+00  4.405E-01 
2.321E+00   8.806E+00  4.391E-01 
2.348E+00   8.853E+00  4.377E-01 
2.375E+00   8.901E+00  4.363E-01 
2.402E+00   8.949E+00  4.349E-01 
2.430E+00   8.997E+00  4.335E-01 
2.458E+00   9.045E+00  4.321E-01 
2.487E+00   9.094E+00  4.307E-01 
2.516E+00   9.143E+00  4.293E-01 
2.545E+00   9.192E+00  4.278E-01 
2.574E+00   9.241E+00  4.264E-01 
2.604E+00   9.291E+00  4.249E-01 
2.635E+00   9.341E+00  4.235E-01 
2.665E+00   9.391E+00  4.220E-01 
2.696E+00   9.442E+00  4.206E-01 
2.727E+00   9.493E+00  4.191E-01 
2.759E+00   9.544E+00  4.176E-01 
2.791E+00   9.595E+00  4.161E-01 
2.823E+00   9.647E+00  4.147E-01 
2.856E+00   9.698E+00  4.132E-01 
2.889E+00   9.751E+00  4.117E-01 
2.923E+00   9.803E+00  4.102E-01 
2.957E+00   9.856E+00  4.087E-01 
2.991E+00   9.909E+00  4.071E-01 
3.026E+00   9.962E+00  4.056E-01 
3.061E+00   1.002E+01  4.041E-01 
3.096E+00   1.007E+01  4.026E-01 
3.132E+00   1.012E+01  4.011E-01 
3.168E+00   1.018E+01  3.995E-01 
3.205E+00   1.023E+01  3.980E-01 
3.242E+00   1.029E+01  3.964E-01 
3.280E+00   1.034E+01  3.949E-01 
3.318E+00   1.040E+01  3.933E-01 
3.356E+00   1.046E+01  3.918E-01 
3.395E+00   1.051E+01  3.902E-01 
3.435E+00   1.057E+01  3.887E-01 
3.475E+00   1.062E+01  3.871E-01 
3.515E+00   1.068E+01  3.855E-01 
3.556E+00   1.074E+01  3.839E-01 
3.597E+00   1.080E+01  3.824E-01 
3.639E+00   1.086E+01  3.808E-01 
3.681E+00   1.091E+01  3.792E-01 
3.724E+00   1.097E+01  3.776E-01 
3.767E+00   1.103E+01  3.760E-01 
3.810E+00   1.109E+01  3.744E-01 
3.855E+00   1.115E+01  3.728E-01 
3.899E+00   1.121E+01  3.712E-01 
3.945E+00   1.127E+01  3.696E-01 
3.990E+00   1.133E+01  3.680E-01 
4.037E+00   1.139E+01  3.664E-01 
4.083E+00   1.145E+01  3.648E-01 
4.131E+00   1.151E+01  3.632E-01 
4.179E+00   1.158E+01  3.616E-01 
4.227E+00   1.164E+01  3.600E-01 
4.276E+00   1.170E+01  3.584E-01 
4.326E+00   1.176E+01  3.568E-01 
4.376E+00   1.183E+01  3.552E-01 
4.427E+00   1.189E+01  3.535E-01 
4.478E+00   1.195E+01  3.519E-01 
4.530E+00   1.202E+01  3.503E-01 
4.583E+00   1.208E+01  3.487E-01 
4.636E+00   1.215E+01  3.471E-01 
4.690E+00   1.221E+01  3.454E-01 
4.744E+00   1.228E+01  3.438E-01 
4.799E+00   1.234E+01  3.422E-01 
4.855E+00   1.241E+01  3.406E-01 
4.911E+00   1.248E+01  3.389E-01 
4.968E+00   1.254E+01  3.373E-01 
5.026E+00   1.261E+01  3.357E-01 
5.084E+00   1.268E+01  3.341E-01 
5.143E+00   1.275E+01  3.324E-01 
5.202E+00   1.281E+01  3.308E-01 
5.263E+00   1.288E+01  3.292E-01 
5.324E+00   1.295E+01  3.276E-01 
5.386E+00   1.302E+01  3.259E-01 
5.448E+00   1.309E+01  3.243E-01 
5.511E+00   1.316E+01  3.227E-01 
5.575E+00   1.323E+01  3.211E-01 
5.640E+00   1.330E+01  3.195E-01 
5.705E+00   1.337E+01  3.178E-01 
5.771E+00   1.344E+01  3.162E-01 
5.838E+00   1.351E+01  3.146E-01 
5.906E+00   1.359E+01  3.130E-01 
5.975E+00   1.366E+01  3.114E-01 
6.044E+00   1.373E+01  3.098E-01 
6.114E+00   1.381E+01  3.081E-01 
6.185E+00   1.388E+01  3.065E-01 
6.257E+00   1.395E+01  3.049E-01 
6.329E+00   1.403E+01  3.033E-01 
6.403E+00   1.410E+01  3.017E-01 
6.477E+00   1.418E+01  3.001E-01 
6.552E+00   1.425E+01  2.985E-01 
6.628E+00   1.433E+01  2.969E-01 
6.705E+00   1.440E+01  2.953E-01 
6.783E+00   1.448E+01  2.937E-01 
6.861E+00   1.456E+01  2.921E-01 
6.941E+00   1.463E+01  2.905E-01 
7.021E+00   1.471E+01  2.889E-01 
7.103E+00   1.479E+01  2.873E-01 
7.185E+00   1.487E+01  2.857E-01 
7.269E+00   1.494E+01  2.842E-01 
7.353E+00   1.502E+01  2.826E-01 
7.438E+00   1.510E+01  2.810E-01 
7.524E+00   1.518E+01  2.794E-01 
7.612E+00   1.526E+01  2.779E-01 
7.700E+00   1.534E+01  2.763E-01 
7.789E+00   1.542E+01  2.747E-01 
7.880E+00   1.550E+01  2.732E-01 
7.971E+00   1.559E+01  2.716E-01 
8.064E+00   1.567E+01  2.700E-01 
8.157E+00   1.575E+01  2.685E-01 
8.252E+00   1.583E+01  2.669E-01 
8.347E+00   1.592E+01  2.654E-01 
8.444E+00   1.600E+01  2.639E-01 
8.542E+00   1.608E+01  2.623E-01 
8.641E+00   1.617E+01  2.608E-01 
8.741E+00   1.625E+01  2.593E-01 
8.843E+00   1.634E+01  2.577E-01 
8.945E+00   1.642E+01  2.562E-01 
9.049E+00   1.651E+01  2.547E-01 
9.154E+00   1.659E+01  2.532E-01 
9.260E+00   1.668E+01  2.517E-01 
9.368E+00   1.676E+01  2.502E-01 
9.476E+00   1.685E+01  2.486E-01 
9.586E+00   1.694E+01  2.471E-01 
9.698E+00   1.703E+01  2.457E-01 
9.810E+00   1.711E+01  2.442E-01 
9.924E+00   1.720E+01  2.427E-01 
1.004E+01   1.729E+01  2.412E-01 
1.016E+01   1.738E+01  2.397E-01 
1.027E+01   1.747E+01  2.382E-01 
1.039E+01   1.756E+01  2.368E-01 
1.051E+01   1.765E+01  2.353E-01 
1.063E+01   1.774E+01  2.339E-01 
1.076E+01   1.783E+01  2.324E-01 
1.088E+01   1.792E+01  2.309E-01 
1.101E+01   1.801E+01  2.295E-01 
1.114E+01   1.811E+01  2.281E-01 
1.127E+01   1.820E+01  2.266E-01 
1.140E+01   1.829E+01  2.252E-01 
1.153E+01   1.838E+01  2.238E-01 
1.166E+01   1.848E+01  2.223E-01 
1.180E+01   1.857E+01  2.209E-01 
1.193E+01   1.867E+01  2.195E-01 
1.207E+01   1.876E+01  2.181E-01 
1.221E+01   1.886E+01  2.167E-01 
1.235E+01   1.895E+01  2.153E-01 
1.250E+01   1.905E+01  2.139E-01 
1.264E+01   1.914E+01  2.125E-01 
1.279E+01   1.924E+01  2.112E-01 
1.294E+01   1.933E+01  2.098E-01 
1.309E+01   1.943E+01  2.084E-01 
1.324E+01   1.953E+01  2.070E-01 
1.339E+01   1.962E+01  2.057E-01 
1.355E+01   1.972E+01  2.043E-01 
1.371E+01   1.982E+01  2.030E-01 
1.387E+01   1.992E+01  2.016E-01 
1.403E+01   2.002E+01  2.003E-01 
1.419E+01   2.012E+01  1.990E-01 
1.435E+01   2.021E+01  1.976E-01 
1.452E+01   2.031E+01  1.963E-01 
1.469E+01   2.041E+01  1.950E-01 
1.486E+01   2.051E+01  1.937E-01 
1.503E+01   2.061E+01  1.924E-01 
1.521E+01   2.071E+01  1.911E-01 
1.538E+01   2.082E+01  1.898E-01 
1.556E+01   2.092E+01  1.885E-01 
1.574E+01   2.102E+01  1.872E-01 
1.592E+01   2.112E+01  1.860E-01 
1.611E+01   2.122E+01  1.847E-01 
1.629E+01   2.132E+01  1.834E-01 
1.648E+01   2.143E+01  1.822E-01 
1.667E+01   2.153E+01  1.809E-01 
1.687E+01   2.163E+01  1.797E-01 
1.706E+01   2.173E+01  1.784E-01 
1.726E+01   2.184E+01  1.772E-01 
1.746E+01   2.194E+01  1.760E-01 
1.766E+01   2.204E+01  1.747E-01 
1.787E+01   2.215E+01  1.735E-01 
1.808E+01   2.225E+01  1.723E-01 
1.829E+01   2.236E+01  1.711E-01 
1.850E+01   2.246E+01  1.699E-01 
1.871E+01   2.257E+01  1.687E-01 
1.893E+01   2.267E+01  1.675E-01 
1.915E+01   2.278E+01  1.663E-01 
1.937E+01   2.288E+01  1.651E-01 
1.960E+01   2.299E+01  1.640E-01 
1.982E+01   2.309E+01  1.628E-01 
2.005E+01   2.320E+01  1.616E-01 
2.029E+01   2.330E+01  1.605E-01 
2.052E+01   2.341E+01  1.593E-01 
2.076E+01   2.351E+01  1.582E-01 
2.100E+01   2.362E+01  1.571E-01 
2.124E+01   2.373E+01  1.559E-01 
2.149E+01   2.383E+01  1.548E-01 
2.174E+01   2.394E+01  1.537E-01 
2.199E+01   2.405E+01  1.526E-01 
2.225E+01   2.415E+01  1.515E-01 
2.250E+01   2.426E+01  1.504E-01 
2.277E+01   2.436E+01  1.493E-01 
2.303E+01   2.447E+01  1.482E-01 
2.330E+01   2.458E+01  1.471E-01 
2.357E+01   2.468E+01  1.460E-01 
2.384E+01   2.479E+01  1.449E-01 
2.412E+01   2.490E+01  1.439E-01 
2.440E+01   2.500E+01  1.428E-01 
2.468E+01   2.511E+01  1.418E-01 
2.497E+01   2.522E+01  1.407E-01 
2.526E+01   2.532E+01  1.397E-01 
2.555E+01   2.543E+01  1.386E-01 
2.584E+01   2.553E+01  1.376E-01 
2.614E+01   2.564E+01  1.366E-01 
2.645E+01   2.575E+01  1.356E-01 
2.675E+01   2.585E+01  1.345E-01 
2.707E+01   2.596E+01  1.335E-01 
2.738E+01   2.606E+01  1.325E-01 
2.770E+01   2.617E+01  1.315E-01 
2.802E+01   2.627E+01  1.306E-01 
2.834E+01   2.638E+01  1.296E-01 
2.867E+01   2.648E+01  1.286E-01 
2.900E+01   2.659E+01  1.276E-01 
2.934E+01   2.669E+01  1.266E-01 
2.968E+01   2.680E+01  1.257E-01 
3.003E+01   2.690E+01  1.247E-01 
3.037E+01   2.700E+01  1.238E-01 
3.073E+01   2.711E+01  1.228E-01 
3.108E+01   2.721E+01  1.219E-01 
3.144E+01   2.731E+01  1.210E-01 
3.181E+01   2.741E+01  1.200E-01 
3.218E+01   2.751E+01  1.191E-01 
3.255E+01   2.762E+01  1.182E-01 
3.293E+01   2.772E+01  1.173E-01 
3.331E+01   2.782E+01  1.164E-01 
3.370E+01   2.792E+01  1.155E-01 
3.409E+01   2.802E+01  1.146E-01 
3.448E+01   2.812E+01  1.137E-01 
3.488E+01   2.821E+01  1.128E-01 
3.529E+01   2.831E+01  1.119E-01 
3.570E+01   2.841E+01  1.111E-01 
3.611E+01   2.851E+01  1.102E-01 
3.653E+01   2.860E+01  1.093E-01 
3.695E+01   2.870E+01  1.085E-01 
3.738E+01   2.879E+01  1.076E-01 
3.781E+01   2.889E+01  1.068E-01 
3.825E+01   2.898E+01  1.060E-01 
3.870E+01   2.908E+01  1.051E-01 
3.915E+01   2.917E+01  1.043E-01 
3.960E+01   2.926E+01  1.035E-01 
4.006E+01   2.935E+01  1.027E-01 
4.052E+01   2.944E+01  1.018E-01 
4.099E+01   2.953E+01  1.010E-01 
4.147E+01   2.962E+01  1.002E-01 
4.195E+01   2.971E+01  9.944E-02 
4.244E+01   2.980E+01  9.865E-02 
4.293E+01   2.988E+01  9.786E-02 
4.343E+01   2.997E+01  9.708E-02 
4.393E+01   3.005E+01  9.631E-02 
4.444E+01   3.014E+01  9.554E-02 
4.496E+01   3.022E+01  9.477E-02 
4.548E+01   3.030E+01  9.401E-02 
4.600E+01   3.038E+01  9.326E-02 
4.654E+01   3.046E+01  9.251E-02 
4.708E+01   3.054E+01  9.176E-02 
4.762E+01   3.062E+01  9.102E-02 
4.818E+01   3.069E+01  9.029E-02 
4.873E+01   3.077E+01  8.956E-02 
4.930E+01   3.084E+01  8.883E-02 
4.987E+01   3.092E+01  8.811E-02 
5.045E+01   3.099E+01  8.740E-02 
5.104E+01   3.106E+01  8.669E-02 
5.163E+01   3.113E+01  8.599E-02 
5.223E+01   3.120E+01  8.529E-02 
5.283E+01   3.126E+01  8.459E-02 
5.344E+01   3.133E+01  8.390E-02 
5.406E+01   3.139E+01  8.321E-02 
5.469E+01   3.146E+01  8.253E-02 
5.533E+01   3.152E+01  8.186E-02 
5.597E+01   3.158E+01  8.119E-02 
5.662E+01   3.164E+01  7.861E-02 
5.727E+01   3.169E+01  7.798E-02 
5.794E+01   3.175E+01  7.734E-02 
5.861E+01   3.180E+01  7.671E-02 
5.929E+01   3.186E+01  7.609E-02 
5.998E+01   3.191E+01  7.547E-02 
6.067E+01   3.196E+01  7.485E-02 
6.138E+01   3.201E+01  7.424E-02 
6.209E+01   3.205E+01  7.363E-02 
6.281E+01   3.210E+01  7.303E-02 
6.354E+01   3.214E+01  7.243E-02 
6.427E+01   3.218E+01  7.183E-02 
6.502E+01   3.222E+01  7.124E-02 
6.577E+01   3.226E+01  7.065E-02 
6.654E+01   3.230E+01  7.007E-02 
6.731E+01   3.233E+01  6.949E-02 
6.809E+01   3.237E+01  6.891E-02 
6.888E+01   3.240E+01  6.834E-02 
6.968E+01   3.243E+01  6.778E-02 
7.049E+01   3.246E+01  6.721E-02 
7.130E+01   3.248E+01  6.665E-02 
7.213E+01   3.251E+01  6.610E-02 
7.297E+01   3.253E+01  6.555E-02 
7.381E+01   3.255E+01  6.500E-02 
7.467E+01   3.257E+01  6.446E-02 
7.554E+01   3.258E+01  6.392E-02 
7.641E+01   3.260E+01  6.338E-02 
7.730E+01   3.261E+01  6.285E-02 
7.820E+01   3.262E+01  6.232E-02 
7.910E+01   3.263E+01  6.180E-02 
8.002E+01   3.264E+01  6.128E-02 
8.095E+01   3.264E+01  6.076E-02 
8.189E+01   3.265E+01  6.025E-02 
8.284E+01   3.265E+01  5.974E-02 
8.380E+01   3.265E+01  5.924E-02 
8.477E+01   3.264E+01  5.873E-02 
8.575E+01   3.264E+01  5.824E-02 
8.675E+01   3.263E+01  5.774E-02 
8.775E+01   3.262E+01  5.725E-02 
8.877E+01   3.261E+01  5.677E-02 
8.980E+01   3.260E+01  5.628E-02 
9.084E+01   3.258E+01  5.580E-02 
9.190E+01   3.256E+01  5.533E-02 
9.296E+01   3.254E+01  5.486E-02 
9.404E+01   3.252E+01  5.439E-02 
9.513E+01   3.250E+01  5.392E-02 
9.624E+01   3.247E+01  5.346E-02 
9.735E+01   3.244E+01  5.300E-02 
9.848E+01   3.241E+01  5.255E-02 
9.962E+01   3.238E+01  5.210E-02 
1.008E+02   3.235E+01  5.165E-02 
1.019E+02   3.231E+01  5.121E-02 
1.031E+02   3.227E+01  5.077E-02 
1.043E+02   3.223E+01  5.033E-02 
1.055E+02   3.219E+01  4.989E-02 
1.068E+02   3.214E+01  4.946E-02 
1.080E+02   3.209E+01  4.904E-02 
1.093E+02   3.205E+01  4.861E-02 
1.105E+02   3.199E+01  4.819E-02 
1.118E+02   3.194E+01  4.777E-02 
1.131E+02   3.189E+01  4.736E-02 
1.144E+02   3.183E+01  4.695E-02 
1.157E+02   3.177E+01  4.654E-02 
1.171E+02   3.171E+01  4.613E-02 
1.184E+02   3.164E+01  4.573E-02 
1.198E+02   3.158E+01  4.533E-02 
1.212E+02   3.151E+01  4.494E-02 
1.226E+02   3.144E+01  4.455E-02 
1.240E+02   3.137E+01  4.416E-02 
1.255E+02   3.130E+01  4.377E-02 
1.269E+02   3.122E+01  4.339E-02 
1.284E+02   3.114E+01  4.301E-02 
1.299E+02   3.107E+01  4.263E-02 
1.314E+02   3.098E+01  4.226E-02 
1.329E+02   3.090E+01  4.189E-02 
1.345E+02   3.082E+01  4.152E-02 
1.360E+02   3.073E+01  4.115E-02 
1.376E+02   3.064E+01  4.079E-02 
1.392E+02   3.055E+01  4.043E-02 
1.408E+02   3.046E+01  4.008E-02 
1.424E+02   3.037E+01  3.972E-02 
1.441E+02   3.027E+01  3.937E-02 
1.458E+02   3.018E+01  3.902E-02 
1.475E+02   3.008E+01  3.868E-02 
1.492E+02   2.998E+01  3.834E-02 
1.509E+02   2.988E+01  3.800E-02 
1.526E+02   2.977E+01  3.766E-02 
1.544E+02   2.967E+01  3.733E-02 
1.562E+02   2.956E+01  3.699E-02 
1.580E+02   2.946E+01  3.667E-02 
1.598E+02   2.935E+01  3.634E-02 
1.617E+02   2.924E+01  3.602E-02 
1.636E+02   2.913E+01  3.570E-02 
1.655E+02   2.901E+01  3.538E-02 
1.674E+02   2.890E+01  3.506E-02 
1.693E+02   2.878E+01  3.475E-02 
1.713E+02   2.867E+01  3.444E-02 
1.733E+02   2.855E+01  3.413E-02 
1.753E+02   2.843E+01  3.383E-02 
1.773E+02   2.831E+01  3.352E-02 
1.794E+02   2.819E+01  3.322E-02 
1.815E+02   2.806E+01  3.292E-02 
1.836E+02   2.794E+01  3.263E-02 
1.857E+02   2.781E+01  3.234E-02 
1.879E+02   2.769E+01  3.205E-02 
1.900E+02   2.756E+01  3.176E-02 
1.922E+02   2.743E+01  3.147E-02 
1.945E+02   2.731E+01  3.119E-02 
1.967E+02   2.718E+01  3.091E-02 
1.990E+02   2.705E+01  3.063E-02 
2.013E+02   2.692E+01  3.035E-02 
2.036E+02   2.678E+01  3.008E-02 
2.060E+02   2.665E+01  2.981E-02 
2.084E+02   2.652E+01  2.954E-02 
2.108E+02   2.639E+01  2.927E-02 
2.133E+02   2.625E+01  2.901E-02 
2.157E+02   2.612E+01  2.874E-02 
2.182E+02   2.598E+01  2.848E-02 
2.208E+02   2.585E+01  2.822E-02 
2.233E+02   2.571E+01  2.797E-02 
2.259E+02   2.557E+01  2.771E-02 
2.285E+02   2.544E+01  2.746E-02 
2.312E+02   2.530E+01  2.721E-02 
2.339E+02   2.516E+01  2.697E-02 
2.366E+02   2.502E+01  2.672E-02 
2.393E+02   2.488E+01  2.648E-02 
2.421E+02   2.475E+01  2.624E-02 
2.449E+02   2.461E+01  2.600E-02 
2.478E+02   2.447E+01  2.576E-02 
2.506E+02   2.433E+01  2.552E-02 
2.535E+02   2.419E+01  2.529E-02 
2.565E+02   2.405E+01  2.506E-02 
2.595E+02   2.391E+01  2.483E-02 
2.625E+02   2.377E+01  2.460E-02 
2.655E+02   2.363E+01  2.438E-02 
2.686E+02   2.349E+01  2.416E-02 
2.717E+02   2.335E+01  2.393E-02 
2.749E+02   2.321E+01  2.371E-02 
2.780E+02   2.308E+01  2.350E-02 
2.813E+02   2.294E+01  2.328E-02 
2.845E+02   2.280E+01  2.307E-02 
2.878E+02   2.266E+01  2.285E-02 
2.912E+02   2.252E+01  2.264E-02 
2.945E+02   2.238E+01  2.244E-02 
2.980E+02   2.225E+01  2.223E-02 
3.014E+02   2.211E+01  2.202E-02 
3.049E+02   2.197E+01  2.182E-02 
3.085E+02   2.183E+01  2.162E-02 
3.120E+02   2.170E+01  2.142E-02 
3.156E+02   2.156E+01  2.122E-02 
3.193E+02   2.143E+01  2.103E-02 
3.230E+02   2.129E+01  2.083E-02 
3.268E+02   2.116E+01  2.064E-02 
3.306E+02   2.102E+01  2.045E-02 
3.344E+02   2.089E+01  2.026E-02 
3.383E+02   2.076E+01  2.007E-02 
3.422E+02   2.062E+01  1.989E-02 
3.462E+02   2.049E+01  1.970E-02 
3.502E+02   2.036E+01  1.952E-02 
3.542E+02   2.023E+01  1.934E-02 
3.583E+02   2.010E+01  1.916E-02 
3.625E+02   1.997E+01  1.898E-02 
3.667E+02   1.984E+01  1.880E-02 
3.710E+02   1.971E+01  1.863E-02 
3.753E+02   1.958E+01  1.845E-02 
3.796E+02   1.945E+01  1.828E-02 
3.840E+02   1.933E+01  1.811E-02 
3.885E+02   1.920E+01  1.794E-02 
3.930E+02   1.908E+01  1.778E-02 
3.975E+02   1.895E+01  1.761E-02 
4.021E+02   1.883E+01  1.745E-02 
4.068E+02   1.870E+01  1.728E-02 
4.115E+02   1.858E+01  1.712E-02 
4.163E+02   1.846E+01  1.696E-02 
4.211E+02   1.834E+01  1.680E-02 
4.260E+02   1.822E+01  1.665E-02 
4.310E+02   1.810E+01  1.649E-02 
4.360E+02   1.798E+01  1.634E-02 
4.410E+02   1.786E+01  1.618E-02 
4.461E+02   1.774E+01  1.603E-02 
4.513E+02   1.763E+01  1.588E-02 
4.565E+02   1.751E+01  1.573E-02 
4.618E+02   1.739E+01  1.558E-02 
4.672E+02   1.728E+01  1.544E-02 
4.726E+02   1.717E+01  1.529E-02 
4.781E+02   1.705E+01  1.515E-02 
4.836E+02   1.694E+01  1.501E-02 
4.892E+02   1.683E+01  1.486E-02 
4.949E+02   1.672E+01  1.472E-02 
5.007E+02   1.661E+01  1.459E-02 
5.065E+02   1.650E+01  1.445E-02 
5.123E+02   1.639E+01  1.431E-02 
5.183E+02   1.628E+01  1.418E-02 
5.243E+02   1.617E+01  1.404E-02 
5.304E+02   1.607E+01  1.391E-02 
5.365E+02   1.596E+01  1.378E-02 
5.428E+02   1.586E+01  1.365E-02 
5.490E+02   1.575E+01  1.352E-02 
5.554E+02   1.565E+01  1.339E-02 
5.619E+02   1.555E+01  1.327E-02 
5.684E+02   1.545E+01  1.314E-02 
5.750E+02   1.535E+01  1.302E-02 
5.816E+02   1.524E+01  1.289E-02 
5.884E+02   1.515E+01  1.277E-02 
5.952E+02   1.505E+01  1.265E-02 
6.021E+02   1.495E+01  1.253E-02 
6.091E+02   1.485E+01  1.241E-02 
6.162E+02   1.475E+01  1.229E-02 
6.233E+02   1.466E+01  1.218E-02 
6.305E+02   1.456E+01  1.206E-02 
6.378E+02   1.447E+01  1.195E-02 
6.452E+02   1.437E+01  1.183E-02 
6.527E+02   1.428E+01  1.172E-02 
6.603E+02   1.419E+01  1.161E-02 
6.680E+02   1.410E+01  1.150E-02 
6.757E+02   1.401E+01  1.139E-02 
6.835E+02   1.391E+01  1.128E-02 
6.915E+02   1.382E+01  1.117E-02 
6.995E+02   1.374E+01  1.107E-02 
7.076E+02   1.365E+01  1.096E-02 
7.158E+02   1.356E+01  1.086E-02 
7.241E+02   1.347E+01  1.075E-02 
7.325E+02   1.338E+01  1.065E-02 
7.410E+02   1.330E+01  1.055E-02 
7.496E+02   1.321E+01  1.045E-02 
7.583E+02   1.313E+01  1.035E-02 
7.671E+02   1.304E+01  1.025E-02 
7.760E+02   1.296E+01  1.015E-02 
7.850E+02   1.288E+01  1.005E-02 
7.941E+02   1.280E+01  9.956E-03 
8.033E+02   1.271E+01  9.860E-03 
8.126E+02   1.263E+01  9.766E-03 
8.221E+02   1.255E+01  9.672E-03 
8.316E+02   1.247E+01  9.580E-03 
8.412E+02   1.239E+01  9.488E-03 
8.510E+02   1.231E+01  9.397E-03 
8.609E+02   1.223E+01  9.306E-03 
8.709E+02   1.216E+01  9.217E-03 
8.810E+02   1.208E+01  9.128E-03 
8.912E+02   1.200E+01  9.041E-03 
9.015E+02   1.193E+01  8.954E-03 
9.120E+02   1.185E+01  8.868E-03 
9.225E+02   1.178E+01  8.782E-03 
9.332E+02   1.170E+01  8.698E-03 
9.441E+02   1.163E+01  8.614E-03 
9.550E+02   1.155E+01  8.531E-03 
9.661E+02   1.148E+01  8.449E-03 
9.773E+02   1.141E+01  8.367E-03 
9.886E+02   1.134E+01  8.287E-03 
1.000E+03   1.126E+01  8.207E-03 
1.012E+03   1.119E+01  8.128E-03 
1.023E+03   1.112E+01  8.049E-03 
1.035E+03   1.105E+01  7.972E-03 
1.047E+03   1.097E+01  7.895E-03 
1.059E+03   1.090E+01  7.818E-03 
1.072E+03   1.082E+01  7.743E-03 
1.084E+03   1.075E+01  7.668E-03 
1.097E+03   1.067E+01  7.594E-03 
1.109E+03   1.059E+01  7.520E-03 
1.122E+03   1.052E+01  7.447E-03 
1.135E+03   1.044E+01  7.375E-03 
1.149E+03   1.036E+01  7.304E-03 
1.162E+03   1.027E+01  7.233E-03 
1.175E+03   1.019E+01  7.163E-03 
1.189E+03   1.011E+01  7.094E-03 
1.203E+03   1.002E+01  7.025E-03 
1.217E+03   9.944E+00  6.957E-03 
1.231E+03   9.870E+00  6.889E-03 
1.245E+03   9.796E+00  6.822E-03 
1.260E+03   9.723E+00  6.756E-03 
1.274E+03   9.650E+00  6.690E-03 
1.289E+03   9.578E+00  6.625E-03 
1.304E+03   9.506E+00  6.561E-03 
1.319E+03   9.435E+00  6.497E-03 
1.334E+03   9.364E+00  6.434E-03 
1.350E+03   9.294E+00  6.371E-03 
1.365E+03   9.224E+00  6.309E-03 
1.381E+03   9.155E+00  6.248E-03 
1.397E+03   9.086E+00  6.187E-03 
1.414E+03   9.018E+00  6.127E-03 
1.430E+03   8.950E+00  6.067E-03 
1.446E+03   8.882E+00  6.008E-03 
1.463E+03   8.815E+00  5.949E-03 
1.480E+03   8.749E+00  5.891E-03 
1.497E+03   8.683E+00  5.834E-03 
1.515E+03   8.617E+00  5.777E-03 
1.532E+03   8.552E+00  5.721E-03 
1.550E+03   8.487E+00  5.665E-03 
1.568E+03   8.422E+00  5.609E-03 
1.586E+03   8.359E+00  5.555E-03 
1.605E+03   8.295E+00  5.500E-03 
1.623E+03   8.232E+00  5.447E-03 
1.642E+03   8.169E+00  5.393E-03 
1.661E+03   8.107E+00  5.341E-03 
1.680E+03   8.045E+00  5.288E-03 
1.700E+03   7.984E+00  5.237E-03 
1.720E+03   7.923E+00  5.185E-03 
1.740E+03   7.862E+00  5.134E-03 
1.760E+03   7.802E+00  5.084E-03 
1.780E+03   7.742E+00  5.034E-03 
1.801E+03   7.683E+00  4.985E-03 
1.822E+03   7.624E+00  4.936E-03 
1.843E+03   7.565E+00  4.888E-03 
1.864E+03   7.507E+00  4.840E-03 
1.886E+03   7.449E+00  4.792E-03 
1.908E+03   7.392E+00  4.745E-03 
1.930E+03   7.335E+00  4.699E-03 
1.952E+03   7.278E+00  4.653E-03 
1.975E+03   7.222E+00  4.607E-03 
1.998E+03   7.166E+00  4.562E-03 
2.021E+03   7.110E+00  4.517E-03 
2.044E+03   7.055E+00  4.472E-03 
2.068E+03   7.000E+00  4.428E-03 
2.092E+03   6.946E+00  4.385E-03 
2.116E+03   6.892E+00  4.342E-03 
2.141E+03   6.838E+00  4.299E-03 
2.166E+03   6.785E+00  4.257E-03 
2.191E+03   6.732E+00  4.215E-03 
2.216E+03   6.679E+00  4.173E-03 
2.242E+03   6.627E+00  4.132E-03 
2.268E+03   6.575E+00  4.091E-03 
2.294E+03   6.523E+00  4.051E-03 
2.321E+03   6.472E+00  4.011E-03 
2.348E+03   6.421E+00  3.971E-03 
2.375E+03   6.371E+00  3.932E-03 
2.403E+03   6.321E+00  3.893E-03 
2.431E+03   6.271E+00  3.855E-03 
2.459E+03   6.221E+00  3.817E-03 
2.487E+03   6.172E+00  3.779E-03 
2.516E+03   6.123E+00  3.742E-03 
2.545E+03   6.075E+00  3.705E-03 
2.575E+03   6.027E+00  3.668E-03 
2.605E+03   5.979E+00  3.632E-03 
2.635E+03   5.931E+00  3.596E-03 
2.665E+03   5.884E+00  3.561E-03 
2.696E+03   5.837E+00  3.525E-03 
2.728E+03   5.791E+00  3.490E-03 
2.759E+03   5.745E+00  3.456E-03 
2.791E+03   5.699E+00  3.422E-03 
2.824E+03   5.653E+00  3.388E-03 
2.856E+03   5.608E+00  3.354E-03 
2.889E+03   5.563E+00  3.321E-03 
2.923E+03   5.518E+00  3.288E-03 
2.957E+03   5.474E+00  3.255E-03 
2.991E+03   5.430E+00  3.223E-03 
3.026E+03   5.386E+00  3.191E-03 
3.061E+03   5.343E+00  3.160E-03 
3.097E+03   5.300E+00  3.128E-03 
3.132E+03   5.257E+00  3.097E-03 
3.169E+03   5.215E+00  3.066E-03 
3.206E+03   5.173E+00  3.036E-03 
3.243E+03   5.131E+00  3.006E-03 
3.280E+03   5.089E+00  2.976E-03 
3.318E+03   5.048E+00  2.946E-03 
3.357E+03   5.007E+00  2.917E-03 
3.396E+03   4.966E+00  2.888E-03 
3.435E+03   4.926E+00  2.859E-03 
3.475E+03   4.886E+00  2.831E-03 
3.515E+03   4.846E+00  2.803E-03 
3.556E+03   4.806E+00  2.775E-03 
3.597E+03   4.767E+00  2.747E-03 
3.639E+03   4.728E+00  2.720E-03 
3.681E+03   4.690E+00  2.693E-03 
3.724E+03   4.651E+00  2.666E-03 
3.767E+03   4.613E+00  2.639E-03 
3.811E+03   4.575E+00  2.613E-03 
3.855E+03   4.538E+00  2.587E-03 
3.900E+03   4.500E+00  2.561E-03 
3.945E+03   4.463E+00  2.536E-03 
3.991E+03   4.426E+00  2.510E-03 
4.037E+03   4.390E+00  2.485E-03 
4.084E+03   4.354E+00  2.461E-03 
4.131E+03   4.318E+00  2.436E-03 
4.179E+03   4.282E+00  2.412E-03 
4.228E+03   4.247E+00  2.388E-03 
4.277E+03   4.211E+00  2.364E-03 
4.326E+03   4.177E+00  2.340E-03 
4.376E+03   4.142E+00  2.317E-03 
4.427E+03   4.107E+00  2.294E-03 
4.479E+03   4.073E+00  2.271E-03 
4.531E+03   4.039E+00  2.248E-03 
4.583E+03   4.006E+00  2.225E-03 
4.636E+03   3.972E+00  2.203E-03 
4.690E+03   3.939E+00  2.181E-03 
4.744E+03   3.906E+00  2.159E-03 
4.799E+03   3.874E+00  2.138E-03 
4.855E+03   3.841E+00  2.116E-03 
4.911E+03   3.809E+00  2.095E-03 
4.968E+03   3.777E+00  2.074E-03 
5.026E+03   3.746E+00  2.053E-03 
5.084E+03   3.714E+00  2.033E-03 
5.143E+03   3.683E+00  2.012E-03 
5.203E+03   3.652E+00  1.992E-03 
5.263E+03   3.621E+00  1.972E-03 
5.324E+03   3.591E+00  1.952E-03 
5.386E+03   3.561E+00  1.933E-03 
5.449E+03   3.530E+00  1.913E-03 
5.512E+03   3.501E+00  1.894E-03 
5.576E+03   3.471E+00  1.875E-03 
5.640E+03   3.442E+00  1.856E-03 
5.706E+03   3.413E+00  1.838E-03 
5.772E+03   3.384E+00  1.819E-03 
5.839E+03   3.355E+00  1.801E-03 
5.907E+03   3.327E+00  1.783E-03 
5.975E+03   3.298E+00  1.765E-03 
6.045E+03   3.270E+00  1.747E-03 
6.115E+03   3.243E+00  1.730E-03 
6.186E+03   3.215E+00  1.712E-03 
6.257E+03   3.188E+00  1.695E-03 
6.330E+03   3.160E+00  1.678E-03 
6.403E+03   3.133E+00  1.661E-03 
6.478E+03   3.107E+00  1.644E-03 
6.553E+03   3.080E+00  1.628E-03 
6.629E+03   3.054E+00  1.612E-03 
6.706E+03   3.028E+00  1.595E-03 
6.783E+03   3.002E+00  1.579E-03 
6.862E+03   2.976E+00  1.563E-03 
6.942E+03   2.951E+00  1.548E-03 
7.022E+03   2.925E+00  1.532E-03 
7.104E+03   2.900E+00  1.517E-03 
7.186E+03   2.875E+00  1.501E-03 
7.269E+03   2.851E+00  1.486E-03 
7.354E+03   2.826E+00  1.471E-03 
7.439E+03   2.802E+00  1.456E-03 
7.525E+03   2.778E+00  1.442E-03 
7.613E+03   2.754E+00  1.427E-03 
7.701E+03   2.730E+00  1.413E-03 
7.790E+03   2.706E+00  1.398E-03 
7.881E+03   2.683E+00  1.384E-03 
7.972E+03   2.660E+00  1.370E-03 
8.064E+03   2.637E+00  1.356E-03 
8.158E+03   2.614E+00  1.343E-03 
8.253E+03   2.591E+00  1.329E-03 
8.348E+03   2.569E+00  1.316E-03 
8.445E+03   2.547E+00  1.302E-03 
8.543E+03   2.525E+00  1.289E-03 
8.642E+03   2.503E+00  1.276E-03 
8.742E+03   2.481E+00  1.263E-03 
8.844E+03   2.459E+00  1.251E-03 
8.946E+03   2.438E+00  1.238E-03 
9.050E+03   2.417E+00  1.225E-03 
9.155E+03   2.396E+00  1.213E-03 
9.261E+03   2.375E+00  1.201E-03 
9.369E+03   2.354E+00  1.189E-03 
9.477E+03   2.334E+00  1.176E-03 
9.587E+03   2.313E+00  1.165E-03 
9.699E+03   2.293E+00  1.153E-03 
9.811E+03   2.273E+00  1.141E-03 
9.925E+03   2.253E+00  1.130E-03 
1.004E+04   2.233E+00  1.118E-03 
1.016E+04   2.214E+00  1.107E-03 
1.027E+04   2.195E+00  1.096E-03 
1.039E+04   2.175E+00  1.084E-03 
1.051E+04   2.156E+00  1.073E-03 
1.064E+04   2.137E+00  1.063E-03 
1.076E+04   2.119E+00  1.052E-03 
1.088E+04   2.100E+00  1.041E-03 
1.101E+04   2.082E+00  1.030E-03 
1.114E+04   2.063E+00  1.020E-03 
1.127E+04   2.045E+00  1.010E-03 
1.140E+04   2.027E+00  9.994E-04 
1.153E+04   2.009E+00  9.893E-04 
1.166E+04   1.992E+00  9.792E-04 
1.180E+04   1.974E+00  9.693E-04 
1.194E+04   1.957E+00  9.594E-04 
1.207E+04   1.939E+00  9.497E-04 
1.221E+04   1.922E+00  9.400E-04 
1.236E+04   1.905E+00  9.305E-04 
1.250E+04   1.889E+00  9.210E-04 
1.264E+04   1.872E+00  9.116E-04 
1.279E+04   1.855E+00  9.024E-04 
1.294E+04   1.839E+00  8.932E-04 
1.309E+04   1.823E+00  8.841E-04 
1.324E+04   1.807E+00  8.751E-04 
1.340E+04   1.791E+00  8.662E-04 
1.355E+04   1.775E+00  8.574E-04 
1.371E+04   1.759E+00  8.486E-04 
1.387E+04   1.743E+00  8.400E-04 
1.403E+04   1.728E+00  8.314E-04 
1.419E+04   1.713E+00  8.230E-04 
1.435E+04   1.698E+00  8.146E-04 
1.452E+04   1.682E+00  8.063E-04 
1.469E+04   1.668E+00  7.981E-04 
1.486E+04   1.653E+00  7.899E-04 
1.503E+04   1.638E+00  7.819E-04 
1.521E+04   1.623E+00  7.739E-04 
1.538E+04   1.609E+00  7.660E-04 
1.556E+04   1.595E+00  7.582E-04 
1.574E+04   1.581E+00  7.505E-04 
1.592E+04   1.567E+00  7.428E-04 
1.611E+04   1.553E+00  7.352E-04 
1.630E+04   1.539E+00  7.277E-04 
1.649E+04   1.525E+00  7.203E-04 
1.668E+04   1.511E+00  7.129E-04 
1.687E+04   1.498E+00  7.057E-04 
1.707E+04   1.485E+00  6.984E-04 
1.726E+04   1.471E+00  6.913E-04 
1.746E+04   1.458E+00  6.842E-04 
1.767E+04   1.445E+00  6.773E-04 
1.787E+04   1.432E+00  6.703E-04 
1.808E+04   1.420E+00  6.635E-04 
1.829E+04   1.407E+00  6.567E-04 
1.850E+04   1.394E+00  6.500E-04 
1.871E+04   1.382E+00  6.433E-04 
1.893E+04   1.370E+00  6.368E-04 
1.915E+04   1.357E+00  6.302E-04 
1.937E+04   1.345E+00  6.238E-04 
1.960E+04   1.333E+00  6.174E-04 
1.983E+04   1.321E+00  6.111E-04 
2.006E+04   1.309E+00  6.048E-04 
2.029E+04   1.298E+00  5.987E-04 
2.052E+04   1.286E+00  5.925E-04 
2.076E+04   1.275E+00  5.865E-04 
2.100E+04   1.263E+00  5.805E-04 
2.125E+04   1.252E+00  5.745E-04 
2.149E+04   1.241E+00  5.686E-04 
2.174E+04   1.230E+00  5.628E-04 
2.199E+04   1.219E+00  5.570E-04 
2.225E+04   1.208E+00  5.513E-04 
2.251E+04   1.197E+00  5.457E-04 
2.277E+04   1.186E+00  5.401E-04 
2.303E+04   1.176E+00  5.345E-04 
2.330E+04   1.165E+00  5.291E-04 
2.357E+04   1.155E+00  5.236E-04 
2.384E+04   1.144E+00  5.183E-04 
2.412E+04   1.134E+00  5.129E-04 
2.440E+04   1.124E+00  5.077E-04 
2.468E+04   1.114E+00  5.025E-04 
2.497E+04   1.104E+00  4.973E-04 
2.526E+04   1.094E+00  4.922E-04 
2.555E+04   1.084E+00  4.872E-04 
2.585E+04   1.074E+00  4.822E-04 
2.615E+04   1.065E+00  4.772E-04 
2.645E+04   1.055E+00  4.723E-04 
2.676E+04   1.046E+00  4.674E-04 
2.707E+04   1.036E+00  4.626E-04 
2.738E+04   1.027E+00  4.579E-04 
2.770E+04   1.018E+00  4.532E-04 
2.802E+04   1.009E+00  4.485E-04 
2.835E+04   9.997E-01  4.439E-04 
2.867E+04   9.907E-01  4.394E-04 
2.901E+04   9.819E-01  4.348E-04 
2.934E+04   9.731E-01  4.304E-04 
2.968E+04   9.643E-01  4.259E-04 
3.003E+04   9.557E-01  4.216E-04 
3.038E+04   9.471E-01  4.172E-04 
3.073E+04   9.387E-01  4.129E-04 
3.109E+04   9.302E-01  4.087E-04 
3.145E+04   9.219E-01  4.045E-04 
3.181E+04   9.137E-01  4.003E-04 
3.218E+04   9.055E-01  3.962E-04 
3.255E+04   8.974E-01  3.921E-04 
3.293E+04   8.893E-01  3.881E-04 
3.331E+04   8.814E-01  3.841E-04 
3.370E+04   8.735E-01  3.801E-04 
3.409E+04   8.657E-01  3.762E-04 
3.449E+04   8.579E-01  3.723E-04 
3.489E+04   8.503E-01  3.685E-04 
3.529E+04   8.426E-01  3.647E-04 
3.570E+04   8.351E-01  3.609E-04 
3.611E+04   8.276E-01  3.572E-04 
3.653E+04   8.203E-01  3.535E-04 
3.696E+04   8.129E-01  3.499E-04 
3.738E+04   8.057E-01  3.463E-04 
3.782E+04   7.985E-01  3.427E-04 
3.826E+04   7.913E-01  3.392E-04 
3.870E+04   7.843E-01  3.357E-04 
3.915E+04   7.773E-01  3.322E-04 
3.960E+04   7.703E-01  3.288E-04 
4.006E+04   7.635E-01  3.254E-04 
4.053E+04   7.567E-01  3.220E-04 
4.100E+04   7.499E-01  3.187E-04 
4.147E+04   7.432E-01  3.154E-04 
4.195E+04   7.366E-01  3.122E-04 
4.244E+04   7.301E-01  3.089E-04 
4.293E+04   7.236E-01  3.057E-04 
4.343E+04   7.171E-01  3.026E-04 
4.394E+04   7.107E-01  2.995E-04 
4.444E+04   7.044E-01  2.964E-04 
4.496E+04   6.982E-01  2.933E-04 
4.548E+04   6.920E-01  2.903E-04 
4.601E+04   6.858E-01  2.873E-04 
4.654E+04   6.797E-01  2.843E-04 
4.708E+04   6.737E-01  2.814E-04 
4.763E+04   6.677E-01  2.784E-04 
4.818E+04   6.618E-01  2.756E-04 
4.874E+04   6.559E-01  2.727E-04 
4.931E+04   6.501E-01  2.699E-04 
4.988E+04   6.444E-01  2.671E-04 
5.046E+04   6.387E-01  2.643E-04 
5.104E+04   6.330E-01  2.616E-04 
5.163E+04   6.275E-01  2.589E-04 
5.223E+04   6.219E-01  2.562E-04 
5.284E+04   6.164E-01  2.536E-04 
5.345E+04   6.110E-01  2.509E-04 
5.407E+04   6.056E-01  2.483E-04 
5.470E+04   6.003E-01  2.458E-04 
5.533E+04   5.950E-01  2.432E-04 
5.597E+04   5.897E-01  2.407E-04 
5.662E+04   5.846E-01  2.382E-04 
5.728E+04   5.794E-01  2.357E-04 
5.794E+04   5.743E-01  2.333E-04 
5.862E+04   5.693E-01  2.309E-04 
5.930E+04   5.643E-01  2.285E-04 
5.998E+04   5.594E-01  2.261E-04 
6.068E+04   5.545E-01  2.238E-04 
6.138E+04   5.496E-01  2.215E-04 
6.210E+04   5.448E-01  2.192E-04 
6.282E+04   5.401E-01  2.169E-04 
6.354E+04   5.353E-01  2.146E-04 
6.428E+04   5.307E-01  2.124E-04 
6.503E+04   5.260E-01  2.102E-04 
6.578E+04   5.215E-01  2.080E-04 
6.654E+04   5.169E-01  2.059E-04 
6.732E+04   5.124E-01  2.037E-04 
6.810E+04   5.080E-01  2.016E-04 
6.889E+04   5.036E-01  1.995E-04 
6.969E+04   4.992E-01  1.975E-04 
7.049E+04   4.949E-01  1.954E-04 
7.131E+04   4.906E-01  1.934E-04 
7.214E+04   4.864E-01  1.914E-04 
7.298E+04   4.822E-01  1.894E-04 
7.382E+04   4.780E-01  1.874E-04 
7.468E+04   4.739E-01  1.855E-04 
7.555E+04   4.698E-01  1.835E-04 
7.642E+04   4.658E-01  1.816E-04 
7.731E+04   4.618E-01  1.797E-04 
7.820E+04   4.578E-01  1.779E-04 
7.911E+04   4.539E-01  1.760E-04 
8.003E+04   4.500E-01  1.742E-04 
8.096E+04   4.462E-01  1.724E-04 
8.190E+04   4.423E-01  1.706E-04 
8.285E+04   4.386E-01  1.688E-04 
8.381E+04   4.348E-01  1.671E-04 
8.478E+04   4.311E-01  1.653E-04 
8.576E+04   4.275E-01  1.636E-04 
8.676E+04   4.238E-01  1.619E-04 
8.776E+04   4.202E-01  1.602E-04 
8.878E+04   4.167E-01  1.586E-04 
8.981E+04   4.132E-01  1.569E-04 
9.085E+04   4.097E-01  1.553E-04 
9.191E+04   4.062E-01  1.537E-04 
9.297E+04   4.028E-01  1.521E-04 
9.405E+04   3.994E-01  1.505E-04 
9.514E+04   3.960E-01  1.489E-04 
9.625E+04   3.927E-01  1.474E-04 
9.736E+04   3.894E-01  1.458E-04 
9.849E+04   3.862E-01  1.443E-04 
9.963E+04   3.830E-01  1.428E-04 
1.008E+05   3.798E-01  1.413E-04 
