{
  "docs": {
    "Docusaurus": ["doc1" , "configurando-ambiente", "template"],
    "First Category": ["doc2"],
    "Second Category": ["doc3"]
  },
  "docs-other": {
    "First Category": ["doc4", "doc5"]
  }
}
