
        digraph autonomous_control {
            __start [shape=point]
            __start -> ON
            
            ON -> OFF [style=dashed]
            
            OFF -> ON [style=dashed]
            
        }
    