
        digraph move {
            __start [shape=point]
            NV [shape=box]
            NR [shape=box]
            
            RI [shape=box]
            
            
            M_ARRIVED [shape=box]
            N_ARRIVED [shape=box]
            
            M_ABORTED [shape=box]
            N_ABORTED [shape=box]
            

            __start -> S [label="start",fontname="times italic"]
            S -> CR
            S -> NV
            CR -> NR
            CR -> RG [label="in_water
 & current_position
 & autonomous 
 / moving"]
            
            RG -> RI [label="not in_water 
 / idle"]
            
            RG -> RI [label="not autonomous 
 / idle"]
            
            RG -> IG [label="interrupt",fontname="times italic"]
            
            RG -> T_ARRIVED
            IG -> T_ARRIVED
            T_ARRIVED -> M_ARRIVED [label="((! at(position)) && at(target)) 
 / idle"]
            T_ARRIVED -> N_ARRIVED
            
            RG -> T_ABORTED
            IG -> T_ABORTED
            T_ABORTED -> M_ABORTED [label="true 
 / idle"]
            T_ABORTED -> N_ABORTED
            
        }
    