// Jest Snapshot v1, https://goo.gl/fbAQLP

exports[`SnapShots tests Testing proxying props 1`] = `
<div
  className="ant-card fluantd-card ant-card-hoverable"
  style={
    Object {
      "borderRadius": 10,
      "width": 300,
    }
  }
>
  <div
    className="ant-card-body"
    style={Object {}}
  >
    <div
      className="fluantd-card-header"
    >
      <h1>
        This is a Header
      </h1>
    </div>
    <div
      className="fluantd-card-body"
    >
      <h2>
        This is a Body
      </h2>
    </div>
    <div
      className="fluantd-card-footer"
    >
      <h3>
        This is a Footer
      </h3>
    </div>
  </div>
</div>
`;

exports[`SnapShots tests renders correctly 1`] = `
<div
  className="ant-card fluantd-card ant-card-bordered"
>
  <div
    className="ant-card-body"
    style={Object {}}
  >
    <div
      className="fluantd-card-header"
    >
      <h1>
        This is a Header
      </h1>
    </div>
    <div
      className="fluantd-card-body"
    >
      <h2>
        This is a Body
      </h2>
    </div>
    <div
      className="fluantd-card-footer"
    >
      <h3>
        This is a Footer
      </h3>
    </div>
  </div>
</div>
`;
