<svg width="25" height="42" viewBox="0 0 25 42" fill="none" xmlns="http://www.w3.org/2000/svg">
<path d="M20.1691 26.9929C22.3485 24.8034 23.5509 21.89 23.5509 18.7945C23.5509 18.1106 22.9983 17.5554 22.3175 17.5554C21.6367 17.5554 21.0841 18.1106 21.0841 18.7945C21.0841 21.2283 20.1381 23.5199 18.4273 25.2431C16.7121 26.9662 14.431 27.9122 12.0084 27.9122H11.8758C9.45328 27.9122 7.1722 26.9618 5.45696 25.2431C3.74173 23.5199 2.80012 21.2283 2.80012 18.7945C2.80012 18.1106 2.24754 17.5554 1.56675 17.5554C0.885961 17.5554 0.333374 18.1106 0.333374 18.7945C0.333374 21.89 1.5358 24.8034 3.71521 26.9929C5.61611 28.9026 8.0696 30.0662 10.7132 30.3327V38.7886H5.23593C4.55514 38.7886 4.00255 39.3438 4.00255 40.0277C4.00255 40.7117 4.55514 41.2668 5.23593 41.2668H18.6439C19.3247 41.2668 19.8773 40.7117 19.8773 40.0277C19.8773 39.3438 19.3247 38.7886 18.6439 38.7886H13.1755V30.3282C15.8147 30.0662 18.2682 28.9026 20.1691 26.9929Z" fill="#31383D"/>
<path fill-rule="evenodd" clip-rule="evenodd" d="M12.2443 25.4525H12.1117C8.44691 25.4525 5.47178 22.468 5.4762 18.7863V6.99944C5.4762 3.31772 8.44691 0.333252 12.1117 0.333252H12.2443C15.9091 0.333252 18.8798 3.31772 18.8798 6.99944V18.7863C18.8798 22.468 15.9091 25.4525 12.2443 25.4525ZM17.8851 5.98241C17.8851 5.65377 17.6199 5.3873 17.2927 5.3873C16.9656 5.3873 16.7048 5.65377 16.7004 5.98241C16.7004 6.31106 16.9656 6.57753 17.2927 6.57753C17.6199 6.57753 17.8851 6.31106 17.8851 5.98241ZM17.2927 7.83438C17.6199 7.83438 17.8851 8.10085 17.8851 8.42949C17.8851 8.75814 17.6199 9.02461 17.2927 9.02461C16.9656 9.02461 16.7004 8.75814 16.7004 8.42949C16.7048 8.10085 16.9656 7.83438 17.2927 7.83438ZM17.8851 10.8766C17.8851 10.5479 17.6199 10.2815 17.2927 10.2815C16.9656 10.2815 16.7048 10.5479 16.7004 10.8766C16.7004 11.2052 16.9656 11.4717 17.2927 11.4717C17.6199 11.4717 17.8851 11.2052 17.8851 10.8766ZM17.2927 12.7285C17.6199 12.7285 17.8851 12.995 17.8851 13.3237C17.8851 13.6523 17.6199 13.9188 17.2927 13.9188C16.9656 13.9188 16.7004 13.6523 16.7004 13.3237C16.7048 12.995 16.9656 12.7285 17.2927 12.7285ZM16.6296 4.79662C16.6296 4.46797 16.3644 4.2015 16.0372 4.2015C15.7145 4.2015 15.4449 4.46797 15.4449 4.79662C15.4449 5.12527 15.7101 5.39174 16.0372 5.39174C16.3644 5.39174 16.6296 5.12527 16.6296 4.79662ZM16.0372 6.64859C16.3644 6.64859 16.6296 6.91506 16.6296 7.2437C16.6296 7.57235 16.3644 7.83882 16.0372 7.83882C15.7101 7.83882 15.4449 7.57235 15.4449 7.2437C15.4493 6.91506 15.7145 6.64859 16.0372 6.64859ZM16.6296 9.69079C16.6296 9.36214 16.3644 9.09567 16.0372 9.09567C15.7145 9.09567 15.4449 9.36214 15.4449 9.69079C15.4449 10.0194 15.7101 10.2859 16.0372 10.2859C16.3644 10.2859 16.6296 10.0194 16.6296 9.69079ZM16.0372 11.5428C16.3644 11.5428 16.6296 11.8092 16.6296 12.1379C16.6296 12.4665 16.3644 12.733 16.0372 12.733C15.7101 12.733 15.4449 12.4665 15.4449 12.1379C15.4493 11.8092 15.7145 11.5428 16.0372 11.5428ZM15.3255 3.53978C15.3255 3.21113 15.0603 2.94466 14.7332 2.94466C14.4105 2.94466 14.1452 3.20669 14.1408 3.53978C14.1408 3.86842 14.406 4.13489 14.7332 4.13489C15.0603 4.13489 15.3255 3.86842 15.3255 3.53978ZM14.7332 5.3873C15.0603 5.3873 15.3255 5.65377 15.3255 5.98241C15.3255 6.31106 15.0603 6.57753 14.7332 6.57753C14.406 6.57753 14.1408 6.31106 14.1408 5.98241C14.1452 5.65377 14.4105 5.3873 14.7332 5.3873ZM15.3255 8.42949C15.3255 8.10085 15.0603 7.83438 14.7332 7.83438C14.4105 7.83438 14.1452 8.10085 14.1408 8.42949C14.1408 8.75814 14.406 9.02461 14.7332 9.02461C15.0603 9.02461 15.3255 8.75814 15.3255 8.42949ZM14.7332 10.2815C15.0603 10.2815 15.3255 10.5479 15.3255 10.8766C15.3255 11.2052 15.0603 11.4717 14.7332 11.4717C14.406 11.4717 14.1408 11.2052 14.1408 10.8766C14.1452 10.5479 14.4105 10.2815 14.7332 10.2815ZM15.3255 13.3237C15.3255 12.995 15.0603 12.7285 14.7332 12.7285C14.4105 12.7285 14.1452 12.995 14.1408 13.3237C14.1408 13.6523 14.406 13.9188 14.7332 13.9188C15.0603 13.9188 15.3255 13.6523 15.3255 13.3237ZM13.4821 1.75442C13.8092 1.75442 14.0745 2.02089 14.0745 2.34954C14.0745 2.67818 13.8092 2.94465 13.4821 2.94465C13.155 2.94465 12.8897 2.67818 12.8897 2.34954C12.8897 2.02089 13.155 1.75442 13.4821 1.75442ZM14.0745 4.79662C14.0745 4.46797 13.8092 4.2015 13.4821 4.2015C13.155 4.2015 12.8897 4.46797 12.8897 4.79662C12.8897 5.12527 13.155 5.39174 13.4821 5.39174C13.8092 5.39174 14.0745 5.12527 14.0745 4.79662ZM13.4821 6.64859C13.8092 6.64859 14.0745 6.91506 14.0745 7.2437C14.0745 7.57235 13.8092 7.83882 13.4821 7.83882C13.155 7.83882 12.8897 7.57235 12.8897 7.2437C12.8897 6.91506 13.155 6.64859 13.4821 6.64859ZM14.0745 9.69079C14.0745 9.36214 13.8092 9.09567 13.4821 9.09567C13.155 9.09567 12.8897 9.36214 12.8897 9.69079C12.8897 10.0194 13.155 10.2859 13.4821 10.2859C13.8092 10.2859 14.0745 10.0194 14.0745 9.69079ZM13.4821 11.5428C13.8092 11.5428 14.0745 11.8092 14.0745 12.1379C14.0745 12.4665 13.8092 12.733 13.4821 12.733C13.155 12.733 12.8897 12.4665 12.8897 12.1379C12.8897 11.8092 13.155 11.5428 13.4821 11.5428ZM12.7704 3.53978C12.7704 3.21113 12.5051 2.94466 12.178 2.94466C11.8509 2.94466 11.5856 3.20669 11.5856 3.53978C11.5856 3.86842 11.8509 4.13489 12.178 4.13489C12.5051 4.13489 12.7704 3.86842 12.7704 3.53978ZM12.178 5.3873C12.5051 5.3873 12.7704 5.65377 12.7704 5.98241C12.7704 6.31106 12.5051 6.57753 12.178 6.57753C11.8509 6.57753 11.5856 6.31106 11.5856 5.98241C11.5856 5.65377 11.8509 5.3873 12.178 5.3873ZM12.7704 8.42949C12.7704 8.10085 12.5051 7.83438 12.178 7.83438C11.8509 7.83438 11.5856 8.10085 11.5856 8.42949C11.5856 8.75814 11.8509 9.02461 12.178 9.02461C12.5051 9.02461 12.7704 8.75814 12.7704 8.42949ZM12.178 10.2815C12.5051 10.2815 12.7704 10.5479 12.7704 10.8766C12.7704 11.2052 12.5051 11.4717 12.178 11.4717C11.8509 11.4717 11.5856 11.2052 11.5856 10.8766C11.5856 10.5479 11.8509 10.2815 12.178 10.2815ZM12.7704 13.3237C12.7704 12.995 12.5051 12.7285 12.178 12.7285C11.8509 12.7285 11.5856 12.995 11.5856 13.3237C11.5856 13.6523 11.8509 13.9188 12.178 13.9188C12.5051 13.9188 12.7704 13.6523 12.7704 13.3237ZM10.9225 1.75442C11.2496 1.75442 11.5149 2.02089 11.5149 2.34954C11.5149 2.67818 11.2496 2.94465 10.9225 2.94465C10.5954 2.94465 10.3301 2.67818 10.3301 2.34954C10.3301 2.02089 10.5954 1.75442 10.9225 1.75442ZM11.5149 4.79662C11.5149 4.46797 11.2496 4.2015 10.9225 4.2015C10.5954 4.2015 10.3301 4.46797 10.3301 4.79662C10.3301 5.12527 10.5954 5.39174 10.9225 5.39174C11.2496 5.39174 11.5149 5.12527 11.5149 4.79662ZM10.9225 6.64859C11.2496 6.64859 11.5149 6.91506 11.5149 7.2437C11.5149 7.57235 11.2496 7.83882 10.9225 7.83882C10.5954 7.83882 10.3301 7.57235 10.3301 7.2437C10.3301 6.91506 10.5954 6.64859 10.9225 6.64859ZM11.5149 9.69079C11.5149 9.36214 11.2496 9.09567 10.9225 9.09567C10.5954 9.09567 10.3301 9.36214 10.3301 9.69079C10.3301 10.0194 10.5954 10.2859 10.9225 10.2859C11.2496 10.2859 11.5149 10.0194 11.5149 9.69079ZM10.9225 11.5428C11.2496 11.5428 11.5149 11.8092 11.5149 12.1379C11.5149 12.4665 11.2496 12.733 10.9225 12.733C10.5954 12.733 10.3301 12.4665 10.3301 12.1379C10.3301 11.8092 10.5954 11.5428 10.9225 11.5428ZM10.2108 3.53978C10.2108 3.21113 9.94555 2.94466 9.61842 2.94466C9.29128 2.94466 9.02604 3.20669 9.02604 3.53978C9.02604 3.86842 9.29128 4.13489 9.61842 4.13489C9.94555 4.13489 10.2108 3.86842 10.2108 3.53978ZM9.61842 5.3873C9.94555 5.3873 10.2108 5.65377 10.2108 5.98241C10.2108 6.31106 9.94555 6.57753 9.61842 6.57753C9.29128 6.57753 9.02604 6.31106 9.02604 5.98241C9.02604 5.65377 9.29128 5.3873 9.61842 5.3873ZM10.2108 8.42949C10.2108 8.10085 9.94555 7.83438 9.61842 7.83438C9.29128 7.83438 9.02604 8.10085 9.02604 8.42949C9.02604 8.75814 9.29128 9.02461 9.61842 9.02461C9.94555 9.02461 10.2108 8.75814 10.2108 8.42949ZM9.61842 10.2815C9.94555 10.2815 10.2108 10.5479 10.2108 10.8766C10.2108 11.2052 9.94555 11.4717 9.61842 11.4717C9.29128 11.4717 9.02604 11.2052 9.02604 10.8766C9.02604 10.5479 9.29128 10.2815 9.61842 10.2815ZM10.2108 13.3237C10.2108 12.995 9.94555 12.7285 9.61842 12.7285C9.29128 12.7285 9.02604 12.995 9.02604 13.3237C9.02604 13.6523 9.29128 13.9188 9.61842 13.9188C9.94555 13.9188 10.2108 13.6523 10.2108 13.3237ZM8.36292 4.2015C8.69005 4.2015 8.9553 4.46797 8.9553 4.79662C8.9553 5.12527 8.69005 5.39174 8.36292 5.39174C8.03579 5.39174 7.77055 5.12527 7.77055 4.79662C7.77497 4.46797 8.03579 4.2015 8.36292 4.2015ZM8.9553 7.2437C8.9553 6.91506 8.69005 6.64859 8.36292 6.64859C8.03579 6.64859 7.77497 6.91506 7.77055 7.2437C7.77055 7.57235 8.03579 7.83882 8.36292 7.83882C8.69005 7.83882 8.9553 7.57235 8.9553 7.2437ZM8.36292 9.09567C8.69005 9.09567 8.9553 9.36214 8.9553 9.69079C8.9553 10.0194 8.69005 10.2859 8.36292 10.2859C8.03579 10.2859 7.77055 10.0194 7.77055 9.69079C7.77497 9.36214 8.03579 9.09567 8.36292 9.09567ZM8.9553 12.1379C8.9553 11.8092 8.69005 11.5428 8.36292 11.5428C8.03579 11.5428 7.77497 11.8092 7.77055 12.1379C7.77055 12.4665 8.03579 12.733 8.36292 12.733C8.69005 12.733 8.9553 12.4665 8.9553 12.1379ZM7.0588 5.3873C7.38594 5.3873 7.65118 5.65377 7.65118 5.98241C7.65118 6.31106 7.38594 6.57753 7.0588 6.57753C6.73167 6.57753 6.46643 6.31106 6.46643 5.98241C6.46643 5.65377 6.73167 5.3873 7.0588 5.3873ZM7.65118 8.42949C7.65118 8.10085 7.38594 7.83438 7.0588 7.83438C6.73167 7.83438 6.46643 8.10085 6.46643 8.42949C6.46643 8.75814 6.73167 9.02461 7.0588 9.02461C7.38594 9.02461 7.65118 8.75814 7.65118 8.42949ZM7.0588 10.2815C7.38594 10.2815 7.65118 10.5479 7.65118 10.8766C7.65118 11.2052 7.38594 11.4717 7.0588 11.4717C6.73167 11.4717 6.46643 11.2052 6.46643 10.8766C6.46643 10.5479 6.73167 10.2815 7.0588 10.2815ZM7.06324 12.7285C6.73611 12.7285 6.47087 12.995 6.47087 13.3237C6.47087 13.6523 6.73611 13.9188 7.06324 13.9188C7.39037 13.9188 7.65561 13.6523 7.65561 13.3237C7.65561 12.995 7.39037 12.7285 7.06324 12.7285Z" fill="#31383D"/>
</svg>
