%YAML 1.1
%TAG !u! tag:unity3d.com,2011:
--- !u!1001 &6445883136195129943
PrefabInstance:
  m_ObjectHideFlags: 0
  serializedVersion: 2
  m_Modification:
    m_TransformParent: {fileID: 0}
    m_Modifications:
    - target: {fileID: 114526028, guid: f0b038078591d7441bbc6586bbc421d2, type: 3}
      propertyPath: m_Name
      value: Rock8
      objectReference: {fileID: 0}
    - target: {fileID: 114526032, guid: f0b038078591d7441bbc6586bbc421d2, type: 3}
      propertyPath: m_LocalPosition.x
      value: -48.3
      objectReference: {fileID: 0}
    - target: {fileID: 114526032, guid: f0b038078591d7441bbc6586bbc421d2, type: 3}
      propertyPath: m_LocalPosition.y
      value: 0
      objectReference: {fileID: 0}
    - target: {fileID: 114526032, guid: f0b038078591d7441bbc6586bbc421d2, type: 3}
      propertyPath: m_LocalPosition.z
      value: 87.1
      objectReference: {fileID: 0}
    - target: {fileID: 114526032, guid: f0b038078591d7441bbc6586bbc421d2, type: 3}
      propertyPath: m_LocalRotation.x
      value: -0
      objectReference: {fileID: 0}
    - target: {fileID: 114526032, guid: f0b038078591d7441bbc6586bbc421d2, type: 3}
      propertyPath: m_LocalRotation.y
      value: 0.7939703
      objectReference: {fileID: 0}
    - target: {fileID: 114526032, guid: f0b038078591d7441bbc6586bbc421d2, type: 3}
      propertyPath: m_LocalRotation.z
      value: -0
      objectReference: {fileID: 0}
    - target: {fileID: 114526032, guid: f0b038078591d7441bbc6586bbc421d2, type: 3}
      propertyPath: m_LocalRotation.w
      value: 0.6079566
      objectReference: {fileID: 0}
    - target: {fileID: 114526032, guid: f0b038078591d7441bbc6586bbc421d2, type: 3}
      propertyPath: m_RootOrder
      value: 0
      objectReference: {fileID: 0}
    - target: {fileID: 114526032, guid: f0b038078591d7441bbc6586bbc421d2, type: 3}
      propertyPath: m_LocalEulerAnglesHint.x
      value: 0
      objectReference: {fileID: 0}
    - target: {fileID: 114526032, guid: f0b038078591d7441bbc6586bbc421d2, type: 3}
      propertyPath: m_LocalEulerAnglesHint.y
      value: 105.116005
      objectReference: {fileID: 0}
    - target: {fileID: 114526032, guid: f0b038078591d7441bbc6586bbc421d2, type: 3}
      propertyPath: m_LocalEulerAnglesHint.z
      value: 0
      objectReference: {fileID: 0}
    - target: {fileID: 114526032, guid: f0b038078591d7441bbc6586bbc421d2, type: 3}
      propertyPath: m_LocalScale.x
      value: 50
      objectReference: {fileID: 0}
    - target: {fileID: 114526032, guid: f0b038078591d7441bbc6586bbc421d2, type: 3}
      propertyPath: m_LocalScale.y
      value: 50
      objectReference: {fileID: 0}
    - target: {fileID: 114526032, guid: f0b038078591d7441bbc6586bbc421d2, type: 3}
      propertyPath: m_LocalScale.z
      value: 50
      objectReference: {fileID: 0}
    m_RemovedComponents: []
  m_SourcePrefab: {fileID: 100100000, guid: f0b038078591d7441bbc6586bbc421d2, type: 3}
