// Jest Snapshot v1, https://goo.gl/fbAQLP

exports[`ExtendableInput should match snapshot 1`] = `
<div
  className="extendable-input-container"
>
  <img
    alt="icon template mock"
    src=""
    srcSet=" 2x,  3x"
  />
  <input
    className="extendable-input-container__input"
    onChange={[Function]}
    placeholder="placeholder"
  />
</div>
`;
