id;libelle
1;Allergologie
2;Anesthésie, réanimation
3;Antalgiques
4;Anti-inflammatoires
5;Contraception et interruption de grossesse
6;Dermatologie
7;Gastro-Entéro-Hépatologie
8;Hémostase et sang
9;Métabolisme et nutrition
10;Oto-rhino-laryngologie
