{
    "fluentMethods": true,
    "clientRootFolder": "",
    "relationships": [
        {
            "relationshipName": "produit",
            "otherEntityName": "produit",
            "relationshipType": "one-to-many",
            "otherEntityRelationshipName": "rayon"
        }
    ],
    "fields": [
        {
            "fieldName": "libelle",
            "fieldType": "String",
            "fieldValidateRules": [
                "required"
            ]
        }
    ],
    "changelogDate": "20191004233203",
    "dto": "no",
    "searchEngine": false,
    "service": "serviceImpl",
    "entityTableName": "rayon",
    "databaseType": "sql",
    "jpaMetamodelFiltering": false,
    "pagination": "pagination"
}
