id;designation;actif
1;ABSTRAL 200 µG, Comprimé sublingual;true
2;ACARD 50 MG, Comprimé pelliculé;true
3;ACDigest, Gélule;true
4;BACTALL 500 MG, Comprimé enrobé;true
5;BAITANET D , Solution dermique;true
6;CURTEC 10 MG, Comprimé;true
7;DAFLON 1000 MG, Comprimé pelliculé;true
8;DEPAKINE CHRONO 500 MG, Comprimé pelliculé;true
9;DIALYSOL ACIDE, Concentré pour hémodialyse;true
10;DOLIPRANE 1 G, Suppositoire;true
11;DOLIPRANE 100 MG, Sachet;true
12;DOLIPRANE 500 MG, Comprimé effervescent;true
13;RHINOFEBRAL, Gélule;true
14;RHUMIX400 MG / 300 MG / 200 MG / 60 MG / 25 MG / 4 MG, Sachet;true
15;RINOMICINE400 MG / 4 MG / 200 MG / 6 MG / 30 MG / 300 MG , Sachet;true
