{
    "fluentMethods": true,
    "clientRootFolder": "",
    "relationships": [
        {
            "relationshipName": "produit",
            "otherEntityName": "produit",
            "relationshipType": "one-to-many",
            "otherEntityRelationshipName": "grossiste"
        }
    ],
    "fields": [
        {
            "fieldName": "raisonSociale",
            "fieldType": "String",
            "fieldValidateRules": [
                "required"
            ]
        },
        {
            "fieldName": "adresse",
            "fieldType": "String",
            "fieldValidateRules": [
                "required"
            ]
        },
        {
            "fieldName": "tel",
            "fieldType": "Long",
            "fieldValidateRules": [
                "required"
            ]
        }
    ],
    "changelogDate": "20191004234111",
    "dto": "no",
    "searchEngine": false,
    "service": "serviceImpl",
    "entityTableName": "grossiste",
    "databaseType": "sql",
    "jpaMetamodelFiltering": false,
    "pagination": "pagination"
}
