material {
    name : "Textured material",
    parameters : [
        {
           type : sampler2d,
           name : texture
        },
        {
           type : float,
           name : ambient
        }
    ],
    requires : [
        uv0
    ],
    shadingModel : lit,
    blending : opaque
}

fragment {
    void material(inout MaterialInputs material) {
        prepareMaterial(material);
        material.baseColor = texture(materialParams_texture, getUV0());
        material.ambientOcclusion = materialParams.ambient;
        material.roughness = 1.0;
    }
}
