{
    "templateID": "feedback_template",
    "templateParameters": {
        "user_name":"Radu",
        "verb":"you drank",
        "food":"fruit juice",
        "approx_quantity":"too much",
        "expected_quantity":"200",
        "actual_quantity":"300",
        "timespan":"week",
        "preposition":"of maximum",
        "unit": "ml"
    }
}