{
    "templateID": "feedback_template",
    "templateParameters": {
        "user_name":"Radu",
        "verb":"you ate",
        "food":"vegetables",
        "approx_quantity":"too few",
        "expected_quantity":"3",
        "actual_quantity":"1",
        "timespan":"today",
        "preposition":"of",
        "unit": "portions"
    }
}