{"violations":
    [
        {
            "violationId": "violation_1W7rKL5r24STzZjE6dSkJ42hl97GKjQGO7LYboKK2668yRF4S8_MR-DIET-015-NWEEK_1552300514392",
            "user": "1W7rKL5r24STzZjE6dSkJ42hl97GKjQGO7LYboKK2668yRF4S8",
            "rule": "MR-DIET-015-NWEEK",
            "ruleId": "MR-DIET-015-NWEEK",
            "timestamp": "1552300514392",
            "entityType": "FOODCATEGORY",
            "entity": "SausagesAndColdCuts",
            "timing": "Week",
            "quantity": "2",
            "expectedQuantity": "1",
            "meals": [
                "MEAL-meal-1552300514391",
                "MEAL-meal-1552300514392"
            ],
            "goals": [],
            "goalsConstraints": [],
            "priority": "1",
            "level": "4",
            "constraint": "less",
            "history": "1"
        }
    ]
}