{
    "templateID": "suggestion_template",
    "templateParameters": {
        "intro":"Tomorrow",
        "verb":"try to eat",
        "preposition":"",
        "alternative":"more vegetables"
    }
}