map:
  boundary: [
    # Bottom
    [ 
      [-27.32,  13.72, -05.15, -10.97,  12.36, -05.15 ],
      [-10.97,  12.36, -05.15, -10.37,  19.58, -05.15 ],
      [-10.37,  19.58, -05.15, -26.72,  20.95, -05.15 ],
      [-26.72,  20.95, -05.15, -27.32,  13.72, -05.15 ]
    ],
    # Top
    [
      [-27.32,  13.72,  -0.882, -26.72,  20.95,  -0.882 ],
      [-26.72,  20.95,  -0.882, -10.37,  19.58,  -0.882 ],
      [-10.37,  19.58,  -0.882, -10.97,  12.36,  -0.882 ],
      [-10.97,  12.36,  -0.882, -27.32,  13.72,  -0.882 ]
    ],
    # Sides
    [
      [-27.32,  13.72, -05.15, -26.72,  20.95, -05.15 ],
      [-26.72,  20.95, -05.15, -26.72,  20.95,  -0.882 ],
      [-26.72,  20.95,  -0.882, -27.32,  13.72,  -0.882 ],
      [-27.32,  13.72,  -0.882, -27.32,  13.72, -05.15 ]
    ],
    [
      [-10.97,  12.36, -05.15, -10.97,  12.36,  -0.882 ],
      [-10.97,  12.36,  -0.882, -10.37,  19.58,  -0.882 ],
      [-10.37,  19.58,  -0.882, -10.37,  19.58, -05.15 ],
      [-10.37,  19.58, -05.15, -10.97,  12.36, -05.15 ]
    ],
    [
      [-27.32,  13.72, -05.15, -27.32,  13.72,  -0.882 ],
      [-27.32,  13.72,  -0.882, -10.97,  12.36,  -0.882 ],
      [-10.97,  12.36,  -0.882, -10.97,  12.36, -05.15 ],
      [-10.97,  12.36, -05.15, -27.32,  13.72, -05.15 ]
    ],
    [
      [-26.72,  20.95, -05.15, -10.37,  19.58, -05.15 ],
      [-10.37,  19.58, -05.15, -10.37,  19.58,  -0.882 ],
      [-10.37,  19.58,  -0.882, -26.72,  20.95,  -0.882 ],
      [-26.72,  20.95,  -0.882, -26.72,  20.95, -05.15 ]
    ]
  ]
  
  obstacles: [