{
  "viewports":
  [
    {"type": "viewport",
     "name": "ViewPortLeft",
     "image": "T1",
     "annotation": "",
     "x": 0,
     "y": 0
    },
    {"type": "viewport",
     "name": "ViewPortMiddle",
     "image": "T2",
     "annotation": "",
     "x": 1,
     "y": 0
    },
    {"type": "viewport",
     "name": "ViewPortRight",
     "image": "SUSCEPT",
     "annotation": "",
     "x": 2,
     "y": 0
    }
  ],
  "qa_fields":
  [
    {"type": "qa_field",
     "name": "radio_test",
     "x": 0,
     "y": 0
    },
    {"type": "qa_field",
     "name": "string_test",
     "x": 0,
     "y": 1
    },
    {"type": "qa_field",
     "name": "float_test",
     "x": 0,
     "y": 3
    },
    {"type": "qa_field",
     "name": "int_test",
     "x": 0,
     "y": 4
    },
    {"type": "qa_field",
     "name": "checkbox_test",
     "x": 0,
     "y": 5
    }     
  ],
  "mdl_layout": "Horizontal {{ Grid {{ {viewports} }} Vertical {{ Grid {{ {qa_fields} }} {sop} }} }}"
}
