{
  "comment": ["# RSS incidental findings task template"
],
"template_name": "incidental_findings",
"sop": "",
"viewports": [
  {
    "name": "ViewPortLeft",
    "scan": "T1",
    "linked": true,
    "y": 0,
    "x": 0,
    "type": "viewport",
    "orientation": "Transversal",
    "annotation": null
  },
  {
    "name": "ViewPortRight",
    "scan": "FLAIR",
    "linked": true,
    "y": 0,
    "x": 1,
    "type": "viewport",
    "orientation": "Transversal",
    "annotation": null
  }
],
"qa_fields": {
  "tabs": {
    "control": "TabsWidget",
    "label": "tabs",
    "content": {
      "Incidental Findings": {
        "if_tabs": {
          "control": "TabsWidget",
          "label": "tabs",
          "content": {
            "Cysts": {
              "cysts": {
                "control": "ListingWidget",
                "initial_value": null,
                "documentation": "",
                "label": "cysts",
                "content": {
                  "if_cyst_marker": {
                    "control": "MarkerEdit",
                    "documentation": "",
                    "max_number": 1,
                    "label": "Add Marker",
                    "marker_type": 2,
                    "y": 0,
                    "x": 0,
                    "hint_text": "",
                    "type": "Markers"
                  },
                  "if_cyst_consensus": {
                    "control": "CheckBox",
                    "initial_value": false,
                    "label": "request consensus",
                    "alert_on_checked": true,
                    "y": 3,
                    "x": 0,
                    "type": "Bool"
                  },
                  "if_cyst_consensus_description": {
                    "control": "TextBox",
                    "visible_on": "if_cyst_consensus",
                    "initial_value": "",
                    "label": "request consensus description",
                    "y": 4,
                    "x": 0,
                    "type": "String"
                  },
                  "if_cyst_final_comments": {
                    "control": "TextBox",
                    "initial_value": "",
                    "label": "Final comments",
                    "y": 5,
                    "x": 0,
                    "type": "String"
                  },
                  "if_cyst_type": {
                    "control": "ComboBox",
                    "initial_value": "",
                    "documentation": "",
                    "label": "Type",
                    "y": 1,
                    "x": 0,
                    "type": "Enum",
                    "options": [
                      "Arachnoid - Cerebellum",
                      "Arachnoid - Temporal",
                      "Arachnoid - Other",
                      "Ependymal",
                      "Thornwaldt",
                      "Pineal",
                      "Dermoid",
                      "Sebaceous",
                      "Pituitary"
                    ]
                  },
                  "if_cyst_size": {
                    "control": "NumberEdit",
                    "initial_value": "",
                    "label": "size",
                    "y": 2,
                    "x": 0,
                    "type": "Float"
                  }
                },
                "y": 0,
                "x": 0,
                "type": "FieldDataList",
                "columns": [
                  "if_cyst_type",
                  "if_cyst_size"
                ]
              },
              "no_cysts": {
                "y": 1,
                "x": 0,
                "control": "CheckBox",
                "type": "Bool",
                "initial_value": false,
                "label": "No cysts present"
              }
            },
            "Tumors": {
              "tumors": {
                "control": "ListingWidget",
                "initial_value": null,
                "documentation": "",
                "label": "Tumors",
                "content": {
                  "if_tumor_marker": {
                    "control": "MarkerEdit",
                    "documentation": "",
                    "max_number": 1,
                    "label": "Add Marker",
                    "marker_type": 1,
                    "y": 0,
                    "x": 0,
                    "hint_text": "",
                    "type": "Markers"
                  },
                  "if_tumor_consensus": {
                    "control": "CheckBox",
                    "initial_value": false,
                    "label": "request consensus",
                    "alert_on_checked": true,
                    "y": 3,
                    "x": 0,
                    "type": "Bool"
                  },
                  "if_tumor_consensus_description": {
                    "control": "TextBox",
                    "visible_on": "if_tumor_consensus",
                    "initial_value": "",
                    "label": "request consensus description",
                    "y": 4,
                    "x": 0,
                    "type": "String"
                  },
                  "if_tumor_final_comments": {
                    "control": "TextBox",
                    "initial_value": "",
                    "label": "Final comments",
                    "y": 5,
                    "x": 0
                  },
                  "if_tumor_type": {
                    "control": "ComboBox",
                    "initial_value": "",
                    "documentation": "",
                    "label": "type",
                    "y": 1,
                    "x": 0,
                    "type": "Enum",
                    "options": [
                      "Meningioma ST",
                      "Meningioma IT",
                      "Lipoma",
                      "Hemangioma",
                      "Cavernous angioma",
                      "Salivary gland tumor",
                      "Ependymoma",
                      "Glioma",
                      "Schwannoma nV",
                      "Schwannoma nVIII"
                    ]
                  },
                  "if_tumor_size": {
                    "control": "NumberEdit",
                    "initial_value": "",
                    "label": "size",
                    "y": 2,
                    "x": 0,
                    "type": "Float"
                  }
                },
                "y": 0,
                "x": 0,
                "type": "FieldDataList",
                "columns": [
                  "if_tumor_type",
                  "if_tumor_size"
                ]
              },
              "no_tumors": {
                "y": 1,
                "x": 0,
                "control": "CheckBox",
                "type": "Bool",
                "initial_value": false,
                "label": "No tumors present"
              }
            },
            "Other": {
              "if_other": {
                "control": "BoxWidget",
                "label": "Other",
                "content": {
                  "if_other_description": {
                    "control": "TextBox",
                    "initial_value": "",
                    "documentation": "",
                    "label": "Other",
                    "y": 0,
                    "x": 0,
                    "type": "String"
                  }
                },
                "y": 2,
                "x": 1,
                "align_title": "Center",
                "type": "FieldData"
              },
              "if_fourth": {
                "control": "BoxWidget",
                "label": "",
                "content": {
                  "if_other_kele_cerebrum": {
                    "control": "CheckBox",
                    "initial_value": false,
                    "documentation": "",
                    "label": "Kele cerebrum",
                    "y": 2,
                    "x": 0,
                    "type": "Bool"
                  },
                  "if_other_kele_cerebellum": {
                    "control": "CheckBox",
                    "initial_value": false,
                    "documentation": "",
                    "label": "Kele cerebellum",
                    "y": 1,
                    "x": 0,
                    "type": "Bool"
                  },
                  "if_other_sdh": {
                    "control": "CheckBox",
                    "initial_value": false,
                    "documentation": "",
                    "label": "SDH",
                    "y": 0,
                    "x": 0,
                    "type": "Bool"
                  },
                  "if_other_ectopic_gm": {
                    "control": "CheckBox",
                    "initial_value": false,
                    "documentation": "",
                    "label": "Ectopic GM",
                    "y": 3,
                    "x": 0,
                    "type": "Bool"
                  },
                  "if_other_mastoid_fluid": {
                    "control": "CheckBox",
                    "initial_value": false,
                    "documentation": "",
                    "label": "Mastoid fluid",
                    "y": 4,
                    "x": 0,
                    "type": "Bool"
                  }
                },
                "y": 1,
                "x": 1,
                "align_title": "Center",
                "type": "FieldData"
              },
              "if_second": {
                "control": "BoxWidget",
                "label": "",
                "content": {
                  "if_other_DVA": {
                    "control": "CheckBox",
                    "initial_value": false,
                    "documentation": "",
                    "label": "DVA",
                    "y": 0,
                    "x": 0,
                    "type": "Bool"
                  },
                  "if_other_sup_siderosis": {
                    "control": "CheckBox",
                    "initial_value": false,
                    "documentation": "",
                    "label": "Sup. siderosis",
                    "y": 3,
                    "x": 0,
                    "type": "Bool"
                  },
                  "if_other_dural_av": {
                    "control": "CheckBox",
                    "initial_value": false,
                    "documentation": "",
                    "label": "Dural AV fistula",
                    "y": 4,
                    "x": 0,
                    "type": "Bool"
                  },
                  "if_other_AVM": {
                    "control": "CheckBox",
                    "initial_value": false,
                    "documentation": "",
                    "label": "AVM",
                    "y": 1,
                    "x": 0,
                    "type": "Bool"
                  },
                  "if_other_PTA": {
                    "control": "CheckBox",
                    "initial_value": false,
                    "documentation": "",
                    "label": "PTA",
                    "y": 2,
                    "x": 0,
                    "type": "Bool"
                  }
                },
                "y": 1,
                "x": 0,
                "align_title": "Center",
                "type": "FieldData"
              },
              "if_pituitary": {
                "control": "BoxWidget",
                "label": "Pituitary",
                "content": {
                  "if_other_macroadenoma": {
                    "control": "CheckBox",
                    "initial_value": false,
                    "documentation": "",
                    "label": "Macroadenoma",
                    "y": 2,
                    "x": 0,
                    "type": "Bool"
                  },
                  "if_other_empty_sella": {
                    "control": "CheckBox",
                    "initial_value": false,
                    "documentation": "",
                    "label": "Empty sella",
                    "y": 0,
                    "x": 0,
                    "type": "Bool"
                  },
                  "if_other_hemorrhage": {
                    "control": "CheckBox",
                    "initial_value": false,
                    "documentation": "",
                    "label": "Hemorrhage",
                    "y": 3,
                    "x": 0,
                    "type": "Bool"
                  },
                  "if_other_microadenoma": {
                    "control": "CheckBox",
                    "initial_value": false,
                    "documentation": "",
                    "label": "Microadenoma",
                    "y": 1,
                    "x": 0,
                    "type": "Bool"
                  }
                },
                "y": 0,
                "x": 0,
                "align_title": "Center",
                "type": "FieldData"
              },
              "if_calcifications": {
                "control": "BoxWidget",
                "label": "Calcifications",
                "content": {
                  "if_other_choroid_plexus": {
                    "control": "CheckBox",
                    "initial_value": false,
                    "documentation": "",
                    "label": "Choroid plexus",
                    "y": 9,
                    "x": 0,
                    "type": "Bool"
                  },
                  "if_other_globus_pallidus": {
                    "control": "CheckBox",
                    "initial_value": false,
                    "documentation": "",
                    "label": "Globus Pallidus",
                    "y": 10,
                    "x": 0,
                    "type": "Bool"
                  },
                  "if_other_falx_cerebri": {
                    "control": "CheckBox",
                    "initial_value": false,
                    "documentation": "",
                    "label": "Falx cerebri",
                    "y": 11,
                    "x": 0,
                    "type": "Bool"
                  },
                  "if_other_hippocampus": {
                    "control": "CheckBox",
                    "initial_value": false,
                    "documentation": "",
                    "label": "Hippocampus",
                    "y": 12,
                    "x": 0,
                    "type": "Bool"
                  }
                },
                "y": 0,
                "x": 1,
                "align_title": "Center",
                "type": "FieldData"
              },
              "if_fifth": {
                "control": "BoxWidget",
                "label": "",
                "content": {
                  "if_other_carotid_occl_r": {
                    "control": "CheckBox",
                    "initial_value": false,
                    "documentation": "",
                    "label": "Carotid occl. R",
                    "y": 4,
                    "x": 0,
                    "type": "Bool"
                  },
                  "if_other_hyperostosis": {
                    "control": "CheckBox",
                    "initial_value": false,
                    "documentation": "",
                    "label": "Hyperostosis",
                    "y": 0,
                    "x": 0,
                    "type": "Bool"
                  },
                  "if_other_cavum_sept": {
                    "control": "CheckBox",
                    "initial_value": false,
                    "documentation": "",
                    "label": "Cavum sept. pel.",
                    "y": 2,
                    "x": 0,
                    "type": "Bool"
                  },
                  "if_other_fibrous_dyspl": {
                    "control": "CheckBox",
                    "initial_value": false,
                    "documentation": "",
                    "label": "Fibrous dyspl.",
                    "y": 1,
                    "x": 0,
                    "type": "Bool"
                  },
                  "if_other_carotid_occl_l": {
                    "control": "CheckBox",
                    "initial_value": false,
                    "documentation": "",
                    "label": "Carotid occl. L",
                    "y": 3,
                    "x": 0,
                    "type": "Bool"
                  }
                },
                "y": 2,
                "x": 0,
                "align_title": "Center",
                "type": "FieldData"
              },
              "if_other_consensus": {
                "control": "CheckBox",
                "initial_value": false,
                "label": "request consensus",
                "alert_on_checked": true,
                "y": 3,
                "x": 0,
                "type": "Bool"
              },
              "if_other_consensus_description": {
                "control": "TextBox",
                "visible_on": "if_other_consensus",
                "initial_value": "",
                "label": "request consensus description",
                "y": 4,
                "x": 0,
                "type": "String"
              },
              "if_other_final_comments":{
                "control": "TextBox",
                "initial_value": "",
                "label": "Final comments",
                "y": 5,
                "x": 0
              },
              "no_other": {
                "y": 6,
                "x": 0,
                "control": "CheckBox",
                "type": "Bool",
                "initial_value": false,
                "label": "No other IF present"
              }
            },
            "Aneurysms": {
              "aneurysms": {
                "control": "ListingWidget",
                "initial_value": null,
                "documentation": "",
                "label": "Aneurysms",
                "content": {
                  "if_aneurysm_size": {
                    "control": "NumberEdit",
                    "initial_value": "",
                    "label": "size",
                    "y": 2,
                    "x": 0,
                    "type": "Float"
                  },
                  "if_aneurysm_marker": {
                    "control": "MarkerEdit",
                    "documentation": "",
                    "max_number": 1,
                    "label": "Add Marker",
                    "marker_type": 0,
                    "y": 0,
                    "x": 0,
                    "hint_text": "",
                    "type": "Markers"
                  },
                  "if_aneurysm_consensus": {
                    "control": "CheckBox",
                    "initial_value": false,
                    "label": "request consensus",
                    "alert_on_checked": true,
                    "y": 3,
                    "x": 0,
                    "type": "Bool"
                  },
                  "if_aneurysm_consensus_description": {
                    "control": "TextBox",
                    "visible_on": "if_aneurysm_consensus",
                    "initial_value": "",
                    "label": "request consensus description",
                    "y": 4,
                    "x": 0,
                    "type": "String"
                  },
                  "if_aneurysm_final_comments":{
                    "control": "TextBox",
                    "initial_value": "",
                    "label": "Final comments",
                    "y": 5,
                    "x": 0
                  },
                  "if_aneurysm_site": {
                    "control": "ComboBox",
                    "initial_value": "",
                    "documentation": "",
                    "label": "site",
                    "y": 1,
                    "x": 0,
                    "type": "Enum",
                    "options": [
                      "Cavernous sinus",
                      "Carotid tip",
                      "Ophtalmic a.",
                      "Pericallosal a.",
                      "ACoA",
                      "PCoA left",
                      "PCoA right",
                      "ACA left",
                      "ACA right",
                      "MCA left",
                      "MCA right",
                      "PCA left",
                      "PCA right",
                      "Basilar a.",
                      "Vertebral a. left",
                      "Vertebral a. right"
                    ]
                  }
                },
                "y": 0,
                "x": 0,
                "type": "FieldDataList",
                "columns": [
                  "if_aneurysm_site",
                  "if_aneurysm_size"
                ]
              },
              "no_aneurysms": {
                "y": 1,
                "x": 0,
                "control": "CheckBox",
                "type": "Bool",
                "initial_value": false,
                "label": "No aneurysms present"
              }
            }
          },
          "y": 0,
          "x": 0,
          "type": "FieldData",
          "order": [
            "Aneurysms",
            "Tumors",
            "Cysts",
            "Other"
          ]
        }
      },
      "MB": {
        "microbleeds": {
          "control": "ListingWidget",
          "initial_value": null,
          "documentation": "",
          "label": "Microbleeds",
          "content": {
            "microbleed_marker": {
              "control": "MarkerEdit",
              "documentation": "",
              "max_number": 1,
              "label": "Add Marker",
              "marker_type": 6,
              "y": 0,
              "x": 0,
              "hint_text": "",
              "type": "Markers"
            },
            "microbleed_location": {
              "control": "ComboBox",
              "initial_value": "",
              "documentation": "White matter (periventricular, subcortical), Deep white matter (corpus callosum, capsula interna, capsula externa, capsula extrema)",
              "label": "Location",
              "y": 1,
              "x": 0,
              "type": "Enum",
              "options": [
                "Brainstem",
                "Cerebellum",
                "Caudatus",
                "Putamen",
                "Globus pallidus",
                "Thalamus",
                "White Matter",
                "Deep white matter",
                "Cortico-subcortical",
                "Hippocampus"
              ]
            },
            "microbleed_consensus": {
              "control": "CheckBox",
              "initial_value": false,
              "label": "request consensus",
              "alert_on_checked": true,
              "y": 3,
              "x": 0,
              "type": "Bool"
            },
            "microbleed_consensus_description": {
              "control": "TextBox",
              "visible_on": "microbleed_consensus",
              "initial_value": "",
              "label": "request consensus description",
              "y": 4,
              "x": 0,
              "type": "String"
            },
            "microbleed_final_comments":{
              "control": "TextBox",
              "initial_value": "",
              "label": "Final comments",
              "y": 5,
              "x": 0
            },
            "microbleed_infratentorial": {
              "control": "CheckBox",
              "initial_value": false,
              "label": "infratentorial",
              "y": 2,
              "x": 0,
              "type": "Bool"
            }
          },
          "y": 0,
          "x": 0,
          "type": "FieldDataList",
          "columns": [
            "microbleed_location"
          ]
        },
        "no_microbleeds": {
          "y": 1,
          "x": 0,
          "control": "CheckBox",
          "type": "Bool",
          "initial_value": false,
          "label": "No microbleeds present"
        }
      },
      "CI": {
        "cortical_infarcts": {
          "control": "ListingWidget",
          "initial_value": null,
          "documentation": "",
          "label": "Cortical Infarcts",
          "content": {
            "cortical_infarct_consensus": {
              "control": "CheckBox",
              "initial_value": false,
              "label": "request consensus",
              "alert_on_checked": true,
              "y": 3,
              "x": 0,
              "type": "Bool"
            },
            "cortical_infarct_consensus_description": {
              "control": "TextBox",
              "visible_on": "cortical_infarct_consensus",
              "initial_value": "",
              "label": "request consensus description",
              "y": 4,
              "x": 0,
              "type": "String"
            },
            "if_cortical_infarct_final_comments":{
              "control": "TextBox",
              "initial_value": "",
              "label": "Final comments",
              "y": 5,
              "x": 0
            },
            "cortical_infarct_size": {
              "control": "NumberEdit",
              "initial_value": "",
              "documentation": "",
              "label": "size",
              "y": 1,
              "x": 0,
              "type": "Float"
            },
            "cortical_infarct_marker": {
              "control": "MarkerEdit",
              "documentation": "",
              "max_number": 1,
              "label": "Add Marker",
              "marker_type": 3,
              "y": 0,
              "x": 0,
              "hint_text": "",
              "type": "Markers"
            },
            "cortical_infarct_location": {
              "control": "ComboBox",
              "initial_value": "",
              "documentation": "",
              "label": "site",
              "y": 2,
              "x": 0,
              "type": "Enum",
              "options": [
                "Cerebrum Right",
                "Cerebrum Left"
              ]
            }
          },
          "y": 0,
          "x": 0,
          "type": "FieldDataList",
          "columns": [
            "cortical_infarct_size",
            "cortical_infarct_location"
          ]
        },
        "no_cortical_infarcts": {
          "y": 1,
          "x": 0,
          "control": "CheckBox",
          "type": "Bool",
          "initial_value": false,
          "label": "No cortical infarcts present"
        }
      },
      "LI": {
        "lacunar_infarcts": {
          "control": "ListingWidget",
          "initial_value": null,
          "documentation": "",
          "label": "Lacunar Infarcts",
          "content": {
            "lacunar_infarct_consensus": {
              "control": "CheckBox",
              "initial_value": false,
              "label": "request consensus",
              "alert_on_checked": true,
              "y": 3,
              "x": 0,
              "type": "Bool"
            },
            "lacunar_infarct_consensus_description": {
              "control": "TextBox",
              "visible_on": "lacunar_infarct_consensus",
              "initial_value": "",
              "label": "request consensus description",
              "y": 4,
              "x": 0,
              "type": "String"
            },
            "lacunar_infarct_final_comments":{
              "control": "TextBox",
              "initial_value": "",
              "label": "Final comments",
              "y": 5,
              "x": 0
            },
            "lacunar_infarct_size": {
              "control": "NumberEdit",
              "initial_value": "",
              "documentation": "",
              "label": "size",
              "y": 1,
              "x": 0,
              "type": "Float"
            },
            "lacunar_infarct_marker": {
              "control": "MarkerEdit",
              "documentation": "",
              "max_number": 1,
              "label": "Add Marker",
              "marker_type": 5,
              "y": 0,
              "x": 0,
              "hint_text": "",
              "type": "Markers"
            },
            "lacunar_infarct_location": {
              "control": "ComboBox",
              "initial_value": "",
              "documentation": "",
              "label": "site",
              "y": 2,
              "x": 0,
              "type": "Enum",
              "options": [
                "Cerebrum Right",
                "Cerebrum Left"
              ]
            }
          },
          "y": 0,
          "x": 0,
          "type": "FieldDataList",
          "columns": [
            "lacunar_infarct_size",
            "lacunar_infarct_location"
          ]
        },
        "no_lacunar_infarcts": {
          "y": 1,
          "x": 0,
          "control": "CheckBox",
          "type": "Bool",
          "initial_value": false,
          "label": "No lacunar infarcts present"
        }
      },
      "CbI": {
        "cerebellar_infarcts": {
          "control": "ListingWidget",
          "initial_value": null,
          "documentation": "",
          "label": "Cerebellar Infarcts",
          "content": {
            "cerebellar_infarct_consensus": {
              "control": "CheckBox",
              "initial_value": false,
              "label": "request consensus",
              "alert_on_checked": true,
              "y": 3,
              "x": 0,
              "type": "Bool"
            },
            "cerebellar_infarct_consensus_description": {
              "control": "TextBox",
              "visible_on": "cerebellar_infarct_consensus",
              "initial_value": "",
              "label": "request consensus description",
              "y": 4,
              "x": 0,
              "type": "String"
            },
            "cerebellar_infarct_final_comments":{
              "control": "TextBox",
              "initial_value": "",
              "label": "Final comments",
              "y": 5,
              "x": 0
            },
            "cerebellar_infarct_size": {
              "control": "NumberEdit",
              "initial_value": "",
              "documentation": "",
              "label": "size",
              "y": 1,
              "x": 0,
              "type": "Float"
            },
            "cerebellar_infarct_marker": {
              "control": "MarkerEdit",
              "documentation": "",
              "max_number": 1,
              "label": "Add Marker",
              "marker_type": 4,
              "y": 0,
              "x": 0,
              "hint_text": "",
              "type": "Markers"
            },
            "cerebellar_infarct_location": {
              "control": "ComboBox",
              "initial_value": "",
              "documentation": "",
              "label": "site",
              "y": 2,
              "x": 0,
              "type": "Enum",
              "options": [
                "Cerebellum Right",
                "Cerebellum Left"
              ]
            }
          },
          "y": 0,
          "x": 0,
          "type": "FieldDataList",
          "columns": [
            "cerebellar_infarct_size",
            "cerebellar_infarct_location"
          ]
        },
        "no_cerebellar_infarcts": {
          "y": 1,
          "x": 0,
          "control": "CheckBox",
          "type": "Bool",
          "initial_value": false,
          "label": "No cerebellar infarcts present"
        }
      }
    },
    "y": 0,
    "x": 0,
    "type": "FieldData",
    "order": [
      "Incidental Findings",
      "CI",
      "CbI",
      "LI",
      "MB"
    ]
  },
  "flair_non_usable_checkbox": {
    "control": "CheckBox",
    "initial_value": false,
    "documentation": "",
    "label": "FLAIR not usable",
    "y": 2,
    "x": 0,
    "type": "Bool"
  },
  "flair_non_usable_checkbox": {
    "control": "CheckBox",
    "initial_value": false,
    "documentation": "",
    "label": "FLAIR not usable",
    "y": 3,
    "x": 0,
    "type": "Bool"
  },
  "t1_non_usable_checkbox": {
    "control": "CheckBox",
    "initial_value": false,
    "documentation": "",
    "label": "T1 not usable",
    "y": 1,
    "x": 0,
    "type": "Bool"
  },
  "swi_non_usable_checkbox": {
    "control": "CheckBox",
    "initial_value": false,
    "documentation": "",
    "label": "SWI not usable",
    "y": 4,
    "x": 0,
    "type": "Bool"
  }
},
"annotations": null,
"mdl_layout": "Horizontal {{ expandX=True expandY=True Vertical {{ expandX=True expandY=True {editor} Grid {{ expandX=True expandY=True {viewports} }} }} Vertical {{alignY = Top w=450 maxw=450 Grid {{ margin = 5 spacing = 2 {qa_fields} }} }} }}",
"scans": {
  "SWI": {
    "protocol": "SWI",
    "modality": "MR"
  },
  "FLAIR": {
    "protocol": "FLAIR",
    "modality": "MR"
  },
  "PD": {
    "protocol": "PD",
    "modality": "MR"
  },
  "T1": {
    "protocol": "T1W-3D",
    "modality": "MR"
  }
}
}