{
    "label": "QA-workflow",
    "states": [
      {
        "label": "untracked",
        "lifespan": 2,
        "callback": {
            "function": ""
        },
        "freetext": null
      },
      {
        "label": "Manual_QA_task",
        "lifespan": 0,
        "callback": {
            "function": "create_task",
            "task_base": "manual_qa.json",
            "task_info": {
                "project": "sandbox",
                "application_name": "ViewR",
                "application_version": "5.1.4",
                "template": "incidental_findings",
                "tags": ["health-ri", "QA", "DEMO"],
                "distribute_in_group": "quality_assurance"
            },
            "done_state": "Automated_processing",
            "progress_state": "Queued_for_manual_qa"
        },
        "freetext": null
      },
      {
        "label": "Queued_for_manual_qa",
        "lifespan": 0,
        "callback": null,
        "freetext": null
      },
      {
        "label": "QA_failed",
        "lifespan": 0,
        "callback": {
            "function": "send_mail"
        },
        "freetext": null
      },
      {
        "label": "Automated_processing",
        "lifespan": 0,
        "callback": {
          "function": "fastr",
          "network_id": "fsl_bet",
          "source_mapping": {
            "input": "/scans/6/resources/DICOM"
          },
          "sink_mapping": {
            "brain_extract": "/scans/6/resources/NIFTI/files/brainextract{ext}",
            "brain_mask": "/scans/6/resources/NIFTI/files/t1w_brainmask_fslbet{ext}"
          },
          "log_dir": "/home/fastr/.prep_logs/",
          "process_state": "Processing",
          "done_state": "Manual_QC_task",
          "failed_state": "Processing_failed"
        },
        "freetext": null
      },
      {
        "label": "Processing",
        "lifespan": 0,
        "callback": null,
        "freetext": null
      },
      {
        "label": "Processing_failed",
        "lifespan": 0,
        "callback": {
            "function": "send_mail",
            "subject": "Processing Failed",
            "body": "This is an automated email.\n Processing failed for {experiment}.\n Action url: {action_url}."
        },
        "freetext": null
      },
      {
        "label": "Manual_QC_task",
        "lifespan": 0,
        "callback": {
            "function": "create_task",
            "task_base": "manual_qc.json",
            "task_info": {
                "project": "sandbox",
                "template": "manual_qc",
                "application_name": "ViewR",
                "application_version": "5.1.4",
                "tags": ["demo", "QC", "DEMO"],
                "distribute_in_group": "quality_control"
            },
            "done_state": "Extract_Biomarkers",
            "progress_state": "Queued_for_correction"
        },
        "freetext": null
      },
      {
        "label": "Queued_for_correction",
        "lifespan": 0,
        "callback": null,
        "freetext": null
      },
      {
        "label": "Extract_Biomarkers",
        "lifespan": 0,
        "callback": {
            "function": "external_program"
        },
        "freetext": null
      },
      {
        "label": "DONE",
        "lifespan": 0,
        "callback": {
            "function": ""
        },
        "freetext": null
      }
    ],
    "transitions": [
        {
            "source": "untracked",
            "destination": "Manual_QA_task",
            "condition": null
        },
        {
            "source": "Manual_QA_task",
            "destination": "QA_failed",
            "condition": null
        },
        {
            "source": "Manual_QA_task",
            "destination": "Queued_for_manual_qa",
            "condition": null
        },
        {
            "source": "QA_failed",
            "destination": "Manual_QA_task",
            "condition": null
        },
        {
            "source": "QA_failed",
            "destination": "DONE",
            "condition": null
        },
        {
            "source": "Queued_for_manual_qa",
            "destination": "Automated_processing",
            "condition": null
        },
        {
            "source": "Automated_processing",
            "destination": "Processing_failed",
            "condition": null
        },
        {
          "source": "Processing",
          "destination": "Processing_failed",
          "condition": null
        },
        {
            "source": "Automated_processing",
            "destination": "Processing",
            "condition": null
        },
        {
            "source": "Processing_failed",
            "destination": "Automated_processing",
            "condition": null
        },
        {
            "source": "Processing_failed",
            "destination": "DONE",
            "condition": null
        },
        {
            "source": "Processing",
            "destination": "Manual_QC_task",
            "condition": null
        },
        {
            "source": "Manual_QC_task",
            "destination": "Queued_for_correction",
            "condition": null
        },
        {
            "source": "Manual_QC_task",
            "destination": "Extract_Biomarkers",
            "condition": null
        },
        {
            "source": "Queued_for_correction",
            "destination": "Extract_Biomarkers",
            "condition": null
        },
        {
            "source": "Extract_Biomarkers",
            "destination": "DONE",
            "condition": null
        }
    ]
}
