<?xml version="1.0" encoding="UTF-8" standalone="no"?>
<!DOCTYPE svg PUBLIC "-//W3C//DTD SVG 1.1//EN"
 "http://www.w3.org/Graphics/SVG/1.1/DTD/svg11.dtd">
<!-- Generated by graphviz version 2.40.1 (20161225.0304)
 -->
<!-- Title: structs Pages: 1 -->
<svg width="2351pt" height="554pt"
 viewBox="0.00 0.00 2351.00 554.00" xmlns="http://www.w3.org/2000/svg" xmlns:xlink="http://www.w3.org/1999/xlink">
<g id="graph0" class="graph" transform="scale(1 1) rotate(0) translate(4 550)">
<title>structs</title>
<polygon fill="#ffffff" stroke="transparent" points="-4,4 -4,-550 2347,-550 2347,4 -4,4"/>
<g id="clust1" class="cluster">
<title>cluster_fsl_bet__input</title>
<polygon fill="none" stroke="#999999" points="8,-452 8,-538 656,-538 656,-452 8,-452"/>
<text text-anchor="middle" x="332" y="-522.8" font-family="Times,serif" font-size="14.00" fill="#000000">input</text>
</g>
<g id="clust2" class="cluster">
<title>cluster_fsl_bet__brain_extraction</title>
<polygon fill="none" stroke="#999999" points="356,-173 356,-444 1123,-444 1123,-173 356,-173"/>
<text text-anchor="middle" x="739.5" y="-428.8" font-family="Times,serif" font-size="14.00" fill="#000000">brain_extraction</text>
</g>
<g id="clust3" class="cluster">
<title>cluster_fsl_bet__output</title>
<polygon fill="none" stroke="#999999" points="1153.5,-8 1153.5,-159 2335,-159 2335,-8 1153.5,-8"/>
<text text-anchor="middle" x="1744.25" y="-143.8" font-family="Times,serif" font-size="14.00" fill="#000000">output</text>
</g>
<!-- fsl_bet__input -->
<g id="node1" class="node">
<title>fsl_bet__input</title>
<polygon fill="#caff70" stroke="#000000" points="16,-460 16,-506 257,-506 257,-460 16,-460"/>
<text text-anchor="middle" x="136.5" y="-490.8" font-family="Times,serif" font-size="14.00" fill="#000000">input</text>
<polyline fill="none" stroke="#000000" points="16,-483 257,-483 "/>
<text text-anchor="middle" x="58.5" y="-467.8" font-family="Times,serif" font-size="14.00" fill="#000000"> </text>
<polyline fill="none" stroke="#000000" points="101,-460 101,-483 "/>
<text text-anchor="middle" x="179" y="-467.8" font-family="Times,serif" font-size="14.00" fill="#000000">output [N]</text>
</g>
<!-- fsl_bet__image_dicom_to_nifti -->
<g id="node2" class="node">
<title>fsl_bet__image_dicom_to_nifti</title>
<polygon fill="#e5e5e5" stroke="#000000" points="293,-460 293,-506 648,-506 648,-460 293,-460"/>
<text text-anchor="middle" x="470.5" y="-490.8" font-family="Times,serif" font-size="14.00" fill="#000000">image_dicom_to_nifti</text>
<polyline fill="none" stroke="#000000" points="293,-483 648,-483 "/>
<text text-anchor="middle" x="394.5" y="-467.8" font-family="Times,serif" font-size="14.00" fill="#000000">[N] dicom_image</text>
<polyline fill="none" stroke="#000000" points="496,-460 496,-483 "/>
<text text-anchor="middle" x="572" y="-467.8" font-family="Times,serif" font-size="14.00" fill="#000000">image [N]</text>
</g>
<!-- fsl_bet__input&#45;&gt;fsl_bet__image_dicom_to_nifti -->
<g id="edge1" class="edge">
<title>fsl_bet__input:o_output&#45;&gt;fsl_bet__image_dicom_to_nifti:i_dicom_image</title>
<path fill="none" stroke="#000000" d="M257,-471C269,-471 274.25,-471 282.875,-471"/>
<polygon fill="#000000" stroke="#000000" points="283,-474.5001 293,-471 283,-467.5001 283,-474.5001"/>
</g>
<!-- fsl_bet__brain_extraction -->
<g id="node5" class="node">
<title>fsl_bet__brain_extraction</title>
<polygon fill="#e5e5e5" stroke="#000000" points="684,-265 684,-357 1115,-357 1115,-265 684,-265"/>
<text text-anchor="middle" x="899.5" y="-341.8" font-family="Times,serif" font-size="14.00" fill="#000000">brain_extraction</text>
<polyline fill="none" stroke="#000000" points="684,-334 1115,-334 "/>
<text text-anchor="middle" x="805" y="-318.8" font-family="Times,serif" font-size="14.00" fill="#000000">[N] image</text>
<polyline fill="none" stroke="#000000" points="684,-311 926,-311 "/>
<text text-anchor="middle" x="805" y="-295.8" font-family="Times,serif" font-size="14.00" fill="#000000">[M] fraction_threshold</text>
<polyline fill="none" stroke="#000000" points="684,-288 926,-288 "/>
<text text-anchor="middle" x="805" y="-272.8" font-family="Times,serif" font-size="14.00" fill="#000000">[O] fraction_gradient</text>
<polyline fill="none" stroke="#000000" points="926,-265 926,-334 "/>
<text text-anchor="middle" x="1020.5" y="-295.8" font-family="Times,serif" font-size="14.00" fill="#000000">mask [NxMxO]</text>
</g>
<!-- fsl_bet__image_dicom_to_nifti&#45;&gt;fsl_bet__brain_extraction -->
<g id="edge2" class="edge">
<title>fsl_bet__image_dicom_to_nifti:o_image&#45;&gt;fsl_bet__brain_extraction:i_image</title>
<path fill="none" stroke="#000000" d="M648.5,-471C712.3122,-471 627.1233,-339.2908 674.0565,-324.3706"/>
<polygon fill="#000000" stroke="#000000" points="674.5716,-327.8328 684,-323 673.6157,-320.8984 674.5716,-327.8328"/>
</g>
<!-- fsl_bet__fraction_threshold -->
<g id="node3" class="node">
<title>fsl_bet__fraction_threshold</title>
<polygon fill="#ffbbff" stroke="#000000" points="364,-306 364,-412 577,-412 577,-306 364,-306"/>
<text text-anchor="middle" x="470.5" y="-396.8" font-family="Times,serif" font-size="14.00" fill="#000000">fraction_threshold</text>
<polyline fill="none" stroke="#000000" points="364,-389 577,-389 "/>
<text text-anchor="middle" x="470.5" y="-373.8" font-family="Times,serif" font-size="14.00" fill="#000000">[(&#39;0.2&#39;,),</text>
<text text-anchor="middle" x="470.5" y="-358.8" font-family="Times,serif" font-size="14.00" fill="#000000"> (&#39;0.35&#39;,),</text>
<text text-anchor="middle" x="470.5" y="-343.8" font-family="Times,serif" font-size="14.00" fill="#000000"> (&#39;0.5&#39;,),</text>
<text text-anchor="middle" x="470.5" y="-328.8" font-family="Times,serif" font-size="14.00" fill="#000000"> (&#39;0.65&#39;,),</text>
<text text-anchor="middle" x="470.5" y="-313.8" font-family="Times,serif" font-size="14.00" fill="#000000"> (&#39;0.8&#39;,)]</text>
</g>
<!-- fsl_bet__fraction_threshold&#45;&gt;fsl_bet__brain_extraction -->
<g id="edge3" class="edge">
<title>fsl_bet__fraction_threshold:o_output&#45;&gt;fsl_bet__brain_extraction:i_fraction_threshold</title>
<path fill="none" stroke="#000000" d="M577.5,-347C625.8696,-347 631.4871,-305.3382 674.0117,-299.6422"/>
<polygon fill="#000000" stroke="#000000" points="674.2452,-303.1346 684,-299 673.796,-296.149 674.2452,-303.1346"/>
</g>
<!-- fsl_bet__fraction_gradient -->
<g id="node4" class="node">
<title>fsl_bet__fraction_gradient</title>
<polygon fill="#ffbbff" stroke="#000000" points="368,-181 368,-287 573,-287 573,-181 368,-181"/>
<text text-anchor="middle" x="470.5" y="-271.8" font-family="Times,serif" font-size="14.00" fill="#000000">fraction_gradient</text>
<polyline fill="none" stroke="#000000" points="368,-264 573,-264 "/>
<text text-anchor="middle" x="470.5" y="-248.8" font-family="Times,serif" font-size="14.00" fill="#000000">[(&#39;&#45;0.1&#39;,),</text>
<text text-anchor="middle" x="470.5" y="-233.8" font-family="Times,serif" font-size="14.00" fill="#000000"> (&#39;&#45;0.2&#39;,),</text>
<text text-anchor="middle" x="470.5" y="-218.8" font-family="Times,serif" font-size="14.00" fill="#000000"> (&#39;0.0&#39;,),</text>
<text text-anchor="middle" x="470.5" y="-203.8" font-family="Times,serif" font-size="14.00" fill="#000000"> (&#39;0.1&#39;,),</text>
<text text-anchor="middle" x="470.5" y="-188.8" font-family="Times,serif" font-size="14.00" fill="#000000"> (&#39;0.2&#39;,)]</text>
</g>
<!-- fsl_bet__fraction_gradient&#45;&gt;fsl_bet__brain_extraction -->
<g id="edge4" class="edge">
<title>fsl_bet__fraction_gradient:o_output&#45;&gt;fsl_bet__brain_extraction:i_fraction_gradient</title>
<path fill="none" stroke="#000000" d="M573.5,-222C624.5318,-222 628.9462,-269.0663 673.7866,-275.3172"/>
<polygon fill="#000000" stroke="#000000" points="673.7888,-278.8251 684,-276 674.2558,-271.8407 673.7888,-278.8251"/>
</g>
<!-- fsl_bet__cast_brainmask -->
<g id="node10" class="node">
<title>fsl_bet__cast_brainmask</title>
<polygon fill="#e5e5e5" stroke="#000000" points="1151,-167.5 1151,-236.5 1571,-236.5 1571,-167.5 1151,-167.5"/>
<text text-anchor="middle" x="1361" y="-221.3" font-family="Times,serif" font-size="14.00" fill="#000000">cast_brainmask</text>
<polyline fill="none" stroke="#000000" points="1151,-213.5 1571,-213.5 "/>
<text text-anchor="middle" x="1263.5" y="-198.3" font-family="Times,serif" font-size="14.00" fill="#000000">[NxMxO] image</text>
<polyline fill="none" stroke="#000000" points="1151,-190.5 1376,-190.5 "/>
<text text-anchor="middle" x="1263.5" y="-175.3" font-family="Times,serif" font-size="14.00" fill="#000000">[R] component_type</text>
<polyline fill="none" stroke="#000000" points="1376,-167.5 1376,-213.5 "/>
<text text-anchor="middle" x="1473.5" y="-186.8" font-family="Times,serif" font-size="14.00" fill="#000000">image [NxMxO]</text>
</g>
<!-- fsl_bet__brain_extraction&#45;&gt;fsl_bet__cast_brainmask -->
<g id="edge5" class="edge">
<title>fsl_bet__brain_extraction:o_mask&#45;&gt;fsl_bet__cast_brainmask:i_image</title>
<path fill="none" stroke="#000000" d="M1115.5,-299C1157.2831,-299 1114.3864,-218.6467 1140.9536,-204.2082"/>
<polygon fill="#000000" stroke="#000000" points="1141.9846,-207.5653 1151,-202 1140.4817,-200.7285 1141.9846,-207.5653"/>
</g>
<!-- fsl_bet__combine_masks -->
<g id="node6" class="node">
<title>fsl_bet__combine_masks</title>
<polygon fill="#e5e5e5" stroke="#000000" points="1607,-35 1607,-127 2060,-127 2060,-35 1607,-35"/>
<text text-anchor="middle" x="1833.5" y="-111.8" font-family="Times,serif" font-size="14.00" fill="#000000">combine_masks</text>
<polyline fill="none" stroke="#000000" points="1607,-104 2060,-104 "/>
<text text-anchor="middle" x="1728.5" y="-88.8" font-family="Times,serif" font-size="14.00" fill="#000000">[N] images</text>
<polyline fill="none" stroke="#000000" points="1607,-81 1850,-81 "/>
<text text-anchor="middle" x="1728.5" y="-65.8" font-family="Times,serif" font-size="14.00" fill="#000000">[P] method</text>
<polyline fill="none" stroke="#000000" points="1607,-58 1850,-58 "/>
<text text-anchor="middle" x="1728.5" y="-42.8" font-family="Times,serif" font-size="14.00" fill="#000000">[Q] number_of_classes</text>
<polyline fill="none" stroke="#000000" points="1850,-35 1850,-104 "/>
<text text-anchor="middle" x="1955" y="-65.8" font-family="Times,serif" font-size="14.00" fill="#000000">hard_segment [N]</text>
</g>
<!-- fsl_bet__brain_mask -->
<g id="node9" class="node">
<title>fsl_bet__brain_mask</title>
<polygon fill="#b0e2ff" stroke="#000000" points="2096,-58 2096,-104 2327,-104 2327,-58 2096,-58"/>
<text text-anchor="middle" x="2211.5" y="-88.8" font-family="Times,serif" font-size="14.00" fill="#000000">brain_mask</text>
<polyline fill="none" stroke="#000000" points="2096,-81 2327,-81 "/>
<text text-anchor="middle" x="2169" y="-65.8" font-family="Times,serif" font-size="14.00" fill="#000000">[N] input</text>
<polyline fill="none" stroke="#000000" points="2242,-58 2242,-81 "/>
<text text-anchor="middle" x="2284.5" y="-65.8" font-family="Times,serif" font-size="14.00" fill="#000000"> </text>
</g>
<!-- fsl_bet__combine_masks&#45;&gt;fsl_bet__brain_mask -->
<g id="edge10" class="edge">
<title>fsl_bet__combine_masks:o_hard_segment&#45;&gt;fsl_bet__brain_mask:i_input</title>
<path fill="none" stroke="#000000" d="M2060,-69C2072,-69 2077.25,-69 2085.875,-69"/>
<polygon fill="#000000" stroke="#000000" points="2086,-72.5001 2096,-69 2086,-65.5001 2086,-72.5001"/>
</g>
<!-- fsl_bet__const__combine_masks__method -->
<g id="node7" class="node">
<title>fsl_bet__const__combine_masks__method</title>
<polygon fill="#ffbbff" stroke="#000000" points="1202,-81 1202,-127 1520,-127 1520,-81 1202,-81"/>
<text text-anchor="middle" x="1361" y="-111.8" font-family="Times,serif" font-size="14.00" fill="#000000">const__combine_masks__method</text>
<polyline fill="none" stroke="#000000" points="1202,-104 1520,-104 "/>
<text text-anchor="middle" x="1361" y="-88.8" font-family="Times,serif" font-size="14.00" fill="#000000">[(&#39;VOTE&#39;,)]</text>
</g>
<!-- fsl_bet__const__combine_masks__method&#45;&gt;fsl_bet__combine_masks -->
<g id="edge8" class="edge">
<title>fsl_bet__const__combine_masks__method:o_output&#45;&gt;fsl_bet__combine_masks:i_method</title>
<path fill="none" stroke="#000000" d="M1520,-92C1556.4018,-92 1565.4791,-72.9472 1596.971,-69.5236"/>
<polygon fill="#000000" stroke="#000000" points="1597.1961,-73.0167 1607,-69 1596.8311,-66.0262 1597.1961,-73.0167"/>
</g>
<!-- fsl_bet__const__combine_masks__number_of_classes -->
<g id="node8" class="node">
<title>fsl_bet__const__combine_masks__number_of_classes</title>
<polygon fill="#ffbbff" stroke="#000000" points="1161.5,-16 1161.5,-62 1560.5,-62 1560.5,-16 1161.5,-16"/>
<text text-anchor="middle" x="1361" y="-46.8" font-family="Times,serif" font-size="14.00" fill="#000000">const__combine_masks__number_of_classes</text>
<polyline fill="none" stroke="#000000" points="1161.5,-39 1560.5,-39 "/>
<text text-anchor="middle" x="1361" y="-23.8" font-family="Times,serif" font-size="14.00" fill="#000000">[(&#39;2&#39;,)]</text>
</g>
<!-- fsl_bet__const__combine_masks__number_of_classes&#45;&gt;fsl_bet__combine_masks -->
<g id="edge9" class="edge">
<title>fsl_bet__const__combine_masks__number_of_classes:o_output&#45;&gt;fsl_bet__combine_masks:i_number_of_classes</title>
<path fill="none" stroke="#000000" d="M1561,-27C1579.1451,-27 1583.5902,-39.7853 1596.8119,-44.3801"/>
<polygon fill="#000000" stroke="#000000" points="1596.5744,-47.8862 1607,-46 1597.6737,-40.973 1596.5744,-47.8862"/>
</g>
<!-- fsl_bet__cast_brainmask&#45;&gt;fsl_bet__combine_masks -->
<g id="edge7" class="edge">
<title>fsl_bet__cast_brainmask:o_image&#45;&gt;fsl_bet__combine_masks:i_images</title>
<path fill="none" stroke="#0000ff" stroke-width="3" d="M1571,-190C1612.853,-190 1570.2495,-109.6467 1596.9268,-95.2082"/>
<polygon fill="#0000ff" stroke="#0000ff" stroke-width="3" points="1597.9814,-98.5602 1607,-93 1596.4825,-91.7226 1597.9814,-98.5602"/>
</g>
<!-- fsl_bet__const__cast_brainmask__component_type -->
<g id="node11" class="node">
<title>fsl_bet__const__cast_brainmask__component_type</title>
<polygon fill="#ffbbff" stroke="#000000" points="709,-119 709,-165 1090,-165 1090,-119 709,-119"/>
<text text-anchor="middle" x="899.5" y="-149.8" font-family="Times,serif" font-size="14.00" fill="#000000">const__cast_brainmask__component_type</text>
<polyline fill="none" stroke="#000000" points="709,-142 1090,-142 "/>
<text text-anchor="middle" x="899.5" y="-126.8" font-family="Times,serif" font-size="14.00" fill="#000000">[(&#39;unsigned_char&#39;,)]</text>
</g>
<!-- fsl_bet__const__cast_brainmask__component_type&#45;&gt;fsl_bet__cast_brainmask -->
<g id="edge6" class="edge">
<title>fsl_bet__const__cast_brainmask__component_type:o_output&#45;&gt;fsl_bet__cast_brainmask:i_component_type</title>
<path fill="none" stroke="#000000" d="M1090.5,-130C1121.3172,-130 1117.7841,-168.8674 1141.0871,-177.3697"/>
<polygon fill="#000000" stroke="#000000" points="1140.5645,-180.8307 1151,-179 1141.7006,-173.9235 1140.5645,-180.8307"/>
</g>
</g>
</svg>
