{
  "link_number": 1, 
  "nodelist": [
    {
      "merge_dimensions": "none", 
      "inputs": [], 
      "required_cores": null, 
      "outputs": [
        {
          "datatype": "Int", 
          "suboutputs": [], 
          "preferred_types": [], 
          "id": "output"
        }
      ], 
      "tool": [
        "fastr.Source", 
        "1.0"
      ], 
      "required_time": null, 
      "class": "SourceNode", 
      "required_memory": null, 
      "id": "source"
    }, 
    {
      "merge_dimensions": "none", 
      "inputs": [
        {
          "datatype": "Int", 
          "input_group": "default", 
          "id": "input"
        }
      ], 
      "required_cores": null, 
      "outputs": [], 
      "tool": [
        "fastr.Sink", 
        "1.0"
      ], 
      "required_time": null, 
      "class": "SinkNode", 
      "required_memory": null, 
      "url": null, 
      "id": "sink"
    }
  ], 
  "description": "", 
  "stepids": {}, 
  "id": "source_sink", 
  "preferred_types": [], 
  "nodegroups": {
    "source": [
      "source"
    ]
  }, 
  "namespace": null, 
  "filename": null, 
  "linklist": [
    {
      "expand": false, 
      "source": "fastr:///networks/source_sink/nodelist/source/outputs/output", 
      "id": "link_0", 
      "collapse": [], 
      "target": "fastr:///networks/source_sink/nodelist/sink/inputs/input/0"
    }
  ], 
  "version": "0.0", 
  "node_number": 2
}