{
  "id": "advanced_linking",
  "version": "0.0",
  "filename": "/home/hachterberg/dev/fastr/fastr/fastr/api/__init__.py",
  "description": "",
  "link_number": 10,
  "node_number": 10,
  "nodelist": [
    {
      "id": "source",
      "nodegroup": null,
      "class": "SourceNode",
      "inputs": [],
      "outputs": [
        {
          "id": "output",
          "datatype": "Int",
          "suboutputs": [],
          "preferred_types": []
        }
      ],
      "tool": [
        "fastr.Source",
        "1.0"
      ],
      "resources": {
        "cores": 1,
        "memory": 2048,
        "time": 3600
      },
      "merge_dimensions": "none"
    },
    {
      "id": "constant",
      "nodegroup": null,
      "class": "ConstantNode",
      "inputs": [],
      "outputs": [
        {
          "id": "output",
          "datatype": "Int",
          "suboutputs": [],
          "preferred_types": []
        }
      ],
      "tool": [
        "fastr.Source",
        "1.0"
      ],
      "resources": {
        "cores": 1,
        "memory": 2048,
        "time": 3600
      },
      "merge_dimensions": "none",
      "data": [
        [
          [
            "id_0"
          ],
          [
            "1"
          ]
        ],
        [
          [
            "id_1"
          ],
          [
            "2"
          ]
        ],
        [
          [
            "id_2"
          ],
          [
            "3"
          ]
        ],
        [
          [
            "id_3"
          ],
          [
            "4"
          ]
        ],
        [
          [
            "id_4"
          ],
          [
            "5"
          ]
        ]
      ]
    },
    {
      "id": "add1",
      "nodegroup": null,
      "class": "Node",
      "inputs": [
        {
          "id": "left_hand",
          "datatype": "Int",
          "input_group": "default"
        },
        {
          "id": "right_hand",
          "datatype": "Int",
          "input_group": "default"
        }
      ],
      "outputs": [
        {
          "id": "result",
          "datatype": "Int",
          "suboutputs": [],
          "preferred_types": []
        }
      ],
      "tool": [
        "fastr.math.AddInt",
        "0.1"
      ],
      "resources": {
        "cores": 1,
        "memory": 2048,
        "time": 3600
      },
      "merge_dimensions": "none"
    },
    {
      "id": "add2",
      "nodegroup": null,
      "class": "Node",
      "inputs": [
        {
          "id": "left_hand",
          "datatype": "Int",
          "input_group": "default"
        },
        {
          "id": "right_hand",
          "datatype": "Int",
          "input_group": "default"
        }
      ],
      "outputs": [
        {
          "id": "result",
          "datatype": "Int",
          "suboutputs": [],
          "preferred_types": []
        }
      ],
      "tool": [
        "fastr.math.AddInt",
        "0.1"
      ],
      "resources": {
        "cores": 1,
        "memory": 2048,
        "time": 3600
      },
      "merge_dimensions": "none"
    },
    {
      "id": "const_add2_left_hand_1",
      "nodegroup": null,
      "class": "ConstantNode",
      "inputs": [],
      "outputs": [
        {
          "id": "output",
          "datatype": "Int",
          "suboutputs": [],
          "preferred_types": []
        }
      ],
      "tool": [
        "fastr.Source",
        "1.0"
      ],
      "resources": {
        "cores": 1,
        "memory": 2048,
        "time": 3600
      },
      "merge_dimensions": "none",
      "data": [
        [
          [
            "id_0"
          ],
          [
            "10",
            "11"
          ]
        ]
      ]
    },
    {
      "id": "const_add2_left_hand_3",
      "nodegroup": null,
      "class": "ConstantNode",
      "inputs": [],
      "outputs": [
        {
          "id": "output",
          "datatype": "Int",
          "suboutputs": [],
          "preferred_types": []
        }
      ],
      "tool": [
        "fastr.Source",
        "1.0"
      ],
      "resources": {
        "cores": 1,
        "memory": 2048,
        "time": 3600
      },
      "merge_dimensions": "none",
      "data": [
        [
          [
            "id_0"
          ],
          [
            "6",
            "7",
            "8"
          ]
        ]
      ]
    },
    {
      "id": "const_add1_right_hand_0",
      "nodegroup": null,
      "class": "ConstantNode",
      "inputs": [],
      "outputs": [
        {
          "id": "output",
          "datatype": "Int",
          "suboutputs": [],
          "preferred_types": []
        }
      ],
      "tool": [
        "fastr.Source",
        "1.0"
      ],
      "resources": {
        "cores": 1,
        "memory": 2048,
        "time": 3600
      },
      "merge_dimensions": "none",
      "data": [
        [
          [
            "id_0"
          ],
          [
            "10",
            "11"
          ]
        ]
      ]
    },
    {
      "id": "const_add2_right_hand_0",
      "nodegroup": null,
      "class": "ConstantNode",
      "inputs": [],
      "outputs": [
        {
          "id": "output",
          "datatype": "Int",
          "suboutputs": [],
          "preferred_types": []
        }
      ],
      "tool": [
        "fastr.Source",
        "1.0"
      ],
      "resources": {
        "cores": 1,
        "memory": 2048,
        "time": 3600
      },
      "merge_dimensions": "none",
      "data": [
        [
          [
            "id_0"
          ],
          [
            "25",
            "26",
            "27",
            "28",
            "29",
            "30",
            "31"
          ]
        ]
      ]
    },
    {
      "id": "sink1",
      "nodegroup": null,
      "class": "SinkNode",
      "inputs": [
        {
          "id": "input",
          "datatype": "Int",
          "input_group": "default"
        }
      ],
      "outputs": [],
      "tool": [
        "fastr.Sink",
        "1.0"
      ],
      "resources": {
        "cores": 1,
        "memory": 2048,
        "time": 3600
      },
      "merge_dimensions": "none",
      "url": null
    },
    {
      "id": "sink2",
      "nodegroup": null,
      "class": "SinkNode",
      "inputs": [
        {
          "id": "input",
          "datatype": "Int",
          "input_group": "default"
        }
      ],
      "outputs": [],
      "tool": [
        "fastr.Sink",
        "1.0"
      ],
      "resources": {
        "cores": 1,
        "memory": 2048,
        "time": 3600
      },
      "merge_dimensions": "none",
      "url": null
    }
  ],
  "linklist": [
    {
      "id": "link_0",
      "source": "fastr:///networks/advanced_linking/0.0/nodelist/source/outputs/output",
      "target": "fastr:///networks/advanced_linking/0.0/nodelist/add1/inputs/left_hand/0",
      "collapse": [],
      "expand": false
    },
    {
      "id": "link_1",
      "source": "fastr:///networks/advanced_linking/0.0/nodelist/constant/outputs/output",
      "target": "fastr:///networks/advanced_linking/0.0/nodelist/add1/inputs/left_hand/1",
      "collapse": [],
      "expand": false
    },
    {
      "id": "link_2",
      "source": "fastr:///networks/advanced_linking/0.0/nodelist/source/outputs/output",
      "target": "fastr:///networks/advanced_linking/0.0/nodelist/add2/inputs/left_hand/0",
      "collapse": [],
      "expand": false
    },
    {
      "id": "link_3",
      "source": "fastr:///networks/advanced_linking/0.0/nodelist/const_add2_left_hand_1/outputs/output",
      "target": "fastr:///networks/advanced_linking/0.0/nodelist/add2/inputs/left_hand/1",
      "collapse": [],
      "expand": false
    },
    {
      "id": "link_4",
      "source": "fastr:///networks/advanced_linking/0.0/nodelist/constant/outputs/output",
      "target": "fastr:///networks/advanced_linking/0.0/nodelist/add2/inputs/left_hand/2",
      "collapse": [],
      "expand": false
    },
    {
      "id": "link_5",
      "source": "fastr:///networks/advanced_linking/0.0/nodelist/const_add2_left_hand_3/outputs/output",
      "target": "fastr:///networks/advanced_linking/0.0/nodelist/add2/inputs/left_hand/3",
      "collapse": [],
      "expand": false
    },
    {
      "id": "link_6",
      "source": "fastr:///networks/advanced_linking/0.0/nodelist/const_add1_right_hand_0/outputs/output",
      "target": "fastr:///networks/advanced_linking/0.0/nodelist/add1/inputs/right_hand/0",
      "collapse": [],
      "expand": false
    },
    {
      "id": "link_7",
      "source": "fastr:///networks/advanced_linking/0.0/nodelist/const_add2_right_hand_0/outputs/output",
      "target": "fastr:///networks/advanced_linking/0.0/nodelist/add2/inputs/right_hand/0",
      "collapse": [],
      "expand": false
    },
    {
      "id": "link_8",
      "source": "fastr:///networks/advanced_linking/0.0/nodelist/add1/outputs/result",
      "target": "fastr:///networks/advanced_linking/0.0/nodelist/sink1/inputs/input/0",
      "collapse": [],
      "expand": false
    },
    {
      "id": "link_9",
      "source": "fastr:///networks/advanced_linking/0.0/nodelist/add2/outputs/result",
      "target": "fastr:///networks/advanced_linking/0.0/nodelist/sink2/inputs/input/0",
      "collapse": [],
      "expand": false
    }
  ],
  "preferred_types": [],
  "stepids": {},
  "namespace": null
}