%YAML 1.1
%TAG !u! tag:unity3d.com,2011:
--- !u!114 &11400000
MonoBehaviour:
  m_ObjectHideFlags: 0
  m_CorrespondingSourceObject: {fileID: 0}
  m_PrefabInstance: {fileID: 0}
  m_PrefabAsset: {fileID: 0}
  m_GameObject: {fileID: 0}
  m_Enabled: 1
  m_EditorHideFlags: 0
  m_Script: {fileID: 11500000, guid: 1f18fec9b55c4f818e284af454161962, type: 3}
  m_Name: VuforiaMainMenuMRSpeechCommandsProfile
  m_EditorClassIdentifier: 
  isCustomProfile: 1
  startBehavior: 0
  recognitionConfidenceLevel: 1
  speechCommands:
  - localizationKey: 
    keyword: Hide Hand
    keyCode: 107
    action:
      id: 0
      description: None
      axisConstraint: 0
  - localizationKey: 
    keyword: Show Hand
    keyCode: 108
    action:
      id: 0
      description: None
      axisConstraint: 0
  - localizationKey: 
    keyword: Point
    keyCode: 0
    action:
      id: 0
      description: Navigation Action
      axisConstraint: 0
