%YAML 1.1
%TAG !u! tag:unity3d.com,2011:
--- !u!1045 &1
EditorBuildSettings:
  m_ObjectHideFlags: 0
  serializedVersion: 2
  m_Scenes:
  - enabled: 0
    path: Assets/SampleResources/Scenes/0-Menu.unity
    guid: 72a81fd0bdedaf0448e6c17d1e8fcb86
  - enabled: 0
    path: Assets/SampleResources/Scenes/1-ImageTargets.unity
    guid: 03ddc4184641b534487cecd6dab620df
  - enabled: 0
    path: Assets/SampleResources/Scenes/1-VuMarks.unity
    guid: d9b53b25a285640cf8ac170a80603e34
  - enabled: 0
    path: Assets/SampleResources/Scenes/1-ModelTargets.unity
    guid: 530386685ba085242832bd5cc78d7222
  - enabled: 1
    path: Assets/Emir/Scenes/Main.unity
    guid: 0e1fe732248fe1349b27ff337919a893
  m_configObjects: {}
